<?xml version="1.0" encoding="UTF-8"?>
<svg width="16px" height="15px" viewBox="0 0 16 15" version="1.1" xmlns="http://www.w3.org/2000/svg" xmlns:xlink="http://www.w3.org/1999/xlink">
    <!-- Generator: Sketch 51.3 (57544) - http://www.bohemiancoding.com/sketch -->
    <title>icons/grey/send@2x</title>
    <desc>Created with Sketch.</desc>
    <defs></defs>
    <g id="Page-1" stroke="none" stroke-width="1" fill="none" fill-rule="evenodd">
        <g id="Icons" transform="translate(-76.000000, -142.000000)">
            <g id="Group-4" transform="translate(74.000000, 139.000000)">
                <g id="icons/grey/send">
                    <g id="send-24px">
                        <polygon id="Shape" points="0 0 20 0 20 20 0 20"></polygon>
                        <path d="M2.83333333,17 L17.375,10.7666667 C18.05,10.475 18.05,9.525 17.375,9.23333333 L2.83333333,3 C2.28333333,2.75833333 1.675,3.16666667 1.675,3.75833333 L1.66666667,7.6 C1.66666667,8.01666667 1.975,8.375 2.39166667,8.425 L14.1666667,10 L2.39166667,11.5666667 C1.975,11.625 1.66666667,11.9833333 1.66666667,12.4 L1.675,16.2416667 C1.675,16.8333333 2.28333333,17.2416667 2.83333333,17 Z" id="Shape" fill="#F99D1E" fill-rule="nonzero"></path>
                    </g>
                </g>
            </g>
        </g>
    </g>
</svg>