{"send_data":"bandymas"}
{"send_data":"bandymas"}
{"send_data":"bandymas"}
{"send_data":"send_stop"}
{"send_data":"send_stop"}
{"send_data":"send_start"}
Thu Mar  9 13:43:03 2023
||{"send_data":"send_start"}
Thu Mar  9 13:44:57||{"send_data":"send_start"}
Thu Mar  9 14:15:08||{"send_data":"send_start"}
Thu Mar  9 14:15:25||{"send_data":"send_start"}
Thu Mar  9 14:19:47||{"send_data":"send_start"}
Thu Mar  9 14:20:48||{"send_data":"send_stop"}
Thu Mar  9 15:09:29||{}
Thu Mar  9 15:11:41||{}
Thu Mar  9 15:12:09||{"send_data":"asd"}
Thu Mar  9 15:42:55||(null)
Thu Mar  9 15:43:42||(null)
