Nom,Age,Sexe,IMC
Personne Lucie,63,Masculin,[23.7810732  39.64423412 15.32011165]
Personne Emma,7,Féminin,[16.89299703 18.39012694 15.95719928]
Personne Chloe,51,Féminin,[27.37040532 26.20093943 27.38625237]
Personne Lea,21,Masculin,[10.89189631 15.76252064 11.49279216]
Personne Ines,21,Féminin,[49.25163191 24.11417118 21.74325568]
Personne Nathan,41,Masculin,[46.04871765 28.07134082 22.10258657]
Personne Maxime,7,Masculin,[16.10131412 13.52425521  6.73377399]
Personne Thomas,22,Féminin,[11.41901576 11.40462469 18.79074882]
Personne Paul,13,Féminin,[17.36336339 12.96655667  8.99479316]
Personne Mathis,27,Masculin,[ 7.59161272  8.46462818 12.80826703]
