<svg width="22" height="21" viewBox="0 0 22 21" fill="none" xmlns="http://www.w3.org/2000/svg">
<path d="M11.5 20.2455V10.1741L20.0714 7.05357V15.5714L11.5 20.2455ZM10.6429 8.66071L1.29464 5.25893L10.6429 1.85714L19.9911 5.25893L10.6429 8.66071ZM21.7857 5.28571C21.7857 4.5625 21.3304 3.91964 20.6607 3.67857L11.2321 0.249999C11.0446 0.183035 10.8438 0.142856 10.6429 0.142856C10.442 0.142856 10.2411 0.183035 10.0536 0.249999L0.625 3.67857C-0.0446429 3.91964 -0.5 4.5625 -0.5 5.28571V15.5714C-0.5 16.2009 -0.151786 16.7768 0.397321 17.0714L9.82589 22.2143C10.0804 22.3616 10.3616 22.4286 10.6429 22.4286C10.9241 22.4286 11.2054 22.3616 11.4598 22.2143L20.8884 17.0714C21.4375 16.7768 21.7857 16.2009 21.7857 15.5714V5.28571Z" fill="#848484"/>
</svg>
