{
	product1: product178,
	product2: product355,
	product3: product751,
	frequency: 3,
	period: 1900-09-21 00:00:00.0-4900-09-21 00:00:00.0
}
{
	product1: product48,
	product2: product69,
	product3: product435,
	frequency: 3,
	period: 1900-09-21 00:00:00.0-4900-09-21 00:00:00.0
}
{
	product1: product398,
	product2: product742,
	product3: product914,
	frequency: 3,
	period: 1900-09-21 00:00:00.0-4900-09-21 00:00:00.0
}
{
	product1: product326,
	product2: product340,
	product3: product873,
	frequency: 3,
	period: 1900-09-21 00:00:00.0-4900-09-21 00:00:00.0
}
{
	product1: product425,
	product2: product769,
	product3: product895,
	frequency: 3,
	period: 1900-09-21 00:00:00.0-4900-09-21 00:00:00.0
}
{
	product1: product575,
	product2: product680,
	product3: product831,
	frequency: 3,
	period: 1900-09-21 00:00:00.0-4900-09-21 00:00:00.0
}
{
	product1: product21,
	product2: product87,
	product3: product522,
	frequency: 3,
	period: 1900-09-21 00:00:00.0-4900-09-21 00:00:00.0
}
{
	product1: product34,
	product2: product604,
	product3: product845,
	frequency: 3,
	period: 1900-09-21 00:00:00.0-4900-09-21 00:00:00.0
}
{
	product1: product427,
	product2: product673,
	product3: product764,
	frequency: 3,
	period: 1900-09-21 00:00:00.0-4900-09-21 00:00:00.0
}
{
	product1: product139,
	product2: product408,
	product3: product522,
	frequency: 3,
	period: 1900-09-21 00:00:00.0-4900-09-21 00:00:00.0
}
