{
	product: product798
	sum: 6623
}
{
	product: product466
	sum: 6542
}
{
	product: product707
	sum: 6510
}
{
	product: product765
	sum: 6498
}
{
	product: product804
	sum: 6477
}
{
	product: product794
	sum: 6453
}
{
	product: product491
	sum: 6394
}
{
	product: product456
	sum: 6384
}
{
	product: product778
	sum: 6279
}
{
	product: product4
	sum: 6269
}
{
	product: product431
	sum: 6232
}
{
	product: product76
	sum: 6209
}
{
	product: product194
	sum: 6204
}
{
	product: product391
	sum: 6199
}
{
	product: product596
	sum: 6184
}
{
	product: product683
	sum: 6177
}
{
	product: product691
	sum: 6161
}
{
	product: product421
	sum: 6143
}
{
	product: product333
	sum: 6117
}
{
	product: product627
	sum: 6078
}
{
	product: product173
	sum: 6047
}
{
	product: product705
	sum: 6037
}
{
	product: product661
	sum: 6036
}
{
	product: product887
	sum: 6017
}
{
	product: product853
	sum: 6007
}
{
	product: product312
	sum: 6001
}
{
	product: product47
	sum: 5977
}
{
	product: product57
	sum: 5976
}
{
	product: product992
	sum: 5975
}
{
	product: product424
	sum: 5961
}
{
	product: product146
	sum: 5960
}
{
	product: product824
	sum: 5956
}
{
	product: product345
	sum: 5952
}
{
	product: product320
	sum: 5945
}
{
	product: product165
	sum: 5945
}
{
	product: product673
	sum: 5927
}
{
	product: product319
	sum: 5926
}
{
	product: product731
	sum: 5924
}
{
	product: product392
	sum: 5922
}
{
	product: product886
	sum: 5918
}
{
	product: product681
	sum: 5917
}
{
	product: product486
	sum: 5888
}
{
	product: product237
	sum: 5876
}
{
	product: product993
	sum: 5861
}
{
	product: product761
	sum: 5857
}
{
	product: product975
	sum: 5854
}
{
	product: product851
	sum: 5854
}
{
	product: product871
	sum: 5852
}
{
	product: product254
	sum: 5833
}
{
	product: product408
	sum: 5817
}
{
	product: product330
	sum: 5808
}
{
	product: product792
	sum: 5802
}
{
	product: product88
	sum: 5800
}
{
	product: product569
	sum: 5798
}
{
	product: product918
	sum: 5785
}
{
	product: product157
	sum: 5779
}
{
	product: product274
	sum: 5774
}
{
	product: product48
	sum: 5754
}
{
	product: product141
	sum: 5752
}
{
	product: product443
	sum: 5749
}
{
	product: product480
	sum: 5747
}
{
	product: product248
	sum: 5746
}
{
	product: product280
	sum: 5738
}
{
	product: product73
	sum: 5737
}
{
	product: product894
	sum: 5737
}
{
	product: product955
	sum: 5735
}
{
	product: product515
	sum: 5735
}
{
	product: product973
	sum: 5733
}
{
	product: product444
	sum: 5733
}
{
	product: product328
	sum: 5728
}
{
	product: product402
	sum: 5728
}
{
	product: product281
	sum: 5721
}
{
	product: product308
	sum: 5716
}
{
	product: product640
	sum: 5709
}
{
	product: product178
	sum: 5709
}
{
	product: product352
	sum: 5701
}
{
	product: product570
	sum: 5696
}
{
	product: product951
	sum: 5696
}
{
	product: product965
	sum: 5693
}
{
	product: product972
	sum: 5690
}
{
	product: product325
	sum: 5689
}
{
	product: product266
	sum: 5682
}
{
	product: product516
	sum: 5677
}
{
	product: product790
	sum: 5675
}
{
	product: product838
	sum: 5670
}
{
	product: product510
	sum: 5669
}
{
	product: product576
	sum: 5659
}
{
	product: product738
	sum: 5656
}
{
	product: product318
	sum: 5654
}
{
	product: product981
	sum: 5652
}
{
	product: product873
	sum: 5651
}
{
	product: product206
	sum: 5648
}
{
	product: product924
	sum: 5648
}
{
	product: product75
	sum: 5647
}
{
	product: product502
	sum: 5640
}
{
	product: product62
	sum: 5639
}
{
	product: product26
	sum: 5636
}
{
	product: product996
	sum: 5632
}
{
	product: product942
	sum: 5628
}
{
	product: product939
	sum: 5627
}
{
	product: product805
	sum: 5625
}
{
	product: product0
	sum: 5623
}
{
	product: product629
	sum: 5617
}
{
	product: product10
	sum: 5615
}
{
	product: product21
	sum: 5612
}
{
	product: product470
	sum: 5610
}
{
	product: product66
	sum: 5610
}
{
	product: product133
	sum: 5610
}
{
	product: product353
	sum: 5608
}
{
	product: product122
	sum: 5608
}
{
	product: product630
	sum: 5608
}
{
	product: product895
	sum: 5607
}
{
	product: product687
	sum: 5607
}
{
	product: product915
	sum: 5605
}
{
	product: product696
	sum: 5601
}
{
	product: product914
	sum: 5595
}
{
	product: product812
	sum: 5590
}
{
	product: product836
	sum: 5590
}
{
	product: product900
	sum: 5588
}
{
	product: product80
	sum: 5587
}
{
	product: product919
	sum: 5586
}
{
	product: product820
	sum: 5585
}
{
	product: product678
	sum: 5585
}
{
	product: product913
	sum: 5583
}
{
	product: product957
	sum: 5583
}
{
	product: product967
	sum: 5581
}
{
	product: product93
	sum: 5579
}
{
	product: product628
	sum: 5579
}
{
	product: product986
	sum: 5576
}
{
	product: product475
	sum: 5576
}
{
	product: product154
	sum: 5575
}
{
	product: product199
	sum: 5572
}
{
	product: product734
	sum: 5568
}
{
	product: product260
	sum: 5566
}
{
	product: product362
	sum: 5559
}
{
	product: product828
	sum: 5556
}
{
	product: product733
	sum: 5554
}
{
	product: product463
	sum: 5549
}
{
	product: product136
	sum: 5548
}
{
	product: product669
	sum: 5548
}
{
	product: product264
	sum: 5544
}
{
	product: product18
	sum: 5543
}
{
	product: product169
	sum: 5542
}
{
	product: product922
	sum: 5537
}
{
	product: product898
	sum: 5536
}
{
	product: product168
	sum: 5533
}
{
	product: product164
	sum: 5532
}
{
	product: product499
	sum: 5525
}
{
	product: product209
	sum: 5524
}
{
	product: product713
	sum: 5519
}
{
	product: product877
	sum: 5518
}
{
	product: product210
	sum: 5516
}
{
	product: product759
	sum: 5514
}
{
	product: product245
	sum: 5505
}
{
	product: product342
	sum: 5499
}
{
	product: product350
	sum: 5499
}
{
	product: product172
	sum: 5499
}
{
	product: product542
	sum: 5495
}
{
	product: product635
	sum: 5490
}
{
	product: product285
	sum: 5489
}
{
	product: product581
	sum: 5488
}
{
	product: product789
	sum: 5486
}
{
	product: product736
	sum: 5478
}
{
	product: product746
	sum: 5478
}
{
	product: product783
	sum: 5476
}
{
	product: product619
	sum: 5476
}
{
	product: product692
	sum: 5473
}
{
	product: product709
	sum: 5469
}
{
	product: product953
	sum: 5468
}
{
	product: product434
	sum: 5463
}
{
	product: product841
	sum: 5463
}
{
	product: product564
	sum: 5463
}
{
	product: product551
	sum: 5462
}
{
	product: product30
	sum: 5459
}
{
	product: product818
	sum: 5458
}
{
	product: product17
	sum: 5458
}
{
	product: product749
	sum: 5456
}
{
	product: product834
	sum: 5455
}
{
	product: product966
	sum: 5453
}
{
	product: product806
	sum: 5452
}
{
	product: product279
	sum: 5448
}
{
	product: product163
	sum: 5448
}
{
	product: product654
	sum: 5441
}
{
	product: product611
	sum: 5440
}
{
	product: product14
	sum: 5440
}
{
	product: product22
	sum: 5433
}
{
	product: product81
	sum: 5428
}
{
	product: product560
	sum: 5427
}
{
	product: product143
	sum: 5427
}
{
	product: product472
	sum: 5421
}
{
	product: product888
	sum: 5421
}
{
	product: product998
	sum: 5419
}
{
	product: product386
	sum: 5417
}
{
	product: product365
	sum: 5415
}
{
	product: product932
	sum: 5415
}
{
	product: product671
	sum: 5414
}
{
	product: product310
	sum: 5414
}
{
	product: product702
	sum: 5412
}
{
	product: product364
	sum: 5408
}
{
	product: product2
	sum: 5407
}
{
	product: product843
	sum: 5406
}
{
	product: product526
	sum: 5401
}
{
	product: product6
	sum: 5400
}
{
	product: product776
	sum: 5400
}
{
	product: product297
	sum: 5399
}
{
	product: product273
	sum: 5396
}
{
	product: product411
	sum: 5395
}
{
	product: product724
	sum: 5393
}
{
	product: product377
	sum: 5387
}
{
	product: product574
	sum: 5387
}
{
	product: product567
	sum: 5387
}
{
	product: product912
	sum: 5385
}
{
	product: product256
	sum: 5385
}
{
	product: product449
	sum: 5384
}
{
	product: product272
	sum: 5381
}
{
	product: product180
	sum: 5380
}
{
	product: product816
	sum: 5379
}
{
	product: product208
	sum: 5378
}
{
	product: product116
	sum: 5372
}
{
	product: product597
	sum: 5370
}
{
	product: product205
	sum: 5369
}
{
	product: product866
	sum: 5368
}
{
	product: product55
	sum: 5363
}
{
	product: product222
	sum: 5358
}
{
	product: product317
	sum: 5358
}
{
	product: product344
	sum: 5354
}
{
	product: product535
	sum: 5354
}
{
	product: product809
	sum: 5352
}
{
	product: product830
	sum: 5351
}
{
	product: product288
	sum: 5350
}
{
	product: product175
	sum: 5348
}
{
	product: product218
	sum: 5347
}
{
	product: product689
	sum: 5344
}
{
	product: product327
	sum: 5340
}
{
	product: product793
	sum: 5339
}
{
	product: product626
	sum: 5339
}
{
	product: product192
	sum: 5332
}
{
	product: product735
	sum: 5330
}
{
	product: product712
	sum: 5330
}
{
	product: product599
	sum: 5328
}
{
	product: product880
	sum: 5328
}
{
	product: product257
	sum: 5326
}
{
	product: product668
	sum: 5322
}
{
	product: product373
	sum: 5321
}
{
	product: product833
	sum: 5318
}
{
	product: product618
	sum: 5317
}
{
	product: product875
	sum: 5315
}
{
	product: product61
	sum: 5315
}
{
	product: product781
	sum: 5312
}
{
	product: product721
	sum: 5307
}
{
	product: product902
	sum: 5307
}
{
	product: product307
	sum: 5307
}
{
	product: product936
	sum: 5306
}
{
	product: product287
	sum: 5304
}
{
	product: product928
	sum: 5304
}
{
	product: product797
	sum: 5303
}
{
	product: product293
	sum: 5302
}
{
	product: product200
	sum: 5298
}
{
	product: product366
	sum: 5297
}
{
	product: product469
	sum: 5297
}
{
	product: product865
	sum: 5296
}
{
	product: product34
	sum: 5294
}
{
	product: product238
	sum: 5291
}
{
	product: product255
	sum: 5291
}
{
	product: product359
	sum: 5291
}
{
	product: product553
	sum: 5286
}
{
	product: product390
	sum: 5285
}
{
	product: product835
	sum: 5282
}
{
	product: product38
	sum: 5281
}
{
	product: product848
	sum: 5280
}
{
	product: product757
	sum: 5279
}
{
	product: product396
	sum: 5279
}
{
	product: product349
	sum: 5274
}
{
	product: product572
	sum: 5270
}
{
	product: product450
	sum: 5266
}
{
	product: product685
	sum: 5265
}
{
	product: product451
	sum: 5261
}
{
	product: product242
	sum: 5260
}
{
	product: product791
	sum: 5259
}
{
	product: product693
	sum: 5256
}
{
	product: product150
	sum: 5255
}
{
	product: product645
	sum: 5255
}
{
	product: product458
	sum: 5252
}
{
	product: product512
	sum: 5250
}
{
	product: product70
	sum: 5249
}
{
	product: product479
	sum: 5248
}
{
	product: product79
	sum: 5240
}
{
	product: product462
	sum: 5239
}
{
	product: product259
	sum: 5238
}
{
	product: product388
	sum: 5236
}
{
	product: product743
	sum: 5235
}
{
	product: product901
	sum: 5235
}
{
	product: product684
	sum: 5232
}
{
	product: product633
	sum: 5230
}
{
	product: product573
	sum: 5227
}
{
	product: product490
	sum: 5226
}
{
	product: product19
	sum: 5224
}
{
	product: product960
	sum: 5223
}
{
	product: product672
	sum: 5222
}
{
	product: product904
	sum: 5221
}
{
	product: product594
	sum: 5221
}
{
	product: product142
	sum: 5217
}
{
	product: product221
	sum: 5217
}
{
	product: product856
	sum: 5217
}
{
	product: product938
	sum: 5209
}
{
	product: product754
	sum: 5206
}
{
	product: product119
	sum: 5205
}
{
	product: product870
	sum: 5204
}
{
	product: product995
	sum: 5201
}
{
	product: product453
	sum: 5200
}
{
	product: product878
	sum: 5198
}
{
	product: product947
	sum: 5198
}
{
	product: product608
	sum: 5192
}
{
	product: product890
	sum: 5191
}
{
	product: product862
	sum: 5187
}
{
	product: product233
	sum: 5186
}
{
	product: product482
	sum: 5183
}
{
	product: product990
	sum: 5182
}
{
	product: product699
	sum: 5181
}
{
	product: product606
	sum: 5177
}
{
	product: product240
	sum: 5176
}
{
	product: product117
	sum: 5175
}
{
	product: product504
	sum: 5173
}
{
	product: product961
	sum: 5172
}
{
	product: product802
	sum: 5171
}
{
	product: product112
	sum: 5169
}
{
	product: product532
	sum: 5169
}
{
	product: product329
	sum: 5165
}
{
	product: product609
	sum: 5165
}
{
	product: product174
	sum: 5160
}
{
	product: product229
	sum: 5157
}
{
	product: product506
	sum: 5148
}
{
	product: product503
	sum: 5148
}
{
	product: product476
	sum: 5146
}
{
	product: product283
	sum: 5146
}
{
	product: product575
	sum: 5146
}
{
	product: product398
	sum: 5146
}
{
	product: product99
	sum: 5143
}
{
	product: product867
	sum: 5143
}
{
	product: product808
	sum: 5142
}
{
	product: product78
	sum: 5138
}
{
	product: product652
	sum: 5136
}
{
	product: product842
	sum: 5135
}
{
	product: product557
	sum: 5134
}
{
	product: product714
	sum: 5133
}
{
	product: product909
	sum: 5132
}
{
	product: product417
	sum: 5130
}
{
	product: product686
	sum: 5130
}
{
	product: product774
	sum: 5129
}
{
	product: product821
	sum: 5128
}
{
	product: product519
	sum: 5127
}
{
	product: product983
	sum: 5127
}
{
	product: product876
	sum: 5125
}
{
	product: product67
	sum: 5124
}
{
	product: product769
	sum: 5123
}
{
	product: product788
	sum: 5123
}
{
	product: product944
	sum: 5122
}
{
	product: product187
	sum: 5121
}
{
	product: product275
	sum: 5116
}
{
	product: product525
	sum: 5114
}
{
	product: product518
	sum: 5114
}
{
	product: product226
	sum: 5113
}
{
	product: product59
	sum: 5113
}
{
	product: product753
	sum: 5112
}
{
	product: product89
	sum: 5112
}
{
	product: product748
	sum: 5111
}
{
	product: product500
	sum: 5110
}
{
	product: product799
	sum: 5104
}
{
	product: product646
	sum: 5104
}
{
	product: product622
	sum: 5104
}
{
	product: product884
	sum: 5103
}
{
	product: product27
	sum: 5100
}
{
	product: product883
	sum: 5099
}
{
	product: product220
	sum: 5099
}
{
	product: product679
	sum: 5098
}
{
	product: product428
	sum: 5098
}
{
	product: product438
	sum: 5098
}
{
	product: product641
	sum: 5095
}
{
	product: product371
	sum: 5092
}
{
	product: product52
	sum: 5092
}
{
	product: product703
	sum: 5090
}
{
	product: product658
	sum: 5088
}
{
	product: product315
	sum: 5087
}
{
	product: product326
	sum: 5087
}
{
	product: product193
	sum: 5084
}
{
	product: product267
	sum: 5083
}
{
	product: product860
	sum: 5083
}
{
	product: product723
	sum: 5081
}
{
	product: product657
	sum: 5078
}
{
	product: product508
	sum: 5074
}
{
	product: product223
	sum: 5073
}
{
	product: product181
	sum: 5073
}
{
	product: product306
	sum: 5071
}
{
	product: product152
	sum: 5070
}
{
	product: product718
	sum: 5070
}
{
	product: product435
	sum: 5069
}
{
	product: product814
	sum: 5068
}
{
	product: product562
	sum: 5068
}
{
	product: product540
	sum: 5068
}
{
	product: product459
	sum: 5068
}
{
	product: product409
	sum: 5068
}
{
	product: product660
	sum: 5067
}
{
	product: product225
	sum: 5067
}
{
	product: product656
	sum: 5065
}
{
	product: product432
	sum: 5065
}
{
	product: product24
	sum: 5064
}
{
	product: product578
	sum: 5062
}
{
	product: product978
	sum: 5062
}
{
	product: product956
	sum: 5060
}
{
	product: product356
	sum: 5049
}
{
	product: product543
	sum: 5048
}
{
	product: product546
	sum: 5048
}
{
	product: product15
	sum: 5046
}
{
	product: product182
	sum: 5045
}
{
	product: product522
	sum: 5044
}
{
	product: product103
	sum: 5040
}
{
	product: product1
	sum: 5037
}
{
	product: product455
	sum: 5037
}
{
	product: product236
	sum: 5036
}
{
	product: product701
	sum: 5035
}
{
	product: product97
	sum: 5031
}
{
	product: product533
	sum: 5030
}
{
	product: product186
	sum: 5030
}
{
	product: product980
	sum: 5028
}
{
	product: product369
	sum: 5027
}
{
	product: product98
	sum: 5024
}
{
	product: product228
	sum: 5024
}
{
	product: product644
	sum: 5023
}
{
	product: product60
	sum: 5020
}
{
	product: product132
	sum: 5017
}
{
	product: product556
	sum: 5017
}
{
	product: product763
	sum: 5016
}
{
	product: product294
	sum: 5016
}
{
	product: product324
	sum: 5015
}
{
	product: product988
	sum: 5015
}
{
	product: product354
	sum: 5015
}
{
	product: product767
	sum: 5013
}
{
	product: product405
	sum: 5011
}
{
	product: product704
	sum: 5010
}
{
	product: product265
	sum: 5007
}
{
	product: product505
	sum: 5004
}
{
	product: product538
	sum: 4999
}
{
	product: product529
	sum: 4998
}
{
	product: product762
	sum: 4998
}
{
	product: product44
	sum: 4992
}
{
	product: product579
	sum: 4988
}
{
	product: product313
	sum: 4988
}
{
	product: product659
	sum: 4986
}
{
	product: product338
	sum: 4985
}
{
	product: product309
	sum: 4985
}
{
	product: product177
	sum: 4985
}
{
	product: product603
	sum: 4982
}
{
	product: product145
	sum: 4982
}
{
	product: product497
	sum: 4981
}
{
	product: product243
	sum: 4980
}
{
	product: product126
	sum: 4980
}
{
	product: product376
	sum: 4973
}
{
	product: product857
	sum: 4972
}
{
	product: product161
	sum: 4971
}
{
	product: product531
	sum: 4969
}
{
	product: product617
	sum: 4969
}
{
	product: product647
	sum: 4967
}
{
	product: product740
	sum: 4963
}
{
	product: product779
	sum: 4962
}
{
	product: product128
	sum: 4962
}
{
	product: product235
	sum: 4962
}
{
	product: product358
	sum: 4961
}
{
	product: product680
	sum: 4960
}
{
	product: product448
	sum: 4959
}
{
	product: product214
	sum: 4959
}
{
	product: product493
	sum: 4957
}
{
	product: product739
	sum: 4954
}
{
	product: product131
	sum: 4954
}
{
	product: product158
	sum: 4953
}
{
	product: product677
	sum: 4950
}
{
	product: product91
	sum: 4947
}
{
	product: product87
	sum: 4945
}
{
	product: product407
	sum: 4945
}
{
	product: product959
	sum: 4945
}
{
	product: product747
	sum: 4943
}
{
	product: product35
	sum: 4942
}
{
	product: product29
	sum: 4942
}
{
	product: product844
	sum: 4938
}
{
	product: product437
	sum: 4938
}
{
	product: product129
	sum: 4935
}
{
	product: product911
	sum: 4933
}
{
	product: product552
	sum: 4930
}
{
	product: product212
	sum: 4929
}
{
	product: product162
	sum: 4928
}
{
	product: product517
	sum: 4927
}
{
	product: product332
	sum: 4926
}
{
	product: product268
	sum: 4925
}
{
	product: product554
	sum: 4924
}
{
	product: product620
	sum: 4923
}
{
	product: product826
	sum: 4921
}
{
	product: product384
	sum: 4921
}
{
	product: product991
	sum: 4920
}
{
	product: product653
	sum: 4919
}
{
	product: product507
	sum: 4918
}
{
	product: product28
	sum: 4916
}
{
	product: product252
	sum: 4915
}
{
	product: product12
	sum: 4915
}
{
	product: product969
	sum: 4912
}
{
	product: product810
	sum: 4910
}
{
	product: product219
	sum: 4909
}
{
	product: product670
	sum: 4908
}
{
	product: product278
	sum: 4908
}
{
	product: product277
	sum: 4906
}
{
	product: product764
	sum: 4905
}
{
	product: product420
	sum: 4904
}
{
	product: product639
	sum: 4902
}
{
	product: product555
	sum: 4902
}
{
	product: product908
	sum: 4900
}
{
	product: product137
	sum: 4898
}
{
	product: product340
	sum: 4894
}
{
	product: product304
	sum: 4893
}
{
	product: product160
	sum: 4893
}
{
	product: product423
	sum: 4891
}
{
	product: product394
	sum: 4887
}
{
	product: product837
	sum: 4886
}
{
	product: product96
	sum: 4885
}
{
	product: product849
	sum: 4885
}
{
	product: product40
	sum: 4883
}
{
	product: product697
	sum: 4883
}
{
	product: product548
	sum: 4882
}
{
	product: product111
	sum: 4882
}
{
	product: product247
	sum: 4881
}
{
	product: product923
	sum: 4875
}
{
	product: product711
	sum: 4869
}
{
	product: product727
	sum: 4869
}
{
	product: product166
	sum: 4867
}
{
	product: product465
	sum: 4865
}
{
	product: product72
	sum: 4861
}
{
	product: product90
	sum: 4856
}
{
	product: product545
	sum: 4850
}
{
	product: product387
	sum: 4849
}
{
	product: product56
	sum: 4849
}
{
	product: product822
	sum: 4849
}
{
	product: product823
	sum: 4847
}
{
	product: product787
	sum: 4846
}
{
	product: product675
	sum: 4844
}
{
	product: product666
	sum: 4843
}
{
	product: product429
	sum: 4842
}
{
	product: product185
	sum: 4836
}
{
	product: product401
	sum: 4836
}
{
	product: product425
	sum: 4836
}
{
	product: product271
	sum: 4834
}
{
	product: product582
	sum: 4834
}
{
	product: product968
	sum: 4832
}
{
	product: product632
	sum: 4831
}
{
	product: product253
	sum: 4831
}
{
	product: product511
	sum: 4830
}
{
	product: product509
	sum: 4828
}
{
	product: product941
	sum: 4828
}
{
	product: product215
	sum: 4825
}
{
	product: product300
	sum: 4825
}
{
	product: product772
	sum: 4824
}
{
	product: product950
	sum: 4821
}
{
	product: product478
	sum: 4821
}
{
	product: product989
	sum: 4820
}
{
	product: product859
	sum: 4820
}
{
	product: product642
	sum: 4820
}
{
	product: product541
	sum: 4819
}
{
	product: product682
	sum: 4813
}
{
	product: product460
	sum: 4813
}
{
	product: product441
	sum: 4812
}
{
	product: product591
	sum: 4812
}
{
	product: product963
	sum: 4812
}
{
	product: product760
	sum: 4808
}
{
	product: product53
	sum: 4806
}
{
	product: product744
	sum: 4806
}
{
	product: product771
	sum: 4805
}
{
	product: product31
	sum: 4803
}
{
	product: product524
	sum: 4803
}
{
	product: product190
	sum: 4801
}
{
	product: product872
	sum: 4801
}
{
	product: product383
	sum: 4800
}
{
	product: product147
	sum: 4800
}
{
	product: product708
	sum: 4797
}
{
	product: product292
	sum: 4796
}
{
	product: product831
	sum: 4794
}
{
	product: product382
	sum: 4794
}
{
	product: product461
	sum: 4793
}
{
	product: product803
	sum: 4791
}
{
	product: product589
	sum: 4791
}
{
	product: product863
	sum: 4790
}
{
	product: product155
	sum: 4787
}
{
	product: product949
	sum: 4782
}
{
	product: product719
	sum: 4781
}
{
	product: product184
	sum: 4781
}
{
	product: product561
	sum: 4778
}
{
	product: product282
	sum: 4771
}
{
	product: product151
	sum: 4771
}
{
	product: product523
	sum: 4769
}
{
	product: product858
	sum: 4764
}
{
	product: product201
	sum: 4764
}
{
	product: product290
	sum: 4762
}
{
	product: product45
	sum: 4759
}
{
	product: product336
	sum: 4758
}
{
	product: product23
	sum: 4758
}
{
	product: product11
	sum: 4758
}
{
	product: product375
	sum: 4757
}
{
	product: product811
	sum: 4757
}
{
	product: product817
	sum: 4756
}
{
	product: product251
	sum: 4755
}
{
	product: product258
	sum: 4755
}
{
	product: product379
	sum: 4754
}
{
	product: product550
	sum: 4751
}
{
	product: product188
	sum: 4751
}
{
	product: product742
	sum: 4746
}
{
	product: product726
	sum: 4744
}
{
	product: product536
	sum: 4742
}
{
	product: product544
	sum: 4741
}
{
	product: product299
	sum: 4741
}
{
	product: product850
	sum: 4739
}
{
	product: product773
	sum: 4738
}
{
	product: product487
	sum: 4738
}
{
	product: product339
	sum: 4738
}
{
	product: product211
	sum: 4737
}
{
	product: product801
	sum: 4737
}
{
	product: product156
	sum: 4735
}
{
	product: product84
	sum: 4730
}
{
	product: product586
	sum: 4730
}
{
	product: product244
	sum: 4727
}
{
	product: product528
	sum: 4727
}
{
	product: product85
	sum: 4725
}
{
	product: product107
	sum: 4725
}
{
	product: product343
	sum: 4725
}
{
	product: product722
	sum: 4724
}
{
	product: product879
	sum: 4721
}
{
	product: product732
	sum: 4721
}
{
	product: product598
	sum: 4719
}
{
	product: product602
	sum: 4718
}
{
	product: product41
	sum: 4717
}
{
	product: product897
	sum: 4716
}
{
	product: product796
	sum: 4716
}
{
	product: product874
	sum: 4715
}
{
	product: product587
	sum: 4715
}
{
	product: product130
	sum: 4715
}
{
	product: product728
	sum: 4714
}
{
	product: product13
	sum: 4707
}
{
	product: product501
	sum: 4704
}
{
	product: product494
	sum: 4702
}
{
	product: product604
	sum: 4702
}
{
	product: product286
	sum: 4699
}
{
	product: product651
	sum: 4699
}
{
	product: product585
	sum: 4698
}
{
	product: product621
	sum: 4697
}
{
	product: product549
	sum: 4696
}
{
	product: product183
	sum: 4695
}
{
	product: product520
	sum: 4692
}
{
	product: product638
	sum: 4689
}
{
	product: product595
	sum: 4688
}
{
	product: product426
	sum: 4688
}
{
	product: product770
	sum: 4688
}
{
	product: product416
	sum: 4687
}
{
	product: product694
	sum: 4686
}
{
	product: product36
	sum: 4686
}
{
	product: product149
	sum: 4685
}
{
	product: product139
	sum: 4681
}
{
	product: product284
	sum: 4680
}
{
	product: product648
	sum: 4678
}
{
	product: product54
	sum: 4677
}
{
	product: product113
	sum: 4675
}
{
	product: product825
	sum: 4675
}
{
	product: product819
	sum: 4673
}
{
	product: product935
	sum: 4673
}
{
	product: product907
	sum: 4671
}
{
	product: product33
	sum: 4665
}
{
	product: product361
	sum: 4665
}
{
	product: product750
	sum: 4662
}
{
	product: product745
	sum: 4656
}
{
	product: product217
	sum: 4652
}
{
	product: product845
	sum: 4649
}
{
	product: product65
	sum: 4649
}
{
	product: product614
	sum: 4649
}
{
	product: product920
	sum: 4647
}
{
	product: product153
	sum: 4646
}
{
	product: product397
	sum: 4643
}
{
	product: product171
	sum: 4642
}
{
	product: product954
	sum: 4638
}
{
	product: product20
	sum: 4637
}
{
	product: product484
	sum: 4636
}
{
	product: product138
	sum: 4635
}
{
	product: product311
	sum: 4632
}
{
	product: product422
	sum: 4632
}
{
	product: product230
	sum: 4629
}
{
	product: product191
	sum: 4628
}
{
	product: product159
	sum: 4628
}
{
	product: product400
	sum: 4626
}
{
	product: product42
	sum: 4624
}
{
	product: product335
	sum: 4624
}
{
	product: product372
	sum: 4623
}
{
	product: product590
	sum: 4622
}
{
	product: product179
	sum: 4619
}
{
	product: product231
	sum: 4617
}
{
	product: product239
	sum: 4617
}
{
	product: product440
	sum: 4615
}
{
	product: product852
	sum: 4614
}
{
	product: product534
	sum: 4613
}
{
	product: product82
	sum: 4613
}
{
	product: product917
	sum: 4612
}
{
	product: product999
	sum: 4612
}
{
	product: product964
	sum: 4609
}
{
	product: product885
	sum: 4606
}
{
	product: product357
	sum: 4604
}
{
	product: product203
	sum: 4596
}
{
	product: product445
	sum: 4596
}
{
	product: product468
	sum: 4596
}
{
	product: product864
	sum: 4595
}
{
	product: product979
	sum: 4593
}
{
	product: product717
	sum: 4592
}
{
	product: product102
	sum: 4589
}
{
	product: product795
	sum: 4588
}
{
	product: product124
	sum: 4588
}
{
	product: product813
	sum: 4586
}
{
	product: product83
	sum: 4585
}
{
	product: product94
	sum: 4577
}
{
	product: product403
	sum: 4570
}
{
	product: product419
	sum: 4568
}
{
	product: product121
	sum: 4566
}
{
	product: product933
	sum: 4566
}
{
	product: product945
	sum: 4565
}
{
	product: product889
	sum: 4565
}
{
	product: product305
	sum: 4562
}
{
	product: product855
	sum: 4554
}
{
	product: product314
	sum: 4551
}
{
	product: product631
	sum: 4551
}
{
	product: product436
	sum: 4551
}
{
	product: product925
	sum: 4550
}
{
	product: product413
	sum: 4549
}
{
	product: product513
	sum: 4548
}
{
	product: product624
	sum: 4546
}
{
	product: product74
	sum: 4546
}
{
	product: product664
	sum: 4544
}
{
	product: product854
	sum: 4544
}
{
	product: product827
	sum: 4543
}
{
	product: product752
	sum: 4539
}
{
	product: product321
	sum: 4538
}
{
	product: product530
	sum: 4538
}
{
	product: product667
	sum: 4537
}
{
	product: product592
	sum: 4537
}
{
	product: product588
	sum: 4535
}
{
	product: product262
	sum: 4535
}
{
	product: product496
	sum: 4529
}
{
	product: product984
	sum: 4529
}
{
	product: product563
	sum: 4528
}
{
	product: product985
	sum: 4527
}
{
	product: product481
	sum: 4526
}
{
	product: product958
	sum: 4523
}
{
	product: product637
	sum: 4522
}
{
	product: product643
	sum: 4522
}
{
	product: product882
	sum: 4521
}
{
	product: product227
	sum: 4521
}
{
	product: product601
	sum: 4520
}
{
	product: product716
	sum: 4519
}
{
	product: product474
	sum: 4518
}
{
	product: product3
	sum: 4516
}
{
	product: product974
	sum: 4515
}
{
	product: product906
	sum: 4513
}
{
	product: product690
	sum: 4511
}
{
	product: product896
	sum: 4510
}
{
	product: product418
	sum: 4506
}
{
	product: product839
	sum: 4505
}
{
	product: product189
	sum: 4504
}
{
	product: product994
	sum: 4495
}
{
	product: product934
	sum: 4494
}
{
	product: product583
	sum: 4490
}
{
	product: product782
	sum: 4490
}
{
	product: product289
	sum: 4488
}
{
	product: product927
	sum: 4487
}
{
	product: product688
	sum: 4487
}
{
	product: product9
	sum: 4486
}
{
	product: product134
	sum: 4484
}
{
	product: product204
	sum: 4482
}
{
	product: product49
	sum: 4480
}
{
	product: product970
	sum: 4478
}
{
	product: product650
	sum: 4475
}
{
	product: product334
	sum: 4475
}
{
	product: product389
	sum: 4470
}
{
	product: product351
	sum: 4469
}
{
	product: product71
	sum: 4465
}
{
	product: product786
	sum: 4465
}
{
	product: product348
	sum: 4465
}
{
	product: product868
	sum: 4464
}
{
	product: product410
	sum: 4463
}
{
	product: product488
	sum: 4462
}
{
	product: product946
	sum: 4461
}
{
	product: product766
	sum: 4457
}
{
	product: product104
	sum: 4456
}
{
	product: product607
	sum: 4455
}
{
	product: product943
	sum: 4452
}
{
	product: product249
	sum: 4451
}
{
	product: product385
	sum: 4451
}
{
	product: product916
	sum: 4448
}
{
	product: product110
	sum: 4446
}
{
	product: product378
	sum: 4446
}
{
	product: product568
	sum: 4446
}
{
	product: product291
	sum: 4445
}
{
	product: product489
	sum: 4445
}
{
	product: product612
	sum: 4445
}
{
	product: product92
	sum: 4443
}
{
	product: product471
	sum: 4441
}
{
	product: product467
	sum: 4440
}
{
	product: product910
	sum: 4440
}
{
	product: product368
	sum: 4438
}
{
	product: product395
	sum: 4436
}
{
	product: product195
	sum: 4434
}
{
	product: product473
	sum: 4434
}
{
	product: product77
	sum: 4431
}
{
	product: product483
	sum: 4430
}
{
	product: product655
	sum: 4430
}
{
	product: product347
	sum: 4426
}
{
	product: product892
	sum: 4426
}
{
	product: product729
	sum: 4426
}
{
	product: product930
	sum: 4422
}
{
	product: product380
	sum: 4420
}
{
	product: product514
	sum: 4418
}
{
	product: product414
	sum: 4416
}
{
	product: product832
	sum: 4412
}
{
	product: product123
	sum: 4412
}
{
	product: product118
	sum: 4410
}
{
	product: product140
	sum: 4408
}
{
	product: product427
	sum: 4407
}
{
	product: product346
	sum: 4407
}
{
	product: product250
	sum: 4406
}
{
	product: product43
	sum: 4399
}
{
	product: product495
	sum: 4396
}
{
	product: product198
	sum: 4392
}
{
	product: product580
	sum: 4391
}
{
	product: product559
	sum: 4390
}
{
	product: product464
	sum: 4390
}
{
	product: product109
	sum: 4378
}
{
	product: product600
	sum: 4376
}
{
	product: product903
	sum: 4376
}
{
	product: product323
	sum: 4373
}
{
	product: product976
	sum: 4373
}
{
	product: product676
	sum: 4371
}
{
	product: product649
	sum: 4369
}
{
	product: product16
	sum: 4369
}
{
	product: product303
	sum: 4364
}
{
	product: product446
	sum: 4362
}
{
	product: product412
	sum: 4362
}
{
	product: product144
	sum: 4360
}
{
	product: product784
	sum: 4360
}
{
	product: product756
	sum: 4358
}
{
	product: product921
	sum: 4356
}
{
	product: product404
	sum: 4354
}
{
	product: product758
	sum: 4350
}
{
	product: product710
	sum: 4346
}
{
	product: product665
	sum: 4333
}
{
	product: product982
	sum: 4332
}
{
	product: product706
	sum: 4328
}
{
	product: product63
	sum: 4327
}
{
	product: product127
	sum: 4318
}
{
	product: product246
	sum: 4318
}
{
	product: product829
	sum: 4312
}
{
	product: product613
	sum: 4307
}
{
	product: product751
	sum: 4306
}
{
	product: product269
	sum: 4300
}
{
	product: product869
	sum: 4300
}
{
	product: product695
	sum: 4297
}
{
	product: product322
	sum: 4297
}
{
	product: product213
	sum: 4292
}
{
	product: product439
	sum: 4290
}
{
	product: product725
	sum: 4286
}
{
	product: product100
	sum: 4284
}
{
	product: product95
	sum: 4283
}
{
	product: product167
	sum: 4281
}
{
	product: product537
	sum: 4274
}
{
	product: product415
	sum: 4272
}
{
	product: product899
	sum: 4266
}
{
	product: product926
	sum: 4265
}
{
	product: product430
	sum: 4263
}
{
	product: product86
	sum: 4262
}
{
	product: product997
	sum: 4260
}
{
	product: product905
	sum: 4258
}
{
	product: product68
	sum: 4257
}
{
	product: product521
	sum: 4254
}
{
	product: product8
	sum: 4254
}
{
	product: product234
	sum: 4254
}
{
	product: product847
	sum: 4252
}
{
	product: product700
	sum: 4247
}
{
	product: product780
	sum: 4245
}
{
	product: product5
	sum: 4242
}
{
	product: product634
	sum: 4239
}
{
	product: product101
	sum: 4238
}
{
	product: product625
	sum: 4237
}
{
	product: product135
	sum: 4235
}
{
	product: product355
	sum: 4234
}
{
	product: product207
	sum: 4226
}
{
	product: product785
	sum: 4226
}
{
	product: product893
	sum: 4226
}
{
	product: product108
	sum: 4225
}
{
	product: product605
	sum: 4224
}
{
	product: product232
	sum: 4218
}
{
	product: product170
	sum: 4218
}
{
	product: product971
	sum: 4217
}
{
	product: product106
	sum: 4211
}
{
	product: product558
	sum: 4199
}
{
	product: product730
	sum: 4194
}
{
	product: product457
	sum: 4193
}
{
	product: product50
	sum: 4190
}
{
	product: product261
	sum: 4189
}
{
	product: product367
	sum: 4184
}
{
	product: product69
	sum: 4182
}
{
	product: product577
	sum: 4179
}
{
	product: product477
	sum: 4177
}
{
	product: product815
	sum: 4174
}
{
	product: product881
	sum: 4173
}
{
	product: product987
	sum: 4167
}
{
	product: product840
	sum: 4155
}
{
	product: product755
	sum: 4154
}
{
	product: product571
	sum: 4146
}
{
	product: product485
	sum: 4144
}
{
	product: product331
	sum: 4136
}
{
	product: product929
	sum: 4131
}
{
	product: product662
	sum: 4123
}
{
	product: product276
	sum: 4118
}
{
	product: product51
	sum: 4117
}
{
	product: product741
	sum: 4109
}
{
	product: product25
	sum: 4108
}
{
	product: product433
	sum: 4107
}
{
	product: product962
	sum: 4107
}
{
	product: product337
	sum: 4102
}
{
	product: product584
	sum: 4097
}
{
	product: product452
	sum: 4095
}
{
	product: product610
	sum: 4091
}
{
	product: product547
	sum: 4088
}
{
	product: product539
	sum: 4082
}
{
	product: product715
	sum: 4080
}
{
	product: product952
	sum: 4079
}
{
	product: product370
	sum: 4077
}
{
	product: product316
	sum: 4075
}
{
	product: product197
	sum: 4072
}
{
	product: product775
	sum: 4069
}
{
	product: product105
	sum: 4067
}
{
	product: product224
	sum: 4052
}
{
	product: product406
	sum: 4050
}
{
	product: product37
	sum: 4047
}
{
	product: product296
	sum: 4046
}
{
	product: product216
	sum: 4045
}
{
	product: product615
	sum: 4032
}
{
	product: product807
	sum: 4029
}
{
	product: product616
	sum: 4028
}
{
	product: product663
	sum: 4027
}
{
	product: product148
	sum: 4023
}
{
	product: product777
	sum: 4017
}
{
	product: product302
	sum: 4017
}
{
	product: product940
	sum: 4010
}
{
	product: product977
	sum: 3996
}
{
	product: product948
	sum: 3993
}
{
	product: product341
	sum: 3983
}
{
	product: product800
	sum: 3983
}
{
	product: product931
	sum: 3983
}
{
	product: product636
	sum: 3975
}
{
	product: product937
	sum: 3974
}
{
	product: product295
	sum: 3974
}
{
	product: product39
	sum: 3969
}
{
	product: product58
	sum: 3968
}
{
	product: product270
	sum: 3968
}
{
	product: product120
	sum: 3964
}
{
	product: product381
	sum: 3960
}
{
	product: product720
	sum: 3960
}
{
	product: product196
	sum: 3951
}
{
	product: product115
	sum: 3946
}
{
	product: product454
	sum: 3945
}
{
	product: product374
	sum: 3944
}
{
	product: product298
	sum: 3929
}
{
	product: product492
	sum: 3926
}
{
	product: product565
	sum: 3916
}
{
	product: product442
	sum: 3916
}
{
	product: product46
	sum: 3904
}
{
	product: product7
	sum: 3899
}
{
	product: product447
	sum: 3895
}
{
	product: product363
	sum: 3893
}
{
	product: product399
	sum: 3888
}
{
	product: product263
	sum: 3882
}
{
	product: product301
	sum: 3880
}
{
	product: product360
	sum: 3865
}
{
	product: product891
	sum: 3845
}
{
	product: product202
	sum: 3833
}
{
	product: product393
	sum: 3794
}
{
	product: product593
	sum: 3785
}
{
	product: product32
	sum: 3782
}
{
	product: product241
	sum: 3780
}
{
	product: product176
	sum: 3764
}
{
	product: product698
	sum: 3729
}
{
	product: product527
	sum: 3712
}
{
	product: product125
	sum: 3689
}
{
	product: product674
	sum: 3668
}
{
	product: product768
	sum: 3649
}
{
	product: product566
	sum: 3609
}
{
	product: product846
	sum: 3500
}
{
	product: product861
	sum: 3455
}
{
	product: product737
	sum: 3372
}
{
	product: product64
	sum: 3348
}
{
	product: product623
	sum: 3330
}
{
	product: product114
	sum: 3279
}
{
	product: product498
	sum: 3237
}
