{
	ShopId: 0
	shop name: shop0
	product name:product10
	startDate: 1900-09-21 00:00:00.0
	endDate: 4900-09-21 00:00:00.0
	amount: 338
}
{
	ShopId: 1
	shop name: shop1
	product name:product10
	startDate: 1900-09-21 00:00:00.0
	endDate: 4900-09-21 00:00:00.0
	amount: 454
}
{
	ShopId: 2
	shop name: shop2
	product name:product10
	startDate: 1900-09-21 00:00:00.0
	endDate: 4900-09-21 00:00:00.0
	amount: 819
}
{
	ShopId: 3
	shop name: shop3
	product name:product10
	startDate: 1900-09-21 00:00:00.0
	endDate: 4900-09-21 00:00:00.0
	amount: 476
}
{
	ShopId: 4
	shop name: shop4
	product name:product10
	startDate: 1900-09-21 00:00:00.0
	endDate: 4900-09-21 00:00:00.0
	amount: 536
}
{
	ShopId: 5
	shop name: shop5
	product name:product10
	startDate: 1900-09-21 00:00:00.0
	endDate: 4900-09-21 00:00:00.0
	amount: 339
}
{
	ShopId: 6
	shop name: shop6
	product name:product10
	startDate: 1900-09-21 00:00:00.0
	endDate: 4900-09-21 00:00:00.0
	amount: 724
}
{
	ShopId: 7
	shop name: shop7
	product name:product10
	startDate: 1900-09-21 00:00:00.0
	endDate: 4900-09-21 00:00:00.0
	amount: 673
}
{
	ShopId: 8
	shop name: shop8
	product name:product10
	startDate: 1900-09-21 00:00:00.0
	endDate: 4900-09-21 00:00:00.0
	amount: 672
}
{
	ShopId: 9
	shop name: shop9
	product name:product10
	startDate: 1900-09-21 00:00:00.0
	endDate: 4900-09-21 00:00:00.0
	amount: 584
}
