{
	product1: product89,
	product2: product105,
	product3: product158,
	product4: product158,
	frequency: 27,
	period: 1900-09-21 00:00:00.0-4900-09-21 00:00:00.0
}
{
	product1: product16,
	product2: product26,
	product3: product73,
	product4: product73,
	frequency: 27,
	period: 1900-09-21 00:00:00.0-4900-09-21 00:00:00.0
}
{
	product1: product12,
	product2: product24,
	product3: product38,
	product4: product38,
	frequency: 26,
	period: 1900-09-21 00:00:00.0-4900-09-21 00:00:00.0
}
{
	product1: product66,
	product2: product98,
	product3: product116,
	product4: product116,
	frequency: 25,
	period: 1900-09-21 00:00:00.0-4900-09-21 00:00:00.0
}
{
	product1: product129,
	product2: product137,
	product3: product196,
	product4: product196,
	frequency: 25,
	period: 1900-09-21 00:00:00.0-4900-09-21 00:00:00.0
}
{
	product1: product52,
	product2: product122,
	product3: product134,
	product4: product134,
	frequency: 25,
	period: 1900-09-21 00:00:00.0-4900-09-21 00:00:00.0
}
{
	product1: product52,
	product2: product73,
	product3: product75,
	product4: product75,
	frequency: 25,
	period: 1900-09-21 00:00:00.0-4900-09-21 00:00:00.0
}
{
	product1: product159,
	product2: product172,
	product3: product209,
	product4: product209,
	frequency: 25,
	period: 1900-09-21 00:00:00.0-4900-09-21 00:00:00.0
}
{
	product1: product159,
	product2: product232,
	product3: product247,
	product4: product247,
	frequency: 24,
	period: 1900-09-21 00:00:00.0-4900-09-21 00:00:00.0
}
{
	product1: product232,
	product2: product240,
	product3: product254,
	product4: product254,
	frequency: 24,
	period: 1900-09-21 00:00:00.0-4900-09-21 00:00:00.0
}
