Mon Apr 04 2022 16:33:03 GMT+0300 (Eastern European Summer Time) : No files in Directory
Mon Apr 04 2022 16:33:09 GMT+0300 (Eastern European Summer Time) : No files in Directory
Mon Apr 04 2022 16:33:46 GMT+0300 (Eastern European Summer Time) : No files in Directory
Mon Apr 04 2022 16:33:52 GMT+0300 (Eastern European Summer Time) : No files in Directory
Mon Apr 04 2022 16:34:34 GMT+0300 (Eastern European Summer Time) : No files in Directory
Mon Apr 04 2022 16:34:36 GMT+0300 (Eastern European Summer Time) : No files in Directory
