<svg width="128" height="64" viewBox="0 0 128 64" fill="none" xmlns="http://www.w3.org/2000/svg">
<path d="M12.1205 52.3039H16.6862V58.2117C16.3244 58.5699 15.9641 58.8755 15.6007 59.1299C14.9682 59.5468 14.3053 59.887 13.6135 60.1474C12.9187 60.4078 12.1889 60.5387 11.4196 60.5387H10.6275C9.85969 60.5387 9.12838 60.4183 8.43509 60.1805C7.74179 59.9412 7.10171 59.613 6.51484 59.1961C5.47337 58.4796 4.64628 57.563 4.029 56.4431C3.4102 55.3248 3.10156 54.0936 3.10156 52.7509C3.10156 51.3933 3.4102 50.1545 4.029 49.0362C4.64628 47.9178 5.46729 46.9997 6.49203 46.2832C7.09562 45.8663 7.75091 45.5156 8.45941 45.2311C9.16791 44.9481 9.9053 44.8066 10.6731 44.8066H11.2159C13.4463 44.8066 15.2768 45.5984 16.709 47.1788L14.5835 49.7075C14.4482 49.572 14.2871 49.4245 14.0985 49.2589C13.91 49.0964 13.6804 48.9459 13.4098 48.8119C13.1392 48.6779 12.8184 48.562 12.4489 48.4657C12.081 48.3679 11.6461 48.3197 11.149 48.3197C10.5773 48.3197 10.0087 48.4507 9.4431 48.7126C8.87752 48.973 8.39252 49.3056 7.98505 49.709C7.57759 50.1109 7.28415 50.5775 7.10323 51.1073C6.9223 51.6371 6.83108 52.185 6.83108 52.7525C6.83108 53.3184 6.9223 53.8633 7.10323 54.3856C7.28415 54.9079 7.57759 55.3699 7.98505 55.7733C8.37579 56.1617 8.82583 56.4522 9.3306 56.6448C9.83536 56.839 10.3736 56.9444 10.9468 56.9579H11.1733C11.7906 56.9579 12.3866 56.8164 12.9582 56.5334V54.9666H10.0634L12.1205 52.3039Z" fill="#262260"/>
<path d="M18.3662 54.7444C18.3662 53.894 18.503 53.1143 18.7737 52.4054C19.0443 51.6965 19.429 51.0929 19.9261 50.5932C20.4233 50.0934 21.0269 49.7021 21.7354 49.4176C22.4439 49.1347 23.2269 48.9932 24.0859 48.9932C24.7777 48.9932 25.4071 49.0985 25.9727 49.3062C26.5383 49.5155 27.0385 49.806 27.4764 50.1777V49.1708H30.9809V60.3602H27.4764V59.1742C27.04 59.5911 26.5337 59.9237 25.9621 60.1706C25.3904 60.4174 24.764 60.5393 24.0859 60.5393C23.2269 60.5393 22.4439 60.3979 21.7354 60.1134C21.0269 59.8304 20.4233 59.4346 19.9261 58.9273C19.429 58.4201 19.0443 57.812 18.7737 57.103C18.503 56.3971 18.3662 55.6099 18.3662 54.7444ZM22.7069 52.5288C22.4059 52.8268 22.19 53.167 22.0638 53.5463C21.9361 53.9256 21.8707 54.326 21.8707 54.7429C21.8707 55.1764 21.9346 55.5858 22.0638 55.9727C22.19 56.361 22.4059 56.7042 22.7069 57.0037C23.008 57.3017 23.3166 57.5305 23.6344 57.687C23.9506 57.8421 24.3277 57.9219 24.764 57.9219C25.1867 57.9219 25.5926 57.8436 25.9849 57.687C26.3771 57.5305 26.7238 57.3017 27.0248 57.0037C27.221 56.8095 27.3715 56.6078 27.4764 56.3986V53.1535C27.3715 52.9457 27.2194 52.7441 27.0248 52.5499C26.3923 51.9237 25.6382 51.6107 24.764 51.6107C24.3277 51.6107 23.9521 51.6889 23.6344 51.8455C23.3166 52.0035 23.008 52.2308 22.7069 52.5288Z" fill="#262260"/>
<path d="M33.4652 54.7439C33.4652 53.8934 33.6005 53.1138 33.8727 52.4048C34.1433 51.6959 34.528 51.0923 35.0251 50.5926C35.5223 50.0929 36.1244 49.7015 36.8344 49.4171C37.5414 49.1341 38.3259 48.9926 39.1849 48.9926C39.8767 48.9926 40.5061 49.098 41.0717 49.3057C41.6373 49.5149 42.1375 49.8054 42.5739 50.1772V44.0752H46.0784V60.3597H42.5739V59.1736C42.136 59.5905 41.6312 59.9232 41.0596 60.17C40.4879 60.4169 39.8615 60.5388 39.1849 60.5388C38.3259 60.5388 37.5414 60.3973 36.8344 60.1128C36.1259 59.8299 35.5223 59.434 35.0251 58.9267C34.528 58.4195 34.1433 57.8114 33.8727 57.1025C33.6005 56.3966 33.4652 55.6093 33.4652 54.7439ZM37.8059 52.5283C37.5049 52.8263 37.289 53.1664 37.1628 53.5458C37.0351 53.9251 36.9697 54.3254 36.9697 54.7424C36.9697 55.1759 37.0351 55.5853 37.1628 55.9721C37.289 56.3604 37.5049 56.7036 37.8059 57.0031C38.107 57.3012 38.4156 57.5299 38.7334 57.6865C39.0496 57.8415 39.4267 57.9213 39.863 57.9213C40.2857 57.9213 40.6916 57.843 41.0839 57.6865C41.4761 57.5299 41.8228 57.3012 42.1238 57.0031C42.32 56.809 42.4705 56.6073 42.5754 56.3981V53.1529C42.469 52.9452 42.32 52.7435 42.1238 52.5493C41.4913 51.9232 40.7372 51.6101 39.863 51.6101C39.4267 51.6101 39.0511 51.6884 38.7334 51.8449C38.4156 52.0029 38.107 52.2302 37.8059 52.5283Z" fill="#262260"/>
<path d="M48.5642 54.7444C48.5642 53.894 48.701 53.1143 48.9702 52.4054C49.2423 51.6965 49.627 51.0929 50.1226 50.5932C50.6198 50.0934 51.2218 49.7021 51.9319 49.4176C52.6404 49.1347 53.4234 48.9932 54.2824 48.9932C54.9757 48.9932 55.6051 49.0985 56.1692 49.3062C56.7348 49.5155 57.235 49.806 57.6729 50.1777V49.1708H61.1758V60.3602H57.6729V59.1742C57.235 59.5911 56.7302 59.9237 56.1585 60.1706C55.5869 60.4174 54.9605 60.5393 54.2824 60.5393C53.4234 60.5393 52.6404 60.3979 51.9319 60.1134C51.2234 59.8304 50.6213 59.4346 50.1226 58.9273C49.6254 58.4201 49.2423 57.812 48.9702 57.103C48.6995 56.3971 48.5642 55.6099 48.5642 54.7444ZM52.9034 52.5288C52.6008 52.8268 52.3865 53.167 52.2588 53.5463C52.131 53.9256 52.0657 54.326 52.0657 54.7429C52.0657 55.1764 52.1295 55.5858 52.2588 55.9727C52.3865 56.361 52.6008 56.7042 52.9034 57.0037C53.2044 57.3017 53.5146 57.5305 53.8308 57.687C54.1471 57.8421 54.5241 57.9219 54.9605 57.9219C55.3816 57.9219 55.7891 57.8436 56.1814 57.687C56.5736 57.5305 56.9203 57.3017 57.2213 57.0037C57.4174 56.8095 57.5679 56.6078 57.6744 56.3986V53.1535C57.5679 52.9457 57.4174 52.7441 57.2213 52.5499C56.5888 51.9237 55.8347 51.6107 54.9605 51.6107C54.5241 51.6107 54.1471 51.6889 53.8308 51.8455C53.5146 52.0035 53.206 52.2308 52.9034 52.5288Z" fill="#262260"/>
<path d="M65.8769 47.421C65.6352 47.421 65.4071 47.3759 65.1867 47.2871C64.9677 47.1968 64.7807 47.0749 64.6211 46.9183C64.4615 46.7618 64.3383 46.5797 64.2486 46.3704C64.1589 46.1612 64.1133 45.9369 64.1133 45.6991C64.1133 45.222 64.2866 44.8111 64.6333 44.4679C64.9799 44.1247 65.395 43.9531 65.8769 43.9531C66.3589 43.9531 66.7709 44.1247 67.11 44.4679C67.449 44.8111 67.6193 45.2205 67.6193 45.6991C67.6193 46.1778 67.4505 46.5827 67.11 46.9183C66.7709 47.254 66.3589 47.421 65.8769 47.421ZM64.1148 49.1941H67.6193V60.3595H64.1148V49.1941Z" fill="#262260"/>
<path d="M102.01 7.44234C102.489 8.06699 107.002 14.2608 107.457 14.896C111.635 20.7315 119.667 20.3191 125.815 18.7221C123.293 18.1336 121.836 17.0815 120.737 15.5944C118.387 12.4034 115.428 7.84573 113.856 5.95372C112.255 3.93378 109.526 2.89972 106.935 3.05777C104.937 4.09032 103.411 5.75353 102.01 7.44234Z" fill="url(#paint0_radial_60_3595)"/>
<path d="M27.1633 6.30594C28.7065 4.17161 31.4021 3.04273 34.0491 3.0638C37.4396 3.05928 40.827 3.02316 44.2175 3.09992C42.2167 4.13548 40.7054 5.80321 39.3066 7.48901C33.6234 14.6672 29.8696 23.0375 24.7778 30.5889C22.3467 33.9138 19.7803 37.7596 15.4289 38.8132C11.3254 39.7524 7.06071 39.0013 2.89636 39.331C6.29595 37.8499 8.69208 34.9645 10.8541 32.1242C16.8322 23.8487 20.802 14.3421 27.1633 6.30594ZM52.0764 7.09917C49.6422 10.2058 47.6095 13.5925 45.636 16.9852C42.4842 22.3722 39.667 27.9805 35.8189 32.9505C33.8226 35.4852 31.5815 38.0275 28.4845 39.3114C31.6074 39.188 34.7348 39.3024 37.8607 39.2467C40.8483 39.2106 43.8739 38.0967 45.969 35.9895C48.356 33.6038 50.2245 30.7996 52.0961 28.0271C54.3798 24.4493 56.37 20.7014 58.5259 17.0514C60.4704 13.7566 62.488 10.4813 64.8902 7.47998C66.2905 5.78967 67.817 4.12645 69.8163 3.09541C66.1369 3.04875 62.4591 3.00811 58.7813 3.10444C55.9959 3.24893 53.5937 4.90011 52.0764 7.09917ZM83.8844 16.7097C81.6525 20.3116 79.6623 24.0489 77.4927 27.6824C75.6728 30.6958 73.6385 33.6324 71.0858 36.1204C69.7752 37.3547 68.3308 38.4715 66.6706 39.2241C69.6718 39.2843 72.6746 39.2512 75.6804 39.2572C78.6893 39.2843 81.6996 38.1961 83.8981 36.1957C86.4508 33.7076 88.5034 30.7831 90.3354 27.7788C92.6768 23.8217 94.8799 19.7848 97.3049 15.8728C97.3946 15.7253 97.5786 15.4228 97.6728 15.2768C99.5687 12.2017 101.513 9.13266 103.873 6.36163C104.978 5.00999 107.91 3.04423 107.91 3.04423C107.91 3.04423 101.22 3.04122 97.8766 3.05477C95.3573 3.02316 92.7285 3.96088 91.1519 5.92664C88.3331 9.25608 86.1939 13.0446 83.8844 16.7097Z" fill="url(#paint1_linear_60_3595)"/>
<path d="M44.219 3.09841C47.392 2.81544 50.3841 4.55994 52.0763 7.09917C49.6422 10.2058 47.6094 13.5925 45.636 16.9851C43.6473 13.746 41.651 10.4978 39.3081 7.4875C40.7069 5.80171 42.2181 4.13397 44.219 3.09841ZM64.8886 7.47847C69.7493 13.8107 73.3648 20.9106 77.4927 27.6824C79.6623 24.0489 81.6524 20.3101 83.8844 16.7097C81.7148 13.013 79.4935 9.31177 76.7355 5.98985C75.133 3.9684 72.4054 2.93284 69.8147 3.0939C67.8154 4.12494 66.2889 5.78816 64.8886 7.47847ZM57.8812 35.7005C60.0812 38.047 63.4139 39.3611 66.6705 39.2241C68.3308 38.473 69.7767 37.3547 71.0857 36.1204C65.7294 30.5483 62.4393 23.5582 58.5243 17.0484C56.3684 20.6984 54.3782 24.4463 52.0946 28.0241C53.8248 30.7153 55.666 33.3599 57.8812 35.7005ZM89.8458 39.0676C93.6225 39.5447 97.4569 39.0826 101.255 39.337C96.2467 36.9708 93.2728 32.1377 90.3369 27.7772C88.5048 30.7831 86.4508 33.7061 83.8996 36.1942C85.5781 37.6361 87.62 38.7018 89.8458 39.0676Z" fill="url(#paint2_radial_60_3595)"/>
<path fill-rule="evenodd" clip-rule="evenodd" d="M104.5 43.915H103.331L94.8832 60.7429H99.8534L100.056 60.2441C100.354 59.512 100.665 58.7675 100.99 58.0215H106.84C107.165 58.7677 107.477 59.5124 107.776 60.2452L107.979 60.7429H112.948L104.5 43.915ZM105.039 53.9862H102.79C103.166 53.1777 103.541 52.3788 103.918 51.6009C104.291 52.3795 104.665 53.1785 105.039 53.9862Z" fill="#FAA21B"/>
<path fill-rule="evenodd" clip-rule="evenodd" d="M119.78 43.8408C117.928 43.8408 116.339 44.278 115.198 45.216C114.035 46.1728 113.44 47.5674 113.44 49.2497C113.44 50.8678 113.962 52.0141 114.959 52.8191C115.887 53.5692 117.157 53.9566 118.473 54.2894L118.475 54.2899L119.201 54.4714L119.202 54.4717C120.043 54.6852 120.669 54.8894 121.079 55.1457C121.445 55.374 121.549 55.5786 121.548 55.8459V55.8468C121.548 56.1293 121.447 56.3342 121.139 56.5143C120.774 56.7275 120.116 56.8952 119.052 56.8952C118.042 56.8952 116.537 56.6519 115.152 56.0318L114.026 55.5273V59.4728L114.445 59.6995C115.919 60.4957 118.168 60.8719 119.841 60.8719C121.676 60.8719 123.245 60.4092 124.369 59.4602C125.511 58.4963 126.101 57.1075 126.101 55.463C126.101 53.7964 125.53 52.5514 124.528 51.6544C123.562 50.7901 122.264 50.3096 120.913 49.9939L120.911 49.9936L120.204 49.831L120.203 49.8308C119.387 49.6416 118.799 49.4897 118.408 49.2773C118.226 49.1787 118.134 49.0908 118.087 49.0227C118.047 48.9653 118.013 48.8864 118.013 48.7424C118.013 48.5069 118.092 48.3326 118.39 48.1681C118.749 47.9701 119.397 47.816 120.448 47.816C121.395 47.816 122.763 48.0392 124.219 48.5258L125.272 48.878V45.0236L124.783 44.8173C123.28 44.1835 121.434 43.8408 119.78 43.8408Z" fill="#FAA21B"/>
<path d="M104.44 43.998L104.461 44.0402C104.455 44.0251 104.448 44.0116 104.44 43.998Z" fill="#FAA21B"/>
<path d="M103.426 43.9316C103.4 43.9693 103.38 44.0129 103.364 44.0566L103.426 43.9316Z" fill="#FAA21B"/>
<path d="M104.509 43.7271L104.487 43.6849C104.39 43.4938 104.192 43.3613 103.963 43.3613C103.759 43.3613 103.58 43.4637 103.473 43.6187L103.411 43.7436L102.24 46.0752L105.6 46.1613L104.509 43.7271Z" fill="#FAA21B"/>
<path fill-rule="evenodd" clip-rule="evenodd" d="M74.8212 43.915H75.6212C76.0255 43.915 76.4026 44.1142 76.6754 44.288C76.9797 44.482 77.3081 44.7473 77.6452 45.0518C78.322 45.6631 79.1087 46.5006 79.9214 47.4292C81.3019 49.0067 82.8002 50.897 84.0338 52.5096C85.2695 50.8965 86.772 49.0062 88.1548 47.4287C88.9687 46.5002 89.7558 45.6631 90.4312 45.0522C90.7675 44.748 91.0947 44.4828 91.3971 44.2891C91.6667 44.1163 92.0433 43.915 92.4473 43.915H93.2473V60.7429H88.7302L88.7801 53.5798L84.5089 59.1173H84.3512C84.2608 59.176 84.1534 59.2107 84.0365 59.2107C83.9198 59.2107 83.8129 59.1759 83.7224 59.1173H83.5604L79.2954 53.5714L79.3614 60.7414H74.8212V43.915Z" fill="#FAA21B"/>
<defs>
<radialGradient id="paint0_radial_60_3595" cx="0" cy="0" r="1" gradientUnits="userSpaceOnUse" gradientTransform="translate(117.07 19.6138) scale(14.7266 14.2709)">
<stop stop-color="#FED604"/>
<stop offset="0.5818" stop-color="#F8AC1C"/>
<stop offset="1" stop-color="#D57027"/>
</radialGradient>
<linearGradient id="paint1_linear_60_3595" x1="7.00112" y1="32.4159" x2="108.916" y2="8.0637" gradientUnits="userSpaceOnUse">
<stop stop-color="#24B2E7"/>
<stop offset="0.0949" stop-color="#2C92C5"/>
<stop offset="0.2158" stop-color="#2E73A8"/>
<stop offset="0.3398" stop-color="#2D5C93"/>
<stop offset="0.4651" stop-color="#2C4983"/>
<stop offset="0.5918" stop-color="#2B3A78"/>
<stop offset="0.7206" stop-color="#2A2F71"/>
<stop offset="0.8527" stop-color="#2A286D"/>
<stop offset="0.9934" stop-color="#2A266C"/>
</linearGradient>
<radialGradient id="paint2_radial_60_3595" cx="0" cy="0" r="1" gradientUnits="userSpaceOnUse" gradientTransform="translate(70.2818 21.2028) scale(25.5885 24.7969)">
<stop stop-color="#FED604"/>
<stop offset="0.5818" stop-color="#F8AC1C"/>
<stop offset="1" stop-color="#D57027"/>
</radialGradient>
</defs>
</svg>
