{
  "type": "service_account",
  "project_id": "my-project-70111-1690441973304",
  "private_key_id": "5cf4c2ebbf8c4a875b4dd65a658663f009c201ee",
  "private_key": "-----BEGIN PRIVATE KEY-----\nMIIEvwIBADANBgkqhkiG9w0BAQEFAASCBKkwggSlAgEAAoIBAQDaKZ3D6ty4TrfA\nYaenawmGlxX3mTLZWx+d/iIL7ZbfjSxAMTeFYdiHh48xFdso+LplIXuuaWa35qRa\n786v8wzh2gp0bwyHi/GoGBNnQtzjymAMYQqbcSpJDqmHmXo5dQoTxWd68QbAV6RG\nvNU9yIAHkZ8tIgYw25VKYWhRJh5HKp32h8EBoxTOFT7kD4o/Giu8xAi4Nk2eEJSo\ntJTk8UcpFu+pRr12QtEygaDEfBA5IPrVe4hiLxFQ7hjOyDKoVSYZ8edDABaXgwTm\n/mfIREAMauGvHk1I/I39Zg10VhO7Bw+mOi25AA2oT3OhXyIV7G/qC3onT1JTjQ2d\nPfxUMgSbAgMBAAECggEADRKy8lG/0DuUJa8azZyyAW996kxmQ6gcooPfPmyKWFl5\nVI9rQeiCTsmZk9nSoqEYNx8xuvRBKrWWruxX3ytNX+tU9qbNtWgP0k0/CTantFUl\nB39F+qXMk69eCuyJ6nXpy+C0bSWSv5i0FP96N8cs0a2xDPjqlHSHSa6ONbt3Bp4z\njRWldNcr8T8IwkyuucgMDwngvf5gLtAS6NYuBvNgfk9z61HiWnTM6qw9c6IrZ8ij\nOaZoWLzLidiWY1pvYNxggC7x7T61EzIFLcjFjmMtgafBFGQlgvCfPnlUTurfAWIU\njYXBH3CModBWRBXXYkhS0FQG/qvVG458nXMplI3coQKBgQD+vFOzIA+EI2U8nqKf\nojWh89HsxWzlJ5B2T0h+t/24sjywwWxkX8ompJZjZWJPLQc1U1OZteI6oDXcKOHJ\nw01gg5UckBPQbxOk+3CWxpZtv50hag6IlGEQDq8ASCETd8gdzCkbK34DRdMSZDYZ\nWv+q8LU4Nk4AkbQhBhD7nEvS3QKBgQDbPtGWZuF6HHB2/45UUKBdGcFCfrVLBoUD\nOXzz5F9ijIzQvhF2/8oco4mbxQZQHxSEVFCVMFHGWhd/gc+0CQd5dxvv68a7XpKa\nZFxRWSMp9eSswauR+Midb/SP/6xMEieqEYHa4kw3zxn4IYOm1pU+cF1Xgv6slrG/\nvxWZUzxR1wKBgQDsoWcjG2Iufm7ZjAdHQPiPVB4q0w6gJEuXC3ktdZ80hiXIkDUv\nXKg9k2C8Pn6/S/XJPHmJbSMVEKRXuoZb1Ze4UyMd4Fz3n2dhN81T0nAEzR2a35lW\nmHc94lYAbgCDxB5aR7/bpGAvjBpRmFOE5Dphwa6l5BQ7hR4OG0OFZ6Ar5QKBgQCj\nocnpV9W3PpyNpASFVzuo4L0FtO34FeCWXISuvuaV9dJvRTxhtV0SbNgagz1H9Tpp\n3UfbYRnXUYwyJR9w/kAu3r/iG/XSCC6gvoDMUhvViGloqo8zvht0rYc5JhhhGjey\nTai+RaGfEZoPQGwyy/rNhC2WT/VluH7nXmVvbtkZNwKBgQDOv+o8YaoCqADaZS/B\nP8/IMrqhCH3ACmn1auZmSyp/BXrsJRSWGDFz6pWg1P2+KK9Fs+pIboT+vJSXsleJ\nhCvGZBJWwkihoMwBu3s6xzyBEZDdoQtbHj1c0ZjVq3mF10Nd9p/dGy/GwVrBwH2/\nsyy/0lY0Cjl+v1/Ok+o42PCe1A==\n-----END PRIVATE KEY-----\n",
  "client_email": "gadaimastest123@my-project-70111-1690441973304.iam.gserviceaccount.com",
  "client_id": "116026334153793798178",
  "auth_uri": "https://accounts.google.com/o/oauth2/auth",
  "token_uri": "https://oauth2.googleapis.com/token",
  "auth_provider_x509_cert_url": "https://www.googleapis.com/oauth2/v1/certs",
  "client_x509_cert_url": "https://www.googleapis.com/robot/v1/metadata/x509/gadaimastest123%40my-project-70111-1690441973304.iam.gserviceaccount.com",
  "universe_domain": "googleapis.com"
}
