[
    {
      "id": 1,
      "name": "Apple iPhone 13 128GB",
      "price": 29299,
      "imgUrl": "1.jpg",
      "article": "791578",
      "color": "Midnight",
      "memory": "128GB"
    },
    {
      "id": 2,
      "name": "Apple iPhone 11",
      "price": 23199,
      "imgUrl": "2.jpg",
      "article": "786544",
      "color": "black",
      "memory": "128GB"
    },
    {
      "id": 3,
      "name": "Apple iPhone 14 plus",
      "price": 34999,
      "imgUrl": "3.jpg",
      "article": "657084",
      "color": "white",
      "memory": "512GB"
    },
    {
      "id": 4,
      "name": "Apple iPhone 14 pro max",
      "price": 47499,
      "imgUrl": "4.jpg",
      "article": "658014",
      "color": "black",
      "memory": "256GB"
    },
    {
      "id": 5,
      "name": "Apple iPhone 14",
      "price": 33499,
      "imgUrl": "5.jpg",
      "article": "659020",
      "color": "red",
      "memory": "128GB"
    },
    {
      "id": 6,
      "name": "Apple iPhone 13",
      "price": 29299,
      "imgUrl": "6.jpg",
      "article": "134050",
      "color": "blue",
      "memory": "512GB"
    },
    {
      "id": 7,
      "name": "Apple iPhone 14",
      "price": 32299,
      "imgUrl": "7.jpg",
      "article": "146258",
      "color": "yellow",
      "memory":"128GB"
    },
    {
      "id": 8,
      "name": "Apple iPhone 14 mini",
      "price": 25599,
      "imgUrl": "8.jpg",
      "article": "145050",
      "color": "purple",
      "memory":"256GB"
    },
    {
      "id": 9,
      "name": "Apple iPhone SE 2020",
      "price": 18100,
      "imgUrl": "9.png",
      "article": "205020",
      "color": "white",
      "memory":"128GB"
    },
    {
      "id": 10,
      "name": "Apple iPhone XR",
      "price": 15799,
      "imgUrl": "10.jpg",
      "article": "698210",
      "color": "black",
      "memory":"128GB"
    }
  ]

