{
    "user": {
        "address": {
            "flat": "Flat 2",
            "town": "London",
            "building": "Horizon building",
            "postcode": "W3 6BS",
            "streetName": "Churchfield Road",
            "buildingNumber": "71",
            "country": "GB"
        },
        "contacts": {
            "email": "$email",
            "phoneNumber": "+44 3260262396"
        },
        "documents": [],
        "citizenships": [
            {
                "country": "GB",
                "identifierType": "national-insurance-number",
                "identifierValue": "$nino"
            }
        ],
        "taxResidence": {
            "country": "GB",
            "identifierType": "national-insurance-number",
            "identifierValue": "$nino"
        },
        "personalDetails": {
            "gender": "male",
            "lastName": "Doe",
            "firstName": "John",
            "middleName": "Donald",
            "dateOfBirth": "1970-06-28"
        }
    },
    "externalId": "$ext_id-$test_id-$number",
    "portfolios": [
        {
            "name": "Long term investment portfolio",
            "type": "gia",
            "amount": 100.55,
            "riskLevel": 3,
            "externalId": "w-$ext_id-1",
            "investmentStyle": "classic",
            "timeHorizonYears": 5,
            "recurringPayments": [
                {
                    "amount": 200,
                    "paymentDay": 5,
                    "bankAccount": {
                        "sortCode": "200000",
                        "accountNumber": "12345678"
                    }
                }
            ]
        },
        {
            "name": "One more gia",
            "type": "gia",
            "amount": 1000.55,
            "riskLevel": 3,
            "externalId": "w-$ext_id-2",
            "investmentStyle": "classic",
            "timeHorizonYears": 5,
            "recurringPayments": [
                {
                    "amount": 20,
                    "paymentDay": 5,
                    "bankAccount": {
                        "sortCode": "200000",
                        "accountNumber": "12345678"
                    }
                }
            ]
        },
        {
            "name": "Jisa doesn't matter",
            "type": "jisa",
            "amount": 10375.55,
            "isaType": "stocks-and-shares",
            "reference": "string",
            "riskLevel": 3,
            "dateOpened": "1970-06-28",
            "externalId": "ws-$ext_id-3",
            "beneficiary": {
                "address": {
                    "flat": "Flat 1",
                    "town": "London",
                    "country": "GB",
                    "building": "Horizon building",
                    "postcode": "W3 6BS",
                    "streetName": "Churchfield Road",
                    "buildingNumber": "71"
                },
                "lastName": "Doe",
                "firstName": "John",
                "middleName": "string",
                "dateOfBirth": "2020-06-28",
                "citizenships": [

                ],
                "taxResidence": {
                    "country": "GB"
                }
            },
            "investmentStyle": "classic",
            "timeHorizonYears": 5,
            "recurringPayments": [
                {
                    "amount": 200,
                    "paymentDay": 5,
                    "bankAccount": {
                        "sortCode": "200000",
                        "accountNumber": "12345678"
                    }
                }
            ],
            "dateOfFirstSubscription": "1970-06-28",
            "currentTaxYearContribution": 2500
        },
        {
            "name": "Second Jisa",
            "type": "jisa",
            "amount": 5000.55,
            "isaType": "stocks-and-shares",
            "reference": "string",
            "riskLevel": 3,
            "dateOpened": "1970-06-28",
            "externalId": "ws-$ext_id-4",
            "beneficiary": {
                "address": {
                    "flat": "Flat 1",
                    "town": "London",
                    "country": "GB",
                    "building": "Horizon building",
                    "postcode": "W3 6BS",
                    "streetName": "Churchfield Road",
                    "buildingNumber": "71"
                },
                "lastName": "Doe",
                "firstName": "John",
                "middleName": "string",
                "dateOfBirth": "2020-06-28",
                "citizenships": [

                ],
                "taxResidence": {
                    "country": "GB"
                }
            },
            "investmentStyle": "classic",
            "timeHorizonYears": 5,
            "recurringPayments": [
                {
                    "amount": 200,
                    "paymentDay": 5,
                    "bankAccount": {
                        "sortCode": "200000",
                        "accountNumber": "12345678"
                    }
                }
            ],
            "dateOfFirstSubscription": "1970-06-28",
            "currentTaxYearContribution": 2500
        },
        {
            "name": "my ISA",
            "type": "isa",
            "amount": 10375.55,
            "isaType": "stocks-and-shares",
            "reference": "string",
            "riskLevel": 7,
            "externalId": "ws-$ext_id-5",
            "investmentStyle": "classic",
            "timeHorizonYears": 5,
            "recurringPayments": [
                {
                    "amount": 200,
                    "paymentDay": 5,
                    "bankAccount": {
                        "sortCode": "200000",
                        "accountNumber": "12345678"
                    }
                }
            ],
            "currentTaxYearContribution": 2500
        },
        {
            "name": "One more ISA",
            "type": "isa",
            "amount": 20375.55,
            "isaType": "stocks-and-shares",
            "reference": "string",
            "riskLevel": 7,
            "externalId": "ws-$ext_id-6",
            "investmentStyle": "classic",
            "timeHorizonYears": 5,
            "recurringPayments": [
                {
                    "amount": 200,
                    "paymentDay": 5,
                    "bankAccount": {
                        "sortCode": "200000",
                        "accountNumber": "12345678"
                    }
                }
            ],
            "currentTaxYearContribution": 2500
        }
    ],
    "riskProfile": {
        "totalAssets": 50000,
        "annualIncome": 45000,
        "incomeSource": "no-income",
        "riskProfileScore": 0.6,
        "annualSavingsPercentage": 0.1,
        "financialExperienceScore": 0.75,
        "suitabilityAssessmentDate": "2021-10-01T22:33:44"
    },
    "bankAccounts": [
        {
            "sortCode": "200000",
            "accountNumber": "12345678"
        }
    ],
    "antiMoneyLaunderingDetails": {
        "assetOrigin": "savings-from-income",
        "assetOriginOther": "Crypto trading",
        "economicActivityTypeRisky": true
    }
}