554a78d87261692b00710400
551bc2ca7261692b55981300
53330ad9cb4c27894a0000be
4f5f64c13b555230ac000004
53ee751c6361721944780200
511294005c85615a61000082
4f5f64c13b555230ac000001
537def3c139b21353f0006a6
5449631e72616950aa781400
505fa4d3e22288000200007d
4e96f6cabe2b4e0001002f33
557c893f7261692b8c0001eb
529c4b09139b21cdd4000250
55255e8d7261695ba22f0300
52840714275b2442c8000150
