Typo and fix Customer -> Custom

32 jobs for andrew30-master-patch-10537 in 40 minutes and 54 seconds (queued for 1 second)
Status Job ID Name Coverage
  Prebuild
passed #255827065
check feature flags docs

00:01:16

passed #255827061
clone test repo

00:01:09

passed #255827064
dep check

00:01:27

passed #255827060
docker
helper images

00:06:25

manual #255827062
allowed to fail manual
review-docs-deploy
passed #255827063
gitlab-org
tests definitions

00:03:12

 
  Test
passed #255827067
code_quality

00:01:49

passed #255827078
docs lint

00:01:00

passed #255827079
git 1.7.1

00:02:11

passed #255827066
allowed to fail
license_management

00:03:07

passed #255827068
docker
unit test 1/5

00:11:02

passed #255827069
docker
unit test 2/5

00:20:04

passed #255827070
docker
unit test 3/5

00:12:16

passed #255827071
docker
unit test 4/5

00:04:58

passed #255827072
docker
unit test 5/5

00:07:15

failed #255827073
docker allowed to fail
unit test with race 1/5

00:13:23

failed #255827074
docker allowed to fail
unit test with race 2/5

00:21:57

failed #255827075
docker allowed to fail
unit test with race 3/5

00:13:57

passed #255827076
docker allowed to fail
unit test with race 4/5

00:05:34

passed #255827077
docker allowed to fail
unit test with race 5/5

00:08:36

 
  Coverage
passed #255827081
race conditions detector

00:01:06

passed #255827080
test coverage report

00:01:06

63.4%
passed #255827082
test junit report

00:01:22

 
  Build
passed #255827083
gitlab-org
binaries darwin/386 darwin/amd64

00:03:55

passed #255827084
gitlab-org
binaries freebsd/386 freebsd/amd64 freebsd/arm

00:05:19

passed #255827085
gitlab-org
binaries linux/386 linux/amd64 linux/arm

00:04:57

passed #255827086
gitlab-org
binaries windows/386 windows/amd64

00:03:47

 
  Package
passed #255827087
gitlab-org
package-deb

00:01:24

passed #255827088
gitlab-org
package-rpm

00:01:29

 
  Release
passed #255827089
docker
development docker images

00:03:32

passed #255827090
static QA

00:00:32

 
  Cleanup
manual #255827091
allowed to fail manual
review-docs-cleanup
 
Name Stage Failure
failed
unit test with race 2/5 Test
coverage: 47.6% of statements
ok gitlab.com/gitlab-org/gitlab-runner/executors/docker/internal/volumes 1.133s
Makefile:121: recipe for target 'parallel_test_execute' failed
make: *** [parallel_test_execute] Error 1
Uploading artifacts...
.cover/*: found 14 matching files
.testoutput/*: found 14 matching files

Uploading artifacts to coordinator... ok
id=255827074 responseStatus=201 Created token=WGibYakN
ERROR: Job failed: exit code 1
failed
unit test with race 3/5 Test
coverage: 73.7% of statements
ok gitlab.com/gitlab-org/gitlab-runner/executors/ssh 1.073s
Makefile:121: recipe for target 'parallel_test_execute' failed
make: *** [parallel_test_execute] Error 1
Uploading artifacts...
.cover/*: found 14 matching files
.testoutput/*: found 14 matching files

Uploading artifacts to coordinator... ok
id=255827075 responseStatus=201 Created token=ygL9xfa5
ERROR: Job failed: exit code 1
failed
unit test with race 1/5 Test
coverage: 6.0% of statements
ok gitlab.com/gitlab-org/gitlab-runner/common 1.065s
Makefile:121: recipe for target 'parallel_test_execute' failed
make: *** [parallel_test_execute] Error 1
Uploading artifacts...
.cover/*: found 14 matching files
.testoutput/*: found 14 matching files

Uploading artifacts to coordinator... ok
id=255827073 responseStatus=201 Created token=4urTgHvZ
ERROR: Job failed: exit code 1