Division,WeightClassKg,Place,Name,Team,BodyweightKg,Best3SquatKg,Best3BenchKg,Best3DeadliftKg,TotalKg,Equipment,Event,Sex
Girls,44.23,1,Leeann Lucio,El Maton Tidehaven,42.05,74.84,38.56,83.91,197.31,Single-ply,SBD,F
Girls,44.23,2,Yennifer Lopez,Cleveland,36.97,56.7,29.48,68.04,154.22,Single-ply,SBD,F
Girls,44.23,DQ,Jania Lopez,Cleveland,43.86,,,,,Single-ply,SBD,F
Girls,44.23,DQ,Kristal Ramirez,Cleveland,37.01,,,,,Single-ply,SBD,F
Girls,47.85,1,Jessica Cordova,Cleveland,47.85,102.06,31.75,117.93,251.74,Single-ply,SBD,F
Girls,47.85,2,Shelby Sliva,El Maton Tidehaven,47.17,88.45,54.43,92.99,235.87,Single-ply,SBD,F
Girls,47.85,3,Angelina Balsemo,El Maton Tidehaven,45.13,56.7,34.02,56.7,147.42,Single-ply,SBD,F
Girls,47.85,DQ,Madison Dyer,El Maton Tidehaven,47.85,,,,,Single-ply,SBD,F
Girls,51.94,1,Sara Faas,El Maton Tidehaven,49.62,102.06,56.7,113.4,272.16,Single-ply,SBD,F
Girls,51.94,2,Kirslynn Rendon,Victoria West,50.08,90.72,49.9,97.52,238.14,Single-ply,SBD,F
Girls,51.94,3,Esmerelda Guzman,Cleveland,48.81,92.99,29.48,102.06,224.53,Single-ply,SBD,F
Girls,51.94,4,Halia Balsemo,El Maton Tidehaven,48.44,54.43,36.29,63.5,154.22,Single-ply,SBD,F
Girls,51.94,DQ,Taiylor Poe,El Maton Tidehaven,50.17,,,,,Single-ply,SBD,F
Girls,51.94,DQ,Alondra Salinas,Bloomington,49.17,,,,,Single-ply,SBD,F
Girls,56.02,1,Lacey Littles,Victoria West,53.8,117.93,56.7,131.54,306.17,Single-ply,SBD,F
Girls,56.02,2,Kirsten Adams,Victoria West,53.98,106.59,40.82,102.06,249.48,Single-ply,SBD,F
Girls,56.02,3,Anna Trammell,Danbury,55.34,95.25,43.09,106.59,244.94,Single-ply,SBD,F
Girls,56.02,4,Acasia Martinez,Ganado,53.3,83.91,36.29,111.13,231.33,Single-ply,SBD,F
Girls,56.02,5,Angolina Quiroga,Van Vleck,53.66,90.72,45.36,95.25,231.33,Single-ply,SBD,F
Girls,56.02,6,Lianna Macias,Cleveland,52.21,92.99,36.29,92.99,222.26,Single-ply,SBD,F
Girls,56.02,7,Samantha Ragon,Cleveland,55.52,97.52,29.48,92.99,219.99,Single-ply,SBD,F
Girls,56.02,8,Krystal Mota,Cleveland,55.29,81.65,40.82,90.72,213.19,Single-ply,SBD,F
Girls,56.02,9,Frida Pedrero,Ganado,55.97,77.11,43.09,83.91,204.12,Single-ply,SBD,F
Girls,56.02,10,Breanna Wilson,Danbury,53.48,74.84,34.02,90.72,199.58,Single-ply,SBD,F
Girls,56.02,11,Suzanne Ovieda,Cleveland,55.88,70.31,34.02,79.38,183.7,Single-ply,SBD,F
Girls,56.02,12,Emily Elizalde,Cleveland,53.52,52.16,24.95,74.84,151.95,Single-ply,SBD,F
Girls,56.02,DQ,Celeste Barron,Cleveland,54.66,,,,,Single-ply,SBD,F
Girls,56.02,DQ,Jessica Price #2,Cleveland,52.21,,,,,Single-ply,SBD,F
Girls,56.02,DQ,Natalie Ledwig,El Maton Tidehaven,55.88,,,,,Single-ply,SBD,F
Girls,56.02,DQ,Ariel Sanchez,Victoria West,55.2,,,,,Single-ply,SBD,F
Girls,60.1,1,Ahime Andrade,Cleveland,58.06,92.99,52.16,108.86,254.01,Single-ply,SBD,F
Girls,60.1,2,Breanne Kana,El Maton Tidehaven,57.74,88.45,52.16,104.33,244.94,Single-ply,SBD,F
Girls,60.1,3,Cassandra Torres,El Maton Tidehaven,59.42,52.16,31.75,74.84,158.76,Single-ply,SBD,F
Girls,60.1,4,Nadia DeLaRosa,Cleveland,56.25,45.36,29.48,74.84,149.69,Single-ply,SBD,F
Girls,60.1,DQ,Vivian Velasquez,Cleveland,58.88,,,,,Single-ply,SBD,F
Girls,67.36,1,Ariana Garay,El Maton Tidehaven,60.55,129.27,70.31,131.54,331.12,Single-ply,SBD,F
Girls,67.36,2,Christine Wenske,Victoria West,67.04,138.35,56.7,127.01,322.05,Single-ply,SBD,F
Girls,67.36,3,Gisella Gonzales,El Maton Tidehaven,67.36,108.86,61.23,120.2,290.3,Single-ply,SBD,F
Girls,67.36,4,Brittnee Kramer,Danbury,67.13,95.25,61.23,113.4,269.89,Single-ply,SBD,F
Girls,67.36,5,Callie Nelson,Victoria St. Joseph,65.95,104.33,58.97,104.33,267.62,Single-ply,SBD,F
Girls,67.36,6,Haley Kohn,Danbury,63.5,97.52,56.7,111.13,265.35,Single-ply,SBD,F
Girls,67.36,7,Natalie Arzola,Cleveland,67.09,97.52,45.36,102.06,244.94,Single-ply,SBD,F
Girls,67.36,8,Emerald Trevino,Victoria East,66.09,83.91,45.36,86.18,215.46,Single-ply,SBD,F
Girls,67.36,9,Ashlee Harlan,Danbury,60.65,72.57,38.56,90.72,201.85,Single-ply,SBD,F
Girls,67.36,10,Evelyn Torres,Cleveland,60.51,74.84,31.75,88.45,195.04,Single-ply,SBD,F
Girls,67.36,11,MaKayla Hernandez,Bloomington,60.33,74.84,29.48,86.18,190.51,Single-ply,SBD,F
Girls,67.36,12,Alondra Castillo,Cleveland,61.46,61.23,27.22,68.04,156.49,Single-ply,SBD,F
Girls,67.36,DQ,Kasey Crouch,Cleveland,65.36,,,,,Single-ply,SBD,F
Girls,67.36,DQ,Madison Diaz,Bloomington,63.05,79.38,,,,Single-ply,SBD,F
Girls,67.36,DQ,Donna Barajas,Ganado,60.87,79.38,38.56,,,Single-ply,SBD,F
Girls,75.07,1,Shamaurie Williams,El Maton Tidehaven,73.8,172.37,95.25,185.97,453.59,Single-ply,SBD,F
Girls,75.07,2,Allana Subblett,Ganado,70.85,136.08,54.43,120.2,310.71,Single-ply,SBD,F
Girls,75.07,3,Maddison Longoria,Victoria St. Joseph,72.26,115.67,54.43,129.27,299.37,Single-ply,SBD,F
Girls,75.07,4,Allison Dentler,Victoria West,74.3,131.54,61.23,106.59,299.37,Single-ply,SBD,F
Girls,75.07,5,Amber Garza,Victoria East,74.21,122.47,43.09,120.2,285.76,Single-ply,SBD,F
Girls,75.07,6,Michala Sulak,Louise,69.54,124.74,58.97,97.52,281.23,Single-ply,SBD,F
Girls,75.07,7,Alyssa Crouch,Cleveland,71.17,102.06,65.77,113.4,281.23,Single-ply,SBD,F
Girls,75.07,8,Jessica Alcalias,Louise,68.63,97.52,40.82,108.86,247.21,Single-ply,SBD,F
Girls,75.07,9,Destiny Gonzales,Victoria West,72.21,92.99,47.63,97.52,238.14,Single-ply,SBD,F
Girls,75.07,10,Jasmine Roman,Cleveland,68.13,72.57,38.56,102.06,213.19,Single-ply,SBD,F
Girls,75.07,DQ,Josie Balderaz,Victoria West,73.03,,,,,Single-ply,SBD,F
Girls,82.33,1,Desiree Vega,El Maton Tidehaven,79.24,147.42,77.11,142.88,367.41,Single-ply,SBD,F
Girls,82.33,2,Kansas Smith,Edna,81.74,138.35,68.04,140.61,347,Single-ply,SBD,F
Girls,82.33,3,Bailee Burris,Victoria St. Joseph,78.34,129.27,65.77,120.2,315.25,Single-ply,SBD,F
Girls,82.33,4,Anisa Rodriguez,El Maton Tidehaven,82.24,117.93,63.5,131.54,312.98,Single-ply,SBD,F
Girls,82.33,5,Shayana Martinez-Sanchez,Edna,76.2,117.93,58.97,124.74,301.64,Single-ply,SBD,F
Girls,82.33,6,Emily Barboza,Cleveland,76.2,115.67,70.31,113.4,299.37,Single-ply,SBD,F
Girls,82.33,7,Chloe Montalvo,Van Vleck,78.79,113.4,65.77,113.4,292.57,Single-ply,SBD,F
Girls,82.33,DQ,Lauren Flores,Victoria East,77.79,,,,,Single-ply,SBD,F
Girls,82.33,DQ,Gabby Gonzales,Victoria St. Joseph,77.52,,,,,Single-ply,SBD,F
Girls,82.33,DQ,Madison Flores,Bloomington,79.06,,,,,Single-ply,SBD,F
Girls,90.04,1,Rebecca Morgan,Victoria West,82.64,90.72,43.09,120.2,254.01,Single-ply,SBD,F
Girls,90.04,2,Abby Carrillo,El Maton Tidehaven,88.04,92.99,40.82,113.4,247.21,Single-ply,SBD,F
Girls,90.04,DQ,Serena DeAnda,Bloomington,88.27,,,,,Single-ply,SBD,F
Girls,100.02,1,Karla Moreno,El Maton Tidehaven,93.98,142.88,70.31,158.76,371.95,Single-ply,SBD,F
Girls,100.02,2,Kaci Rael,Victoria St. Joseph,99.93,147.42,79.38,131.54,358.34,Single-ply,SBD,F
Girls,100.02,3,Courtney Junious,Edna,97.52,140.61,68.04,138.35,347,Single-ply,SBD,F
Girls,100.02,4,Annalise Soto,El Maton Tidehaven,99.7,113.4,72.57,124.74,310.71,Single-ply,SBD,F
Girls,100.02,5,Sarah Balderaz,Victoria West,99.93,133.81,56.7,117.93,308.44,Single-ply,SBD,F
Girls,100.02,6,Paula Turnabide,El Maton Tidehaven,96.43,117.93,54.43,104.33,276.69,Single-ply,SBD,F
Girls,100.02,7,Katy Dunbar,Ganado,94.44,65.77,36.29,102.06,204.12,Single-ply,SBD,F
Girls,117.71,1,Bennett Welch,Victoria St. Joseph,101.15,122.47,56.7,136.08,315.25,Single-ply,SBD,F
Girls,117.71,DQ,Kerrigan Keating,Van Vleck,115.08,113.4,43.09,,,Single-ply,SBD,F
Girls,117.71,DQ,Celine Alaniz,Victoria West,105.87,,,,,Single-ply,SBD,F
Girls,117.71+,1,Janal Robertson,Cleveland,135.13,147.42,77.11,147.42,371.95,Single-ply,SBD,F
Girls,,NS,Julissa Aguirre,Bloomington,,,,,,Single-ply,SBD,F
Girls,,NS,Diana Gomez,Cleveland,,,,,,Single-ply,SBD,F
Girls,,NS,Macy Shipman,Danbury,,,,,,Single-ply,SBD,F
Girls,,NS,Kaelyn Aldridge,Ganado,,,,,,Single-ply,SBD,F
Girls,,NS,Kassie Jones,Ganado,,,,,,Single-ply,SBD,F
Girls,,NS,Julissa Roman,Van Vleck,,,,,,Single-ply,SBD,F
Girls,,NS,Elisa Jaimes,El Maton Tidehaven,,,,,,Single-ply,SBD,F
Girls,,NS,Maricelica Garza,Victoria East,,,,,,Single-ply,SBD,F
Girls,,NS,Madison Barton,Victoria St. Joseph,,,,,,Single-ply,SBD,F
Girls,,NS,Karolina Perez-Cancel,Victoria West,,,,,,Single-ply,SBD,F
Girls,,NS,Hope Watkins,Victoria St. Joseph,,,,,,Single-ply,SBD,F
