Division,WeightClassKg,Place,Name,Team,BodyweightKg,Best3SquatKg,Best3BenchKg,Best3DeadliftKg,TotalKg,Equipment,Event,Sex
Boys,51.71,1,Chantz Mickens,Palestine Westwood,51.71,133.81,68.04,133.81,335.66,Single-ply,SBD,M
Boys,51.71,2,Darius Mallard,Navasota,44.91,95.25,58.97,108.86,263.08,Single-ply,SBD,M
Boys,59.87,1,Brian Vizuet,Navasota,56.02,138.35,86.18,149.69,374.21,Single-ply,SBD,M
Boys,55.79,2,Stephen Jefferson,Navasota,55.79,108.86,65.77,124.74,299.37,Single-ply,SBD,M
Boys,67.13,1,Michael Murray #3,Palestine Westwood,60.1,167.83,77.11,167.83,412.77,Single-ply,SBD,M
Boys,59.87,2,Justin Marion,Huntsville,59.87,151.95,102.06,151.95,405.97,Single-ply,SBD,M
Boys,59.87,3,Theron Dingas,Palestine Westwood,59.42,140.61,79.38,161.03,381.02,Single-ply,SBD,M
Boys,59.87,4,John Acosta,Navasota,59.42,120.2,83.91,172.37,376.48,Single-ply,SBD,M
Boys,67.13,1,Tyler Linville,Palestine Westwood,65.32,145.15,90.72,172.37,408.23,Single-ply,SBD,M
Boys,67.13,2,Calvin Young,Buffalo,66.68,136.08,77.11,174.63,387.82,Single-ply,SBD,M
Boys,67.13,3,Oscar Garcia,Waller,64.64,136.08,81.65,158.76,376.48,Single-ply,SBD,M
Boys,67.13,4,Chris Carolan,Huntsville,64.86,136.08,90.72,142.88,369.68,Single-ply,SBD,M
Boys,67.13,5,Colton Frisbee,Waller,66.22,142.88,65.77,142.88,351.53,Single-ply,SBD,M
Boys,67.13,6,Paden Pringle,Groesbeck,64.86,127.01,63.5,136.08,326.59,Single-ply,SBD,M
Boys,67.13,7,Jake Maddux,Groesbeck,65.77,113.4,70.31,113.4,297.1,Single-ply,SBD,M
Boys,67.13,8,Evan Ruen,Groesbeck,63.5,104.33,63.5,113.4,281.23,Single-ply,SBD,M
Boys,67.13,DQ,Jorge Herrera,Buffalo,67.13,,,,,Single-ply,SBD,M
Boys,74.84,1,Damian Kozak,Groesbeck,71.67,192.78,108.86,188.24,489.88,Single-ply,SBD,M
Boys,74.84,2,Aurelio Dominguez,Buffalo,70.76,158.76,95.25,188.24,442.25,Single-ply,SBD,M
Boys,74.84,3,Aaron Hodges,Huntsville,74.84,156.49,99.79,181.44,437.72,Single-ply,SBD,M
Boys,74.84,4,Mario Vizuet,Navasota,74.84,154.22,104.33,170.1,428.64,Single-ply,SBD,M
Boys,74.84,5,Keon Lusk,Waller,73.48,154.22,102.06,163.29,419.57,Single-ply,SBD,M
Boys,74.84,6,Chris Booker,Waller,71.67,158.76,102.06,151.95,412.77,Single-ply,SBD,M
Boys,74.84,7,Antonio Mora,Madisonville,68.95,142.88,97.52,147.42,387.82,Single-ply,SBD,M
Boys,74.84,8,Colton Hedrick,Groesbeck,72.12,147.42,74.84,165.56,387.82,Single-ply,SBD,M
Boys,74.84,9,Ben Parrish,Groesbeck,74.39,158.76,72.57,156.49,387.82,Single-ply,SBD,M
Boys,74.84,10,Eric Garnica,Madisonville,74.84,140.61,88.45,156.49,385.55,Single-ply,SBD,M
Boys,74.84,DQ,Colton McCoy,Groesbeck,73.03,158.76,,,,Single-ply,SBD,M
Boys,82.1,1,Quinton Smith,Huntsville,81.65,217.72,122.47,226.8,566.99,Single-ply,SBD,M
Boys,82.1,2,Luke Carmichael,Palestine Westwood,81.19,190.51,115.67,226.8,532.97,Single-ply,SBD,M
Boys,82.1,3,Tyler Gessner,Navasota,81.65,185.97,117.93,188.24,492.15,Single-ply,SBD,M
Boys,82.1,4,Martin Balderas,Groesbeck,79.38,192.78,104.33,190.51,487.61,Single-ply,SBD,M
Boys,82.1,5,Bj Kwiatkowski,Waller,76.2,179.17,115.67,188.24,483.08,Single-ply,SBD,M
Boys,82.1,6,Jonathon Cates,Buffalo,76.66,170.1,102.06,170.1,442.25,Single-ply,SBD,M
Boys,82.1,7,Cody Young,Waller,77.11,149.69,83.91,176.9,410.5,Single-ply,SBD,M
Boys,82.1,8,Kasyn Hagaman,Madisonville,78.93,142.88,86.18,163.29,392.36,Single-ply,SBD,M
Boys,82.1,DQ,Juan Salinas,Groesbeck,75.75,124.74,,,,Single-ply,SBD,M
Boys,82.1,DQ,Jose Dominguez,Buffalo,77.56,204.12,,,,Single-ply,SBD,M
Boys,89.81,1,Ricardo Aguilar,Navasota,89.81,231.33,136.08,210.92,578.33,Single-ply,SBD,M
Boys,89.81,2,Dasmine Whaley,Madisonville,86.64,215.46,129.27,226.8,571.53,Single-ply,SBD,M
Boys,89.81,3,Juan Nunez,Navasota,87.09,222.26,140.61,188.24,551.11,Single-ply,SBD,M
Boys,89.81,4,Leonard Smith,Madisonville,83.91,165.56,92.99,201.85,460.4,Single-ply,SBD,M
Boys,89.81,5,Russell Neal,Groesbeck,83.91,158.76,117.93,192.78,469.47,Single-ply,SBD,M
Boys,89.81,6,Dalton Ramon,Huntsville,88.45,174.63,106.59,167.83,449.06,Single-ply,SBD,M
Boys,89.81,7,Julien Taylor,Madisonville,86.64,167.83,83.91,181.44,433.18,Single-ply,SBD,M
Boys,89.81,DQ,Jared Hawthorne,Buffalo,89.81,,,,,Single-ply,SBD,M
Boys,99.79,1,Rodney Brown,Navasota,96.62,240.4,145.15,249.48,635.03,Single-ply,SBD,M
Boys,99.79,2,Josh Carrillo,Buffalo,92.99,188.24,99.79,165.56,453.59,Single-ply,SBD,M
Boys,99.79,3,Michael Rottger,Huntsville,91.63,161.03,115.67,161.03,437.72,Single-ply,SBD,M
Boys,109.77,1,Jacob McKinney,Palestine Westwood,104.78,231.33,111.13,217.72,560.19,Single-ply,SBD,M
Boys,109.77,2,Zach Britton,Palestine Westwood,108.41,176.9,104.33,181.44,462.66,Single-ply,SBD,M
Boys,109.77,3,Chris Sweeney,Buffalo,107.5,188.24,102.06,170.1,460.4,Single-ply,SBD,M
Boys,124.74,1,Dewon Davis,Navasota,124.28,278.96,158.76,258.55,696.26,Single-ply,SBD,M
Boys,124.74,2,Forbes Baggett,Huntsville,115.67,204.12,136.08,226.8,566.99,Single-ply,SBD,M
Boys,124.74,3,Tony Barraza,Groesbeck,117.48,226.8,113.4,192.78,532.97,Single-ply,SBD,M
Boys,124.74,4,Alex McFaddin,Waller,112.94,192.78,122.47,188.24,503.49,Single-ply,SBD,M
Boys,124.74,5,John Webb,Palestine Westwood,113.4,192.78,97.52,183.7,474,Single-ply,SBD,M
Boys,124.74,6,Alejandro Montano,Buffalo,117.03,170.1,111.13,174.63,455.86,Single-ply,SBD,M
Boys,124.74+,1,Cedric Collins,Navasota,132,272.16,158.76,195.04,625.96,Single-ply,SBD,M
Boys,124.74+,2,Jason Lafferty,Waller,128.37,249.48,115.67,240.4,605.55,Single-ply,SBD,M
Boys,124.74+,3,Matthew Ethridge,Waller,135.62,154.22,90.72,147.42,392.36,Single-ply,SBD,M
