Name,WeightClassKg,Division,Best3SquatKg,Best3BenchKg,Best3DeadliftKg,TotalKg,Sex,Event,Equipment,Place,Team
Monecho McMillon,56,F-Jr,83.91,49.9,102.06,235.87,F,SBD,Single-ply,1,
Faith Ireland,60,F-M5,92.99,58.97,117.93,269.89,F,SBD,Single-ply,1,
Lea Hendrix,67.5,F-O,192.78,102.06,204.12,498.95,F,SBD,Single-ply,1,
Chapell Smith,75,F-T3,70.31,45.36,108.86,224.53,F,SBD,Single-ply,1,
Ashley Mitchell,82.5,F-T2,86.18,52.16,124.74,263.08,F,SBD,Single-ply,1,
