Division,WeightClassKg,Place,Name,Team,BodyweightKg,Best3SquatKg,Best3BenchKg,Best3DeadliftKg,TotalKg,Equipment,Event,Sex,BirthDate
Boys,51.71,1,Mark Valdez,Brady,51.53,124.74,79.38,151.95,356.07,Single-ply,SBD,M,
Boys,51.71,2,Parker Weinheimer,Lampasas,48.85,81.65,63.5,95.25,240.4,Single-ply,SBD,M,
Boys,51.71,3,Kyle Davis,Lampasas,48.94,92.99,49.9,81.65,224.53,Single-ply,SBD,M,
Boys,51.71,4,Jonatan Martinez,Fredericksburg,49.12,61.23,38.56,72.57,172.37,Single-ply,SBD,M,
Boys,55.79,1,John Dulaney,Fredericksburg,54.48,122.47,68.04,113.4,303.91,Single-ply,SBD,M,
Boys,55.79,2,Wilson Hammond,Lampasas,55.7,117.93,65.77,113.4,297.1,Single-ply,SBD,M,
Boys,55.79,DQ,Michael Martinez,Brady,52.75,,,,,Single-ply,SBD,M,
Boys,59.87,1,Luke Keller,Llano,58.06,142.88,86.18,154.22,383.29,Single-ply,SBD,M,
Boys,59.87,2,Luke Rizzo,Fredericksburg,59.1,133.81,88.45,158.76,381.02,Single-ply,SBD,M,
Boys,59.87,3,Enrique Reyes,Marble Falls,58.88,142.88,79.38,140.61,362.87,Single-ply,SBD,M,
Boys,59.87,4,Garrett Buster,Burnet,59.42,124.74,63.5,136.08,324.32,Single-ply,SBD,M,
Boys,59.87,5,Cooper McWilliams,Llano,59.47,111.13,79.38,133.81,324.32,Single-ply,SBD,M,
Boys,59.87,6,Jasael Ruiz,Marble Falls,59.6,131.54,61.23,129.27,322.05,Single-ply,SBD,M,
Boys,59.87,7,Jace Haberer,Burnet,57.97,97.52,56.7,120.2,274.42,Single-ply,SBD,M,
Boys,67.13,1,Gavin Mudd,Fredericksburg,66.63,142.88,102.06,170.1,415.04,Single-ply,SBD,M,
Boys,67.13,2,Jose Rodriguez,Burnet,60.51,147.42,83.91,181.44,412.77,Single-ply,SBD,M,
Boys,67.13,3,Kason Raub,Lampasas,66.22,154.22,108.86,142.88,405.97,Single-ply,SBD,M,
Boys,67.13,4,Jared Sierra,Marble Falls,61.33,131.54,97.52,158.76,387.82,Single-ply,SBD,M,
Boys,67.13,5,Gunner Ivey,Llano,67.09,117.93,92.99,156.49,367.41,Single-ply,SBD,M,
Boys,67.13,6,Carson Bekker,Lampasas,66.09,136.08,86.18,142.88,365.14,Single-ply,SBD,M,
Boys,67.13,7,Brady Rygaard,Burnet,64.36,124.74,83.91,138.35,347,Single-ply,SBD,M,
Boys,67.13,8,Forrest Swan,Marble Falls,66.22,124.74,86.18,131.54,342.46,Single-ply,SBD,M,
Boys,67.13,9,Colton Greenfield,Fredericksburg,62.96,72.57,56.7,90.72,219.99,Single-ply,SBD,M,
Boys,74.84,1,Dusty Miller,Llano,74.12,167.83,102.06,174.63,444.52,Single-ply,SBD,M,
Boys,74.84,2,Dax Brookreson,Lampasas,73.94,165.56,92.99,167.83,426.38,Single-ply,SBD,M,
Boys,74.84,3,Gabriel Rodriguez,Fredericksburg,74.75,145.15,102.06,151.95,399.16,Single-ply,SBD,M,
Boys,74.84,4,James Bowling,Marble Falls,71.58,145.15,102.06,133.81,381.02,Single-ply,SBD,M,
Boys,74.84,5,Brock Langford,Lampasas,69.85,124.74,81.65,145.15,351.53,Single-ply,SBD,M,
Boys,74.84,6,Carson Fields,Lampasas,74.39,127.01,68.04,133.81,328.85,Single-ply,SBD,M,
Boys,74.84,7,Tyson Trim,Burnet,71.03,102.06,65.77,129.27,297.1,Single-ply,SBD,M,
Boys,74.84,DQ,Cameron Gumbert,Marble Falls,68.86,,,,,Single-ply,SBD,M,
Boys,82.1,1,Case Brister,Lampasas,80.29,238.14,127.01,226.8,591.94,Single-ply,SBD,M,
Boys,82.1,2,Joe Maldonado,Marble Falls,81.69,229.06,122.47,213.19,564.72,Single-ply,SBD,M,
Boys,82.1,3,Jack Vanaartsen,Burnet,75.66,142.88,111.13,151.95,405.97,Single-ply,SBD,M,
Boys,82.1,4,Luke Hudgins,Burnet,80.15,136.08,92.99,174.63,403.7,Single-ply,SBD,M,
Boys,82.1,5,Levi Rivera,Lampasas,75.75,154.22,97.52,142.88,394.63,Single-ply,SBD,M,
Boys,82.1,6,River Smith,Llano,79.47,136.08,104.33,147.42,387.82,Single-ply,SBD,M,
Boys,82.1,DQ,Isaiah Tarr,Brady,80.65,174.63,,,,Single-ply,SBD,M,
Boys,89.81,1,Weston Reid,Lampasas,84.37,231.33,138.35,233.6,603.28,Single-ply,SBD,M,
Boys,89.81,2,Voice Tuttle,Marble Falls,89.63,181.44,131.54,204.12,517.1,Single-ply,SBD,M,
Boys,89.81,3,Aden Rascoe,Lampasas,88.09,190.51,124.74,183.7,498.95,Single-ply,SBD,M,
Boys,89.81,4,Sammy DeLuna,Fredericksburg,87.32,199.58,111.13,181.44,492.15,Single-ply,SBD,M,
Boys,89.81,5,Jd Ibarra,Brady,88.5,183.7,111.13,195.04,489.88,Single-ply,SBD,M,
Boys,89.81,6,Josh Carter,Lampasas,88.86,190.51,129.27,167.83,487.61,Single-ply,SBD,M,
Boys,89.81,7,Matias Fonsecas,Marble Falls,87.63,151.95,90.72,183.7,426.38,Single-ply,SBD,M,
Boys,89.81,8,Joshua Cooper,Llano,88.45,158.76,95.25,142.88,396.89,Single-ply,SBD,M,
Boys,89.81,9,Colt Walling,Lampasas,88.68,129.27,97.52,145.15,371.95,Single-ply,SBD,M,
Boys,99.79,1,Jacob Maldonado,Marble Falls,96.43,229.06,149.69,240.4,619.15,Single-ply,SBD,M,
Boys,99.79,2,Gabriel Perez,Marble Falls,93.03,224.53,136.08,217.72,578.33,Single-ply,SBD,M,
Boys,99.79,3,Daniel Hernandez,Brady,99.74,219.99,120.2,238.14,578.33,Single-ply,SBD,M,
Boys,99.79,4,Julian Cruz,Burnet,93.12,79.38,61.23,138.35,278.96,Single-ply,SBD,M,
Boys,99.79,DQ,Jose Lopez,Burnet,95.98,183.7,,,,Single-ply,SBD,M,
Boys,99.79,DQ,Adan Rivas,Fredericksburg,93.85,167.83,,,,Single-ply,SBD,M,
Boys,99.79,DQ,Jj Vaughn,Llano,91.85,117.93,,,,Single-ply,SBD,M,
Boys,109.77,1,Johnathan Baker,Burnet,108,204.12,145.15,208.65,557.92,Single-ply,SBD,M,
Boys,109.77,2,Yorde Hernandez,Fredericksburg,108.91,195.04,99.79,167.83,462.66,Single-ply,SBD,M,
Boys,109.77,DQ,Sosa Sokimi,Lampasas,108.41,,,,,Single-ply,SBD,M,
Boys,124.74,1,Juan Leon,Brady,122.83,238.14,154.22,224.53,616.89,Single-ply,SBD,M,
Boys,124.74,2,Matthew Whitley,Llano,115.12,226.8,163.29,208.65,598.74,Single-ply,SBD,M,
Boys,124.74,3,Connor Keele,Lampasas,124.28,176.9,113.4,183.7,474,Single-ply,SBD,M,
Boys,124.74,4,Joseph Walden,Lampasas,124.19,154.22,92.99,124.74,371.95,Single-ply,SBD,M,
Boys,139.71,1,John Long,Lampasas,139.48,249.48,208.65,222.26,680.39,Single-ply,SBD,M,
Boys,139.71,2,Zach Wubbolding,Fredericksburg,131.9,222.26,136.08,206.38,564.72,Single-ply,SBD,M,
Boys,139.71+,1,Caden Thrift,Lampasas,150.59,192.78,151.95,204.12,548.85,Single-ply,SBD,M,
Boys,139.71+,2,Jaime Palacios,Burnet,151.23,179.17,136.08,192.78,508.02,Single-ply,SBD,M,
Boys,,NS,Ethan Moreno,Lampasas,,,,,,Single-ply,SBD,M,
