Place,Name,Sex,Event,Division,WeightClassKg,Equipment,BirthYear,State,BodyweightKg,Squat1Kg,Squat2Kg,Squat3Kg,Best3SquatKg,Bench1Kg,Bench2Kg,Bench3Kg,Best3BenchKg,Deadlift1Kg,Deadlift2Kg,Deadlift3Kg,Best3DeadliftKg,TotalKg,Age,BirthDate
1,Kitt Foster,F,B,FR-M,57,Raw,1966,SC,53.48,,,,,65,67.5,-70,67.5,,,,,67.5,,
1,Cindy Amatuzzo,F,B,FR-M,84,Raw,1965,NC,81.82,,,,,65,72.5,77.5,77.5,,,,,77.5,,
1,Adrienna Davis,F,B,FR-O,63,Raw,2003,SC,62.1,,,,,77.5,83,-85,83,,,,,83,,2003-04-13
1,Cindy Amatuzzo,F,B,FR-O,84,Raw,1965,NC,81.82,,,,,65,72.5,77.5,77.5,,,,,77.5,,
1,Adrienna Davis,F,B,FR-T2,63,Raw,2003,SC,62.1,,,,,77.5,83,-85,83,,,,,83,,
1,Brendan Cole,M,B,MR-O,66,Raw,2000,NC,65.15,,,,,100,107.5,115,115,,,,,115,,
1,Patty Burnett,F,SBD,F-M2,63,Single-ply,1961,SC,59.16,97.5,-105,-105,97.5,45,60,-70,60,100,110,117.5,117.5,275,,
1,Brigitte Ampoli,F,SBD,FR-Jr,57,Raw,1998,NC,56.98,110,115,120,120,60,-65,-65,60,135,140,142.5,142.5,322.5,,
2,Hannah Bennett,F,SBD,FR-Jr,57,Raw,1999,NC,54.18,105,115,-120,115,52.5,-55,-55,52.5,130,140,147.5,147.5,315,,
3,Daniela Prado,F,SBD,FR-Jr,57,Raw,1997,NC,56.64,97.5,100,105,105,-52.5,55,60,60,92.5,100,-105,100,265,,
1,Kacey Millican,F,SBD,FR-Jr,72,Raw,1996,NC,70.3,112.5,120,132.5,132.5,62.5,-70,-70,62.5,115,125,-137.5,125,320,,
1,Letitia Smith,F,SBD,FR-M1,72,Raw,1978,NC,66.04,82.5,-90,-90,82.5,42.5,47.5,-50,47.5,77.5,85,-87.5,85,215,,
2,Melodie Scarborough,F,SBD,FR-M1,72,Raw,1971,NC,64.52,47.5,-57.5,57.5,57.5,37.5,47.5,-55,47.5,87.5,97.5,107.5,107.5,212.5,,
1,Kitt Foster,F,SBD,FR-M2,57,Raw,1966,SC,53.48,82.5,87.5,95,95,65,67.5,-70,67.5,125,130,-132.5,130,292.5,,
2,Lori Hoffman,F,SBD,FR-M2,57,Raw,1967,NC,52.04,60,70,75,75,40,45,50,50,85,90,97.5,97.5,222.5,,
1,Mary Dechene,F,SBD,FR-M2,72,Raw,1966,NC,70.06,-85,85,-90,85,50,55,57.5,57.5,97.5,102.5,107.5,107.5,250,,
1,Deborah Mazzullo,F,SBD,FR-M3,72,Raw,1957,NC,67.22,95,100,105,105,57.5,62.5,-65,62.5,130,135,-140,135,302.5,,
2,Kathleen Bodnar,F,SBD,FR-M3,72,Raw,1951,SC,71.7,67.5,70,72.5,72.5,47.5,-50,52.5,52.5,95,-97.5,-97.5,95,220,,
DQ,Melissa Mazur,F,SBD,FR-M3,72,Raw,1959,NC,63.16,-67.5,70,72.5,72.5,-47.5,-50,-50,,95,100,105,105,,,
1,Brigitte Ampoli,F,SBD,FR-O,57,Raw,1998,NC,56.98,110,115,120,120,60,-65,-65,60,135,140,142.5,142.5,322.5,,
2,Hannah Bennett,F,SBD,FR-O,57,Raw,1999,NC,54.18,105,115,-120,115,52.5,-55,-55,52.5,130,140,147.5,147.5,315,,
3,Kitt Foster,F,SBD,FR-O,57,Raw,1966,SC,53.48,82.5,87.5,95,95,65,67.5,-70,67.5,125,130,-132.5,130,292.5,,
4,Daniela Prado,F,SBD,FR-O,57,Raw,1997,NC,56.64,97.5,100,105,105,-52.5,55,60,60,92.5,100,-105,100,265,,
1,Roxanne Kennedy,F,SBD,FR-O,63,Raw,1993,NC,59,137.5,140,145,145,77.5,80,82.5,82.5,145,150,155,155,382.5,,
1,Eleanor Kaley,F,SBD,FR-O,72,Raw,2003,NC,65.6,105,120,130,130,50,55,60,60,110,120,130,130,320,,
2,Kacey Millican,F,SBD,FR-O,72,Raw,1996,NC,70.3,112.5,120,132.5,132.5,62.5,-70,-70,62.5,115,125,-137.5,125,320,,
3,Deborah Mazzullo,F,SBD,FR-O,72,Raw,1957,NC,67.22,95,100,105,105,57.5,62.5,-65,62.5,130,135,-140,135,302.5,,
4,Hayley Niles,F,SBD,FR-O,72,Raw,1991,NC,65.7,95,100,105,105,55,60,-65,60,102.5,105,112.5,112.5,277.5,,
5,Brooke Moore,F,SBD,FR-O,72,Raw,1996,NC,66.72,97.5,105,120,120,42.5,47.5,-52.5,47.5,102.5,110,-125,110,277.5,,
6,Kathleen Bodnar,F,SBD,FR-O,72,Raw,1951,SC,71.7,67.5,70,72.5,72.5,47.5,-50,52.5,52.5,95,-97.5,-97.5,95,220,,
7,Melodie Scarborough,F,SBD,FR-O,72,Raw,1971,NC,64.52,47.5,-57.5,57.5,57.5,37.5,47.5,-55,47.5,87.5,97.5,107.5,107.5,212.5,,
DQ,Lindsey Kopp,F,SBD,FR-O,72,Raw,1996,SC,71.18,72.5,92.5,105,105,-42.5,-60,-60,,125,-140,-142.5,125,,,
1,Kieonna Peake,F,SBD,FR-O,84,Raw,1985,SC,83.02,180,192.5,-197.5,192.5,95,-100,100,100,195,-202.5,207.5,207.5,500,,
2,Amy Hutchison,F,SBD,FR-O,84,Raw,1982,NC,78.58,130,137.5,142.5,142.5,70,75,-77.5,75,160,-167.5,167.5,167.5,385,,
3,Damaris Rivera,F,SBD,FR-O,84,Raw,1993,SC,80.32,100,107.5,117.5,117.5,42.5,50,55,55,100,105,112.5,112.5,285,,
1,Laura Burgos,F,SBD,FR-O,84+,Raw,1985,NC,84.14,145,150,155,155,75,77.5,80,80,165,175,-182.5,175,410,,
2,Crystal Emory,F,SBD,FR-O,84+,Raw,1988,NC,107.58,140,147.5,155,155,77.5,82.5,87.5,87.5,150,-162.5,162.5,162.5,405,,
3,Katlin Lemon,F,SBD,FR-O,84+,Raw,1990,NC,122.3,-130,-130,137.5,137.5,67.5,75,80,80,147.5,162.5,170,170,387.5,,
1,Tricia Hoffman,F,SBD,FR-T1,84,Raw,2004,NC,79.84,62.5,72.5,82.5,82.5,45,50,55,55,92.5,-105,105,105,242.5,,
1,Eleanor Kaley,F,SBD,FR-T2,72,Raw,2003,NC,65.6,105,120,130,130,50,55,60,60,110,120,130,130,320,,
1,Collin Soja,M,SBD,MR-Jr,66,Raw,1999,NC,64.25,122.5,132.5,137.5,137.5,80,85,90,90,150,160,170,170,397.5,,
1,Joshua Sisk,M,SBD,MR-Jr,74,Raw,1999,NC,70.7,177.5,187.5,192.5,192.5,107.5,112.5,115,115,210,222.5,232.5,232.5,540,,
2,Tyler Wallace,M,SBD,MR-Jr,74,Raw,1999,NC,74,145,162.5,-167.5,162.5,112.5,122.5,-125,122.5,195,225,-235,225,510,,
3,Dillan West,M,SBD,MR-Jr,74,Raw,2000,NC,71.15,155,165,-177.5,165,92.5,100,102.5,102.5,190,205,215,215,482.5,,
1,Dominic Rowden,M,SBD,MR-Jr,83,Raw,1996,NC,82.95,260,-272.5,-272.5,260,145,152.5,157.5,157.5,255,272.5,282.5,282.5,700,,
2,Handy Duong,M,SBD,MR-Jr,83,Raw,1998,NC,82.75,175,185,195,195,120,-127.5,-127.5,120,-215,-215,215,215,530,,
3,Matt Onuska,M,SBD,MR-Jr,83,Raw,1999,NC,78,130,155,165,165,107.5,-117.5,-117.5,107.5,205,215,227.5,227.5,500,,
4,Austin Becker,M,SBD,MR-Jr,83,Raw,1997,SC,82.8,140,145,150,150,-122.5,-127.5,127.5,127.5,140,145,152.5,152.5,430,,
1,James Norman #2,M,SBD,MR-Jr,93,Raw,2000,SC,85.8,227.5,237.5,245,245,132.5,137.5,142.5,142.5,260,275,287.5,287.5,675,,
2,Jalen Allamby,M,SBD,MR-Jr,93,Raw,2000,NC,89.4,190,205,220,220,127.5,135,-137.5,135,242.5,257.5,272.5,272.5,627.5,,
3,Jeremy Winkler,M,SBD,MR-Jr,93,Raw,1997,NC,92.4,220,232.5,240,240,125,-132.5,-132.5,125,232.5,245,257.5,257.5,622.5,,
4,David Nguyen,M,SBD,MR-Jr,93,Raw,1998,NC,90.7,197.5,210,217.5,217.5,120,127.5,132.5,132.5,205,217.5,230,230,580,,
5,Tyler Norman,M,SBD,MR-Jr,93,Raw,1998,SC,89.55,187.5,197.5,207.5,207.5,127.5,135,-142.5,135,212.5,225,232.5,232.5,575,,
6,Ryan Smith,M,SBD,MR-Jr,93,Raw,1998,NC,91.35,175,185,195,195,132.5,142.5,-145,142.5,202.5,217.5,227.5,227.5,565,,
7,Preston Watson,M,SBD,MR-Jr,93,Raw,1999,SC,87.55,170,182.5,192.5,192.5,105,-112.5,-117.5,105,192.5,200,210,210,507.5,,
1,Nathan McPeters,M,SBD,MR-Jr,105,Raw,1997,SC,99.6,262.5,-272.5,-275,262.5,177.5,182.5,187.5,187.5,282.5,287.5,-297.5,287.5,737.5,,
2,Jackson Carter,M,SBD,MR-Jr,105,Raw,1999,SC,93.8,227.5,240,-242.5,240,142.5,152.5,-160,152.5,227.5,250,-265,250,642.5,,
DQ,Michael Gravely,M,SBD,MR-Jr,105,Raw,1998,NC,102.3,175,-185,187.5,187.5,132.5,142.5,-147.5,142.5,-202.5,-215,-215,,,,
1,Brendan Harrigan,M,SBD,MR-Jr,120,Raw,2000,SC,115.65,240,250,262.5,262.5,170,177.5,-182.5,177.5,250,265,-275,265,705,,
2,Jamie Justice,M,SBD,MR-Jr,120,Raw,1997,GA,116.8,215,225,232.5,232.5,125,135,-145,135,217.5,227.5,235,235,602.5,,
3,Michael Ashley,M,SBD,MR-Jr,120,Raw,2000,NC,116.6,-200,200,-205,200,150,-155,-155,150,220,,,220,570,,
1,Randal Hooker,M,SBD,MR-M1,105,Raw,1973,NC,97.5,227.5,-237.5,-237.5,227.5,145,150,157.5,157.5,247.5,272.5,-275,272.5,657.5,,
1,Royce Young,M,SBD,MR-M2,105,Raw,1970,NC,103.2,-182.5,182.5,187.5,187.5,155,160,-162.5,160,245,250,,250,597.5,,
1,Dan Chester,M,SBD,MR-M2,120+,Raw,1969,NC,140.6,185,197.5,217.5,217.5,137.5,145,-155,145,240,257.5,262.5,262.5,625,,
1,Michael Bodnar,M,SBD,MR-M4,74,Raw,1945,SC,69.9,-77.5,77.5,85,85,-75,75,77.5,77.5,107.5,112.5,115,115,277.5,,
1,Collin Soja,M,SBD,MR-O,66,Raw,1999,NC,64.25,122.5,132.5,137.5,137.5,80,85,90,90,150,160,170,170,397.5,,
1,Joshua Singh,M,SBD,MR-O,74,Raw,1993,NC,73.05,192.5,202.5,210,210,125,130,135,135,225,240,-247.5,240,585,,
2,Christopher McCloud,M,SBD,MR-O,74,Raw,1990,NC,70.15,175,185,192.5,192.5,105,110,-117.5,110,235,245,-250,245,547.5,,
3,Tyler Wallace,M,SBD,MR-O,74,Raw,1999,NC,74,145,162.5,-167.5,162.5,112.5,122.5,-125,122.5,195,225,-235,225,510,,
4,Steven Nguyen,M,SBD,MR-O,74,Raw,1996,NC,73.65,140,145,152.5,152.5,82.5,87.5,-92.5,87.5,122.5,137.5,145,145,385,,
5,Michael Bodnar,M,SBD,MR-O,74,Raw,1945,SC,69.9,-77.5,77.5,85,85,-75,75,77.5,77.5,107.5,112.5,115,115,277.5,,
1,Daniel Morris,M,SBD,MR-O,83,Raw,1988,NC,82.75,-220,220,227.5,227.5,182.5,192.5,200,200,265,272.5,282.5,282.5,710,,
2,Dominic Rowden,M,SBD,MR-O,83,Raw,1996,NC,82.95,260,-272.5,-272.5,260,145,152.5,157.5,157.5,255,272.5,282.5,282.5,700,,
3,Matt Onuska,M,SBD,MR-O,83,Raw,1999,NC,78,130,155,165,165,107.5,-117.5,-117.5,107.5,205,215,227.5,227.5,500,,
4,Steven Evans #3,M,SBD,MR-O,83,Raw,1992,NC,80.25,127.5,-142.5,-157.5,127.5,90,100,110,110,165,187.5,205,205,442.5,,
DQ,Jarrad Holcombe,M,SBD,MR-O,83,Raw,1990,SC,82.85,185,-197.5,-197.5,185,-130,-130,-130,,,,,,,,
1,Nico Bourgeois,M,SBD,MR-O,93,Raw,1991,NC,89.95,232.5,257.5,270,270,145,160,-175,160,247.5,277.5,-290,277.5,707.5,,
2,Jalen Allamby,M,SBD,MR-O,93,Raw,2000,NC,89.4,190,205,220,220,127.5,135,-137.5,135,242.5,257.5,272.5,272.5,627.5,,
3,Trey Morrison,M,SBD,MR-O,93,Raw,1995,NC,90.25,192.5,205,-217.5,205,145,150,152.5,152.5,245,260,-275,260,617.5,,
4,Marshall Powell,M,SBD,MR-O,93,Raw,1997,SC,87.2,172.5,185,192.5,192.5,147.5,155,160,160,235,250,-262.5,250,602.5,,
5,Rafael Cardel,M,SBD,MR-O,93,Raw,1994,NC,92,155,162.5,170,170,100,105,-107.5,105,197.5,212.5,222.5,222.5,497.5,,
1,Nathan McPeters,M,SBD,MR-O,105,Raw,1997,SC,99.6,262.5,-272.5,-275,262.5,177.5,182.5,187.5,187.5,282.5,287.5,-297.5,287.5,737.5,,
2,Josh Greiner,M,SBD,MR-O,105,Raw,2003,NC,104.95,250,272.5,-280.5,272.5,190,-200,-200,190,250,-275,-275,250,712.5,,
3,Matthew Octaviano,M,SBD,MR-O,105,Raw,1995,NC,101.85,217.5,225,235,235,145,150,155,155,230,250,272.5,272.5,662.5,,
4,Randal Hooker,M,SBD,MR-O,105,Raw,1973,NC,97.5,227.5,-237.5,-237.5,227.5,145,150,157.5,157.5,247.5,272.5,-275,272.5,657.5,,
5,Alec Chaves,M,SBD,MR-O,105,Raw,1993,NC,104.6,-225,225,237.5,237.5,142.5,-157.5,-170,142.5,265,-280,-280,265,645,,
6,Jackson Carter,M,SBD,MR-O,105,Raw,1999,SC,93.8,227.5,240,-242.5,240,142.5,152.5,-160,152.5,227.5,250,-265,250,642.5,,
7,Kade Mukes,M,SBD,MR-O,105,Raw,1994,NC,102.1,227.5,240,247.5,247.5,125,135,-140,135,235,247.5,260,260,642.5,,
8,Lance Mclean,M,SBD,MR-O,105,Raw,2000,NC,102.8,205,225,235,235,-102.5,120,130,130,205,225,240,240,605,,
9,Royce Young,M,SBD,MR-O,105,Raw,1970,NC,103.2,-182.5,182.5,187.5,187.5,155,160,-162.5,160,245,250,,250,597.5,,
1,Kyle DuBois,M,SBD,MR-O,120,Raw,1994,NC,117.6,237.5,-242.5,242.5,242.5,150,157.5,165,165,235,245,257.5,257.5,665,,
2,Alexander East,M,SBD,MR-O,120,Raw,1996,NC,111.45,207.5,217.5,-227.5,217.5,112.5,115,120,120,260,-272.5,-272.5,260,597.5,,
1,Josh Greiner,M,SBD,MR-T2,105,Raw,2003,NC,104.95,250,272.5,-280.5,272.5,190,-200,-200,190,250,-275,-275,250,712.5,,
2,William Spencer #1,M,SBD,MR-T2,105,Raw,2003,NC,103.7,205,217.5,227.5,227.5,-142.5,150,-152.5,150,230,237.5,-260,237.5,615,,
3,Judah Rainey,M,SBD,MR-T2,105,Raw,2003,NC,102.5,200,215,227.5,227.5,-100,100,-120,100,210,230,240,240,567.5,,
1,Mitchell Glover,M,SBD,MR-T3,74,Raw,2000,SC,73.1,-177.5,177.5,187.5,187.5,122.5,127.5,132.5,132.5,195,212.5,220,220,540,,
1,Stephane Nazaire,M,SBD,MR-T3,83,Raw,2000,GA,79.7,175,-182.5,-182.5,175,115,-125,127.5,127.5,185,197.5,210,210,512.5,,
1,Garrett Stevens,M,SBD,MR-T3,93,Raw,2002,NC,87.25,165,172.5,-182.5,172.5,107.5,110,-117.5,110,100,122.5,145,145,427.5,,
1,Lance Mclean,M,SBD,MR-T3,105,Raw,2000,NC,102.8,205,225,235,235,-102.5,120,130,130,205,225,240,240,605,,
1,Brendan Cole,M,BD,MR-O,66,Raw,2000,NC,65.15,,,,,100,107.5,115,115,-145,155,160,160,275,,
1,Dohnte Thompson,M,BD,MR-O,120+,Raw,1989,SC,122.2,,,,,140,150,-160,150,185,195,227.5,227.5,377.5,,
