Division,WeightClassKg,Place,Name,Team,BodyweightKg,Best3SquatKg,Best3BenchKg,Best3DeadliftKg,TotalKg,Equipment,Event,Sex,BirthDate
Boys,59.87,1,Nathan Hall,Athens,59.87,136.08,90.72,142.88,369.68,Single-ply,SBD,M,
Boys,59.87,2,Blayzn Saxon,Athens,59.87,79.38,61.23,142.88,283.5,Single-ply,SBD,M,
Boys,59.87,DQ,Cashis Lee-Brown,Athens,59.33,,,,,Single-ply,SBD,M,
Boys,67.13,1,Caleb Clemmons,Athens,66.36,158.76,97.52,156.49,412.77,Single-ply,SBD,M,
Boys,67.13,2,Jason Christian,Van,67.09,129.27,79.38,140.61,349.27,Single-ply,SBD,M,
Boys,67.13,3,Marco Castiglione,Athens,63.23,83.91,65.77,136.08,285.76,Single-ply,SBD,M,
Boys,74.84,1,Logan Schwerin,Athens,73.94,142.88,92.99,156.49,392.36,Single-ply,SBD,M,
Boys,74.84,2,Ryan Johnson,Van,69.85,138.35,77.11,149.69,365.14,Single-ply,SBD,M,
Boys,74.84,3,Conner Edwards,Van,74.48,131.54,79.38,127.01,337.93,Single-ply,SBD,M,
Boys,89.81,1,Jon Richardson,Van,85.05,149.69,97.52,147.42,394.63,Single-ply,SBD,M,
Boys,99.79,1,John Hayes #1,Athens,96.62,138.35,92.99,183.7,415.04,Single-ply,SBD,M,
Boys,99.79,2,Landon Justice,Van,97.52,140.61,86.18,140.61,367.41,Single-ply,SBD,M,
Boys,109.77,1,Dylan Grubbs,Athens,106.23,174.63,92.99,165.56,433.18,Single-ply,SBD,M,
Boys,109.77,2,Hunter White,Athens,109.72,142.88,97.52,156.49,396.89,Single-ply,SBD,M,
Boys,109.77,3,Ivan Pinedo,Athens,107.86,138.35,88.45,129.27,356.07,Single-ply,SBD,M,
Boys,109.77,4,Zachary Carranza,Athens,103.6,106.59,86.18,124.74,317.51,Single-ply,SBD,M,
Boys,124.74,1,Spencer Shinn,Van,115.67,183.7,136.08,183.7,503.49,Single-ply,SBD,M,
Boys,124.74,2,Kepler Multhaup,Van,112.26,147.42,88.45,149.69,385.55,Single-ply,SBD,M,
Boys,139.71,1,Trae Derrick,Van,129.55,163.29,90.72,129.27,383.29,Single-ply,SBD,M,
