Division,WeightClassKg,Place,Name,Team,BodyweightKg,Best3SquatKg,Best3BenchKg,Best3DeadliftKg,TotalKg,Equipment,Event,Sex
Div 2,55.79,1,Moses Martinez,Columbus,51.8,167.83,102.06,172.37,442.25,Single-ply,SBD,M
Div 2,51.71,2,Bryant Smith,Bonham,50.8,161.03,86.18,181.44,428.64,Single-ply,SBD,M
Div 2,51.71,3,Angel Jaramillo,Van Alstyne,51.26,163.29,92.99,167.83,424.11,Single-ply,SBD,M
Div 2,55.79,4,Peter Loftus,Burkburnett,51.94,167.83,79.38,170.1,417.3,Single-ply,SBD,M
Div 2,51.71,5,Johnny Adair,Sealy,49.53,151.95,79.38,172.37,403.7,Single-ply,SBD,M
Div 2,51.71,6,Zohn-Luke McCoy,New Boston,51.62,161.03,86.18,151.95,399.16,Single-ply,SBD,M
Div 2,51.71,7,Joey Adair,Sealy,50.08,151.95,79.38,163.29,394.63,Single-ply,SBD,M
Div 2,51.71,8,Nolan Newville,Decatur,51.71,151.95,86.18,151.95,390.09,Single-ply,SBD,M
Div 2,55.79,9,Dean Lewis,La Vernia,51.94,147.42,88.45,149.69,385.55,Single-ply,SBD,M
Div 2,51.71,10,Marshall Chappell,Seminole,47.99,147.42,79.38,136.08,362.87,Single-ply,SBD,M
Div 2,51.71,11,Dylan Elkins,Needville,51.71,131.54,88.45,138.35,358.34,Single-ply,SBD,M
Div 2,51.71,12,Zack Rayos,Pecos,51.71,140.61,65.77,147.42,353.8,Single-ply,SBD,M
Div 2,55.79,13,Chantz Mickens,Palestine Westwood,51.8,140.61,68.04,131.54,340.19,Single-ply,SBD,M
Div 2,55.79,14,Curtis Miller #3,Cleveland Tarkington,51.89,124.74,72.57,124.74,322.05,Single-ply,SBD,M
Div 2,59.87,1,Rone Ramirez,Carthage,55.97,176.9,117.93,181.44,476.27,Single-ply,SBD,M
Div 2,55.79,2,Dillan Brown,Decatur,54.88,176.9,95.25,183.7,455.86,Single-ply,SBD,M
Div 2,55.79,3,Andrew Knight,Robinson,55.16,185.97,88.45,176.9,451.32,Single-ply,SBD,M
Div 2,55.79,4,Michael McIntire,Taylor,55.16,181.44,95.25,158.76,435.45,Single-ply,SBD,M
Div 2,55.79,5,Thomas Howard,Texarkana Liberty-Eylau,55.79,158.76,92.99,181.44,433.18,Single-ply,SBD,M
Div 2,55.79,6,David Tsan,Orangefield,54.98,167.83,77.11,181.44,426.38,Single-ply,SBD,M
Div 2,59.87,7,Leonard Garza,Poteet,55.97,167.83,102.06,154.22,424.11,Single-ply,SBD,M
Div 2,55.79,8,Caleb Gale,Somerset,55.16,156.49,83.91,181.44,421.84,Single-ply,SBD,M
Div 2,55.79,9,Brett Salas,Lubbock Cooper,55.16,165.56,77.11,167.83,410.5,Single-ply,SBD,M
Div 2,55.79,10,Jamie Longoria,Levelland,55.52,151.95,86.18,170.1,408.23,Single-ply,SBD,M
Div 2,55.79,11,Jonathan Hardaway,Edna,55.43,136.08,106.59,163.29,405.97,Single-ply,SBD,M
Div 2,55.79,DQ,Jose Rangel,Farmersville,55.79,149.69,90.72,,,Single-ply,SBD,M
Div 2,59.87,1,Kyle Bawcum,Paris,59.42,208.65,122.47,199.58,530.7,Single-ply,SBD,M
Div 2,59.87,2,William O'Bryan,Aransas Pass,59.15,204.12,117.93,181.44,503.49,Single-ply,SBD,M
Div 2,59.87,3,Travis Watson,Crandall,59.42,185.97,104.33,199.58,489.88,Single-ply,SBD,M
Div 2,59.87,4,Virgil Alfaro,Zapata,59.6,183.7,97.52,197.31,478.54,Single-ply,SBD,M
Div 2,59.87,5,Alex Leos,Robinson,59.6,183.7,99.79,190.51,474,Single-ply,SBD,M
Div 2,59.87,6,Trevor Banaszak,Shepherd,59.69,181.44,106.59,181.44,469.47,Single-ply,SBD,M
Div 2,59.87,7,Brandon Corn,Liberty Hill,58.24,183.7,106.59,176.9,467.2,Single-ply,SBD,M
Div 2,67.13,8,Federico Juarez,Andrews,60.06,167.83,97.52,163.29,428.64,Single-ply,SBD,M
Div 2,67.13,9,Angel Guerrero,Levelland,60.06,188.24,65.77,167.83,421.84,Single-ply,SBD,M
Div 2,59.87,10,Jose Jimenez #11,Palacios,59.51,147.42,90.72,165.56,403.7,Single-ply,SBD,M
Div 2,59.87,DQ,Dustin Gray,Lake Worth,59.24,,,,,Single-ply,SBD,M
Div 2,59.87,DQ,Preston King,Burkburnett,59.33,206.38,,,,Single-ply,SBD,M
Div 2,67.13,1,Tyrell Irby,Waco La Vega,66.95,249.48,136.08,254.01,639.57,Single-ply,SBD,M
Div 2,67.13,2,Willie Willis,Huntington,66.32,285.76,163.29,188.24,637.3,Single-ply,SBD,M
Div 2,67.13,3,Cris Murray,Kemp,66.86,235.87,140.61,217.72,594.21,Single-ply,SBD,M
Div 2,74.84,4,Kyree Norman,Waco La Vega,67.22,213.19,117.93,238.14,569.26,Single-ply,SBD,M
Div 2,67.13,5,Roy Butler,Texarkana Liberty-Eylau,65.32,213.19,145.15,204.12,562.45,Single-ply,SBD,M
Div 2,67.13,6,Darian Jones,Paris,64.14,204.12,113.4,210.92,528.44,Single-ply,SBD,M
Div 2,67.13,7,Bryan Pham,Palacios,64.77,204.12,106.59,208.65,519.36,Single-ply,SBD,M
Div 2,67.13,8,Colbey Watson,Iowa Park,66.59,199.58,95.25,204.12,498.95,Single-ply,SBD,M
Div 2,74.84,9,Mark Vasquez,Orange Grove,67.36,197.31,111.13,183.7,492.15,Single-ply,SBD,M
Div 2,67.13,10,Stephen Apolinar,Pecos,66.5,199.58,115.67,174.63,489.88,Single-ply,SBD,M
Div 2,74.84,11,Kelton Craven,Orange Grove,67.22,195.04,106.59,185.97,487.61,Single-ply,SBD,M
Div 2,67.13,12,Dustin Smith,Levelland,66.5,199.58,90.72,188.24,478.54,Single-ply,SBD,M
Div 2,67.13,13,Matthew Nguyen,Palacios,67.04,181.44,88.45,201.85,471.74,Single-ply,SBD,M
Div 2,67.13,DQ,Jerrid Caffey,Whitesboro,65.95,231.33,,,,Single-ply,SBD,M
Div 2,74.84,1,Michael Pyon,Kennedale,73.21,238.14,154.22,229.06,621.42,Single-ply,SBD,M
Div 2,82.1,2,Julio Mendoza,Port Isabel,74.93,254.01,138.35,226.8,619.15,Single-ply,SBD,M
Div 2,74.84,3,Terran Cooper,Texarkana Liberty-Eylau,69.85,222.26,147.42,238.14,607.81,Single-ply,SBD,M
Div 2,74.84,4,Jeremy Small,Center,71.58,233.6,127.01,242.67,603.28,Single-ply,SBD,M
Div 2,74.84,5,Jordan Taylor #1,Waco La Vega,74.3,210.92,142.88,244.94,598.74,Single-ply,SBD,M
Div 2,74.84,6,Joel Rockmore,Lake Worth,74.57,226.8,136.08,222.26,585.13,Single-ply,SBD,M
Div 2,74.84,7,Cameron Russell,Cleveland Tarkington,73.66,215.46,131.54,229.06,576.06,Single-ply,SBD,M
Div 2,74.84,8,Simon Martinez,Taylor,73.03,217.72,142.88,208.65,569.26,Single-ply,SBD,M
Div 2,74.84,9,Brenson Lindsey,West Orange-Stark,73.84,206.38,129.27,210.92,546.58,Single-ply,SBD,M
Div 2,82.1,10,Lasalle Washington,Levelland,75.02,222.26,111.13,188.24,521.63,Single-ply,SBD,M
Div 2,74.84,11,Corey Richardson,Levelland,74.66,185.97,117.93,208.65,512.56,Single-ply,SBD,M
Div 2,74.84,DQ,Roy Arispe,Devine,73.48,208.65,113.4,,,Single-ply,SBD,M
Div 2,82.1,1,Raydell Perez,Ingleside,81.37,244.94,183.7,249.48,678.12,Single-ply,SBD,M
Div 2,82.1,2,D'Vonte Daniels,La Grange,80.56,242.67,167.83,226.8,637.3,Single-ply,SBD,M
Div 2,82.1,3,Carlos Rivera,Mineola,81.92,249.48,133.81,242.67,625.96,Single-ply,SBD,M
Div 2,82.1,4,Tyler Stevens,Bandera,79.56,244.94,131.54,240.4,616.89,Single-ply,SBD,M
Div 2,82.1,5,Nelson Scott,Caldwell,79.2,215.46,142.88,249.48,607.81,Single-ply,SBD,M
Div 2,89.81,6,Ray Hodges,Kemp,82.33,231.33,140.61,235.87,607.81,Single-ply,SBD,M
Div 2,82.1,7,Ryne Cozby,Burkburnett,82.1,249.48,136.08,219.99,605.55,Single-ply,SBD,M
Div 2,82.1,8,Kenyon Morgan,Gainesville,80.01,229.06,133.81,226.8,589.67,Single-ply,SBD,M
Div 2,82.1,9,Cole Barton #3,Midland Greenwood,80.01,204.12,149.69,204.12,557.92,Single-ply,SBD,M
Div 2,82.1,10,Dylan Winkle,Borger,79.38,199.58,122.47,217.72,539.77,Single-ply,SBD,M
Div 2,82.1,11,Cody Cummings,Coldspring-Oakhurst,78.11,181.44,127.01,201.85,510.29,Single-ply,SBD,M
Div 2,82.1,DQ,Rj Densen,Needville,78.47,210.92,122.47,,,Single-ply,SBD,M
Div 2,82.1,DQ,Jathan Craig,Burnet,81.56,,,,,Single-ply,SBD,M
Div 2,89.81,1,Justin Duran,Raymondville,89.09,306.17,174.63,256.28,737.09,Single-ply,SBD,M
Div 2,89.81,2,Francisco Cisneros,Rio Hondo,88.9,235.87,183.7,269.89,689.46,Single-ply,SBD,M
Div 2,89.81,3,Chris McFarlin,Taylor,89.18,272.16,170.1,247.21,689.46,Single-ply,SBD,M
Div 2,89.81,4,Alex Costilla,Falfurrias,88.27,269.89,170.1,233.6,673.58,Single-ply,SBD,M
Div 2,89.81,5,Dai Le,Iowa Park,89.09,265.35,154.22,244.94,664.51,Single-ply,SBD,M
Div 2,89.81,6,Allan Grove,Ingleside,89.36,244.94,163.29,244.94,653.17,Single-ply,SBD,M
Div 2,89.81,7,Kevinski Pitts,Center,89.09,247.21,131.54,254.01,632.76,Single-ply,SBD,M
Div 2,99.79,8,Alex Wheeler,Zapata,89.99,238.14,163.29,231.33,632.76,Single-ply,SBD,M
Div 2,89.81,9,Marcus Ferree,Palacios,89.18,233.6,154.22,235.87,623.69,Single-ply,SBD,M
Div 2,89.81,10,Daniel Johnston,Alvarado,89.54,233.6,149.69,238.14,621.42,Single-ply,SBD,M
Div 2,89.81,11,Cantrell McKinley,Texarkana Liberty-Eylau,89.72,226.8,136.08,249.48,612.35,Single-ply,SBD,M
Div 2,89.81,12,Mitchell Bateman,Argyle,89.27,254.01,117.93,231.33,603.28,Single-ply,SBD,M
Div 2,89.81,13,Nathan Brantner,Splendora,89.45,201.85,163.29,229.06,594.21,Single-ply,SBD,M
Div 2,89.81,14,Temperance Childers,Levelland,84.73,217.72,133.81,213.19,564.72,Single-ply,SBD,M
Div 2,89.81,DQ,Jake Varela,Pecos,89.09,215.46,,,,Single-ply,SBD,M
Div 2,89.81,DQ,Colby Wollin,Giddings,86.45,283.5,174.63,,,Single-ply,SBD,M
Div 2,99.79,1,Quinton Thomas,Gladewater,98.25,308.44,185.97,267.62,762.04,Single-ply,SBD,M
Div 2,99.79,2,Oscar I Ortiz,Orange Grove,99.52,281.23,147.42,272.16,700.8,Single-ply,SBD,M
Div 2,99.79,3,Shane Stankus,Bridge City,96.62,263.08,167.83,265.35,696.26,Single-ply,SBD,M
Div 2,99.79,4,Rodney Brown,Navasota,96.52,258.55,172.37,263.08,694,Single-ply,SBD,M
Div 2,99.79,5,Edward Barrera,Taylor,98.16,317.51,142.88,217.72,678.12,Single-ply,SBD,M
Div 2,99.79,6,Daniel Allen,Seminole,97.61,290.3,154.22,231.33,675.85,Single-ply,SBD,M
Div 2,109.77,7,Jarvis Lollis,Texarkana Liberty-Eylau,100.02,272.16,161.03,240.4,673.58,Single-ply,SBD,M
Div 2,99.79,8,Ruben Murillo,Princeton,99.7,281.23,151.95,204.12,637.3,Single-ply,SBD,M
Div 2,99.79,9,Darren Stewart,Splendora,94.26,251.74,154.22,229.06,635.03,Single-ply,SBD,M
Div 2,99.79,10,Gregory Juarez,Raymondville,99.06,274.42,156.49,199.58,630.49,Single-ply,SBD,M
Div 2,99.79,11,Brandon Sanchez,Fort Stockton,93.8,226.8,131.54,238.14,596.47,Single-ply,SBD,M
Div 2,99.79,12,Nate Krumrei,Lucas Lovejoy,90.54,204.12,138.35,233.6,576.06,Single-ply,SBD,M
Div 2,99.79,DQ,Kelbie Stifflemire,Taylor,97.43,,,,,Single-ply,SBD,M
Div 2,109.77,1,Justin Thacker #2,Iowa Park,109.5,340.19,204.12,283.5,827.81,Single-ply,SBD,M
Div 2,109.77,2,Scott Dobbins,Burkburnett,108.59,317.51,195.04,242.67,755.23,Single-ply,SBD,M
Div 2,109.77,3,Josh Webster,Texarkana Liberty-Eylau,109.68,283.5,163.29,254.01,700.8,Single-ply,SBD,M
Div 2,109.77,4,John Trotter,Rusk,106.68,251.74,174.63,260.82,687.19,Single-ply,SBD,M
Div 2,109.77,5,Thomas Luce,Bridge City,108.14,294.84,156.49,235.87,687.19,Single-ply,SBD,M
Div 2,109.77,6,Kevin Crew,Splendora,105.87,267.62,170.1,235.87,673.58,Single-ply,SBD,M
Div 2,109.77,7,Cecilio Zarate,Corpus Christi West Oso,108.95,288.03,156.49,217.72,662.24,Single-ply,SBD,M
Div 2,109.77,8,Eddie Hernandez,Ingleside,101.88,242.67,158.76,258.55,659.98,Single-ply,SBD,M
Div 2,109.77,9,Morgan Hohle,Giddings,105.14,265.35,163.29,231.33,659.98,Single-ply,SBD,M
Div 2,109.77,10,Jose Flores #6,Seminole,107.32,231.33,147.42,217.72,596.47,Single-ply,SBD,M
Div 2,109.77,11,Joey Elizardo,Brownfield,106.14,222.26,140.61,231.33,594.21,Single-ply,SBD,M
Div 2,124.74,DQ,Zack Kelly,Caldwell,109.86,249.48,,,,Single-ply,SBD,M
Div 2,124.74,1,Joe Trevino,Raymondville,123.92,362.87,170.1,260.82,793.79,Single-ply,SBD,M
Div 2,124.74,2,Brieon Brown,Smithville,121.02,317.51,183.7,272.16,773.37,Single-ply,SBD,M
Div 2,124.74,3,Dylan Sells,Gladewater,121.56,290.3,188.24,281.23,759.77,Single-ply,SBD,M
Div 2,124.74,4,Brandon Rodriguez,Somerset,122.74,326.59,161.03,265.35,752.96,Single-ply,SBD,M
Div 2,124.74,5,Caleb England,Iowa Park,124.47,317.51,190.51,233.6,741.62,Single-ply,SBD,M
Div 2,124.74,6,Josh Holt,Lorena,122.29,288.03,158.76,288.03,734.82,Single-ply,SBD,M
Div 2,124.74,7,Jeremy Dowdy,Emory Rains,123.01,315.25,165.56,229.06,709.87,Single-ply,SBD,M
Div 2,124.74,8,Tyler Klander,West,117.93,285.76,161.03,260.82,707.6,Single-ply,SBD,M
Div 2,124.74,9,Ty Coker,Midland Greenwood,122.2,294.84,183.7,226.8,705.34,Single-ply,SBD,M
Div 2,124.74,10,Irvin Sanchez,Andrews,118.21,288.03,165.56,233.6,687.19,Single-ply,SBD,M
Div 2,124.74,11,Adam Aucoin,Palacios,110.22,281.23,158.76,222.26,662.24,Single-ply,SBD,M
Div 2,124.74,12,Joe Merino,Anna,122.02,274.42,140.61,219.99,635.03,Single-ply,SBD,M
Div 2,124.74,13,Aaron Boucher,West Columbia,113.13,229.06,142.88,224.53,596.47,Single-ply,SBD,M
Div 2,124.74+,1,Lorenzo Barnes,Burkburnett,146.15,362.87,240.4,272.16,875.43,Single-ply,SBD,M
Div 2,124.74+,2,Harry White,Pittsburg,168.1,347,183.7,281.23,811.93,Single-ply,SBD,M
Div 2,124.74+,3,Ed Jones,Waco La Vega,158.76,312.98,195.04,290.3,798.32,Single-ply,SBD,M
Div 2,124.74+,4,Matt Kirkland,Pittsburg,136.35,324.32,167.83,281.23,773.37,Single-ply,SBD,M
Div 2,124.74+,5,Jordan Gill,Paris,131.63,331.12,188.24,244.94,764.3,Single-ply,SBD,M
Div 2,124.74+,6,Reggie Dickson,Rusk,137.53,340.19,174.63,238.14,752.96,Single-ply,SBD,M
Div 2,124.74+,7,Dewon Davis,Navasota,128.64,299.37,165.56,276.69,741.62,Single-ply,SBD,M
Div 2,124.74+,8,Victor Buitrago,La Vernia,130.36,303.91,197.31,240.4,741.62,Single-ply,SBD,M
Div 2,124.74+,9,Reid Graves,Iowa Park,150.86,306.17,183.7,235.87,725.75,Single-ply,SBD,M
Div 2,124.74+,10,Matt Jones #8,Ingleside,129.09,290.3,185.97,240.4,716.68,Single-ply,SBD,M
Div 2,124.74+,11,Ryan Allen #1,West Orange-Stark,145.33,272.16,149.69,290.3,712.14,Single-ply,SBD,M
Div 2,124.74+,12,Al Valderas,Levelland,150.77,290.3,158.76,199.58,648.64,Single-ply,SBD,M
Div 2,124.74+,13,Cullen Burch,Cleveland,136.44,272.16,170.1,204.12,646.37,Single-ply,SBD,M
Div 2,124.74+,14,Hippo Brito,Fort Stockton,140.16,272.16,127.01,222.26,621.42,Single-ply,SBD,M
Div 2,,NS,Ruben Vargas,Princeton,,,,,,Single-ply,SBD,M
