Division,WeightClassKg,Place,Name,Team,BodyweightKg,Best3SquatKg,Best3BenchKg,Best3DeadliftKg,TotalKg,Equipment,Event,Sex,BirthDate
Boys,51.71,1,John Ortega,Mercedes,51.26,188.24,120.2,183.7,492.15,Single-ply,SBD,M,
Boys,51.71,2,Jesus Puente,La Joya Palmview,51.07,174.63,106.59,174.63,455.86,Single-ply,SBD,M,
Boys,51.71,3,Rolando Roldan,McAllen,51.39,147.42,72.57,142.88,362.87,Single-ply,SBD,M,
Boys,51.71,4,Alex Guajardo,La Joya,49.9,115.67,58.97,122.47,297.1,Single-ply,SBD,M,
Boys,51.71,5,Victor Vazquez,Sharyland Pioneer,51.48,106.59,61.23,124.74,292.57,Single-ply,SBD,M,
Boys,51.71,6,Jacob Martinez,Donna North,47.63,108.86,58.97,122.47,290.3,Single-ply,SBD,M,
Boys,51.71,DQ,Roger Alamillo,Rio Grande City Grulla,40.69,61.23,34.02,,,Single-ply,SBD,M,
Boys,51.71,DQ,Freddy Guerrero,Rio Grande City Grulla,49.44,56.7,,,,Single-ply,SBD,M,
Boys,55.79,1,Fred Mares,Edinburg,55.38,140.61,104.33,190.51,435.45,Single-ply,SBD,M,
Boys,55.79,2,Gael Gonzalez,La Joya Palmview,55.2,131.54,70.31,142.88,344.73,Single-ply,SBD,M,
Boys,55.79,3,Luis Garcia #9,Sharyland Pioneer,51.94,124.74,70.31,147.42,342.46,Single-ply,SBD,M,
Boys,55.79,4,Isaias Salinas,McAllen Memorial,52.53,104.33,70.31,142.88,317.51,Single-ply,SBD,M,
Boys,55.79,DQ,Joel Madrigal,Donna North,55.29,,,,,Single-ply,SBD,M,
Boys,59.87,1,Giovanni Salazar,La Joya,58.51,219.99,102.06,215.46,537.51,Single-ply,SBD,M,
Boys,59.87,2,Patricio Chavez,Mission Sharyland,58.69,208.65,106.59,199.58,514.83,Single-ply,SBD,M,
Boys,59.87,3,Jorge Guajardo,Weslaco East,56.38,158.76,99.79,190.51,449.06,Single-ply,SBD,M,
Boys,59.87,4,Jesus Coronado,Sharyland Pioneer,58.38,120.2,77.11,131.54,328.85,Single-ply,SBD,M,
Boys,59.87,5,Thomas Marina,Sharyland Pioneer,57.7,102.06,61.23,124.74,288.03,Single-ply,SBD,M,
Boys,67.13,1,Fernando Briones,McAllen Memorial,66.45,215.46,136.08,199.58,551.11,Single-ply,SBD,M,
Boys,67.13,2,Justin Chairez,McAllen Memorial,65.95,213.19,124.74,188.24,526.17,Single-ply,SBD,M,
Boys,67.13,3,Adan Elizondo,La Joya,67.09,188.24,120.2,183.7,492.15,Single-ply,SBD,M,
Boys,67.13,4,Alexander Lomas,McAllen Rowe,67.13,176.9,111.13,197.31,485.34,Single-ply,SBD,M,
Boys,67.13,5,Raven Figueroa,Weslaco East,65.95,172.37,113.4,197.31,483.08,Single-ply,SBD,M,
Boys,67.13,6,Joe Montoya,La Joya,63.19,190.51,88.45,183.7,462.66,Single-ply,SBD,M,
Boys,67.13,7,Daniel Acuna,Donna North,64.55,156.49,102.06,183.7,442.25,Single-ply,SBD,M,
Boys,67.13,8,Anthony Trevino,Rio Grande City Grulla,61.78,161.03,90.72,183.7,435.45,Single-ply,SBD,M,
Boys,67.13,9,Yahir Balderas,Donna North,66.77,154.22,97.52,181.44,433.18,Single-ply,SBD,M,
Boys,67.13,10,Joseph Navarro,Edinburg Vela,66.63,147.42,97.52,181.44,426.38,Single-ply,SBD,M,
Boys,67.13,11,Fidencio Ozuna,La Joya Juarez-Lincoln,65.86,165.56,113.4,140.61,419.57,Single-ply,SBD,M,
Boys,67.13,12,Alexandro Gonzalez,McAllen,63.96,163.29,86.18,149.69,399.16,Single-ply,SBD,M,
Boys,67.13,13,Ramses Vasquez,Edinburg,61.69,127.01,92.99,147.42,367.41,Single-ply,SBD,M,
Boys,67.13,14,Miguel Rodriguez,Donna North,61.92,129.27,70.31,151.95,351.53,Single-ply,SBD,M,
Boys,67.13,15,Eliu Padilla,La Joya Juarez-Lincoln,62.64,115.67,65.77,142.88,324.32,Single-ply,SBD,M,
Boys,67.13,16,Brando Arredondo,Rio Grande City,64.59,122.47,77.11,111.13,310.71,Single-ply,SBD,M,
Boys,67.13,17,Esai Pacheco,Edinburg Vela,64.14,90.72,72.57,111.13,274.42,Single-ply,SBD,M,
Boys,67.13,DQ,Brandon Lopez,Mission Sharyland,66.68,165.56,,,,Single-ply,SBD,M,
Boys,67.13,DQ,Emmanuel Vega,Mission Sharyland,64.95,,,,,Single-ply,SBD,M,
Boys,67.13,DQ,Kameron Maples,McAllen Memorial,65.54,,,,,Single-ply,SBD,M,
Boys,74.84,1,Eddie Luna,Mercedes,72.76,233.6,129.27,231.33,594.21,Single-ply,SBD,M,
Boys,74.84,2,Fabian Rodriguez,McAllen Memorial,74.8,222.26,142.88,222.26,587.4,Single-ply,SBD,M,
Boys,74.84,3,Michael Garcia,Edinburg Vela,73.71,215.46,142.88,210.92,569.26,Single-ply,SBD,M,
Boys,74.84,4,Eduardo Mujica,Edinburg,73.07,201.85,147.42,190.51,539.77,Single-ply,SBD,M,
Boys,74.84,5,Jerred Fuentes,Mercedes,73.94,213.19,124.74,192.78,530.7,Single-ply,SBD,M,
Boys,74.84,6,Fidencio Ortega,La Joya Juarez-Lincoln,67.49,195.04,138.35,183.7,517.1,Single-ply,SBD,M,
Boys,74.84,7,Brian Pena,Rio Grande City,70.13,199.58,122.47,183.7,505.76,Single-ply,SBD,M,
Boys,74.84,8,Adam Garza,Donna North,72.85,179.17,120.2,199.58,498.95,Single-ply,SBD,M,
Boys,74.84,9,Mauricio Trejo,Weslaco East,71.49,190.51,111.13,192.78,494.42,Single-ply,SBD,M,
Boys,74.84,10,Sergio Perez,Mission Sharyland,74.71,192.78,111.13,190.51,494.42,Single-ply,SBD,M,
Boys,74.84,11,Juan Garza,Edinburg,74.25,170.1,120.2,190.51,480.81,Single-ply,SBD,M,
Boys,74.84,12,Jorge Robles,Sharyland Pioneer,74.53,185.97,102.06,183.7,471.74,Single-ply,SBD,M,
Boys,74.84,13,Angel Cantu,La Joya Palmview,71.44,183.7,113.4,170.1,467.2,Single-ply,SBD,M,
Boys,74.84,14,Humberto Martinez,Donna North,73.75,158.76,106.59,195.04,460.4,Single-ply,SBD,M,
Boys,74.84,15,Ej Garcia,Rio Grande City,67.86,183.7,115.67,158.76,458.13,Single-ply,SBD,M,
Boys,74.84,16,Armando Santos,Weslaco East,68.4,165.56,102.06,183.7,451.32,Single-ply,SBD,M,
Boys,74.84,17,Wilmer Garcia,Donna North,73.16,156.49,113.4,151.95,421.84,Single-ply,SBD,M,
Boys,74.84,18,Cesar Benavides,Sharyland Pioneer,71.35,154.22,86.18,158.76,399.16,Single-ply,SBD,M,
Boys,74.84,19,Jaime Garza,Rio Grande City,72.8,136.08,83.91,83.91,303.91,Single-ply,SBD,M,
Boys,74.84,DQ,Charlie Lomax,Sharyland Pioneer,72.39,124.74,,,,Single-ply,SBD,M,
Boys,74.84,DQ,Miguel Castillo,Edinburg Vela,73.26,233.6,138.35,,,Single-ply,SBD,M,
Boys,74.84,DQ,Michael Thompson,Edinburg Vela,69.9,151.95,,,,Single-ply,SBD,M,
Boys,82.1,1,Brandon Adame,Mercedes,82.1,256.28,142.88,244.94,644.1,Single-ply,SBD,M,
Boys,82.1,2,Angel Vasquez,Edinburg Vela,81.15,238.14,158.76,244.94,641.83,Single-ply,SBD,M,
Boys,82.1,3,Armando Resendez,McAllen Memorial,81.56,235.87,151.95,204.12,591.94,Single-ply,SBD,M,
Boys,82.1,4,Rosbel Zamarripa,La Joya Palmview,81.01,226.8,136.08,226.8,589.67,Single-ply,SBD,M,
Boys,82.1,5,Mauricio Sanchez,Mission Sharyland,79.56,222.26,142.88,219.99,585.13,Single-ply,SBD,M,
Boys,82.1,6,Raymond Villegas,La Joya,80.1,222.26,122.47,208.65,553.38,Single-ply,SBD,M,
Boys,82.1,7,Santino Pascual,Mission Sharyland,80.65,233.6,111.13,204.12,548.85,Single-ply,SBD,M,
Boys,82.1,8,Irwin Morin,Weslaco East,80.24,190.51,131.54,208.65,530.7,Single-ply,SBD,M,
Boys,82.1,9,Jose Rodriguez,Rio Grande City,79.83,185.97,133.81,195.04,514.83,Single-ply,SBD,M,
Boys,82.1,10,Miguel Jimenez,Mercedes,79.83,181.44,106.59,204.12,492.15,Single-ply,SBD,M,
Boys,82.1,11,Victor Carbajal,Mission Sharyland,78.65,188.24,102.06,197.31,487.61,Single-ply,SBD,M,
Boys,82.1,12,Jacob Cano,Mission Sharyland,80.88,185.97,88.45,167.83,442.25,Single-ply,SBD,M,
Boys,82.1,13,Joaquin Pena,Rio Grande City Grulla,78.52,120.2,61.23,127.01,308.44,Single-ply,SBD,M,
Boys,82.1,DQ,Gonzalo Perez,Mission,81.78,226.8,133.81,,,Single-ply,SBD,M,
Boys,89.81,1,Benjamin Passement,McAllen,86.82,210.92,145.15,219.99,576.06,Single-ply,SBD,M,
Boys,89.81,2,Elian Padilla,La Joya Juarez-Lincoln,85.09,219.99,129.27,215.46,564.72,Single-ply,SBD,M,
Boys,89.81,3,Albertico Garza,La Joya,82.19,226.8,111.13,219.99,557.92,Single-ply,SBD,M,
Boys,89.81,4,Miguel Vasquez,Donna North,88.13,208.65,102.06,222.26,532.97,Single-ply,SBD,M,
Boys,89.81,5,Gus Vasquez,Donna North,86.09,206.38,124.74,190.51,521.63,Single-ply,SBD,M,
Boys,89.81,6,Mauricio Galindo,Mission Sharyland,89.31,201.85,131.54,185.97,519.36,Single-ply,SBD,M,
Boys,89.81,7,Isaiah Ailstock,McAllen,87.91,197.31,108.86,165.56,471.74,Single-ply,SBD,M,
Boys,89.81,8,Ramiro Garcia,Mission,87.18,183.7,115.67,170.1,469.47,Single-ply,SBD,M,
Boys,89.81,9,David Resio,Sharyland Pioneer,83.28,190.51,106.59,170.1,467.2,Single-ply,SBD,M,
Boys,89.81,10,Ronnie Salas,Weslaco East,88.22,183.7,102.06,179.17,464.93,Single-ply,SBD,M,
Boys,89.81,11,Jonathan Maldonado,Edinburg,84.55,163.29,117.93,158.76,439.98,Single-ply,SBD,M,
Boys,99.79,1,Albert Vargas,La Joya Palmview,97.66,276.69,181.44,244.94,703.07,Single-ply,SBD,M,
Boys,99.79,2,Frankie Coronado,Edinburg,97.66,272.16,170.1,215.46,657.71,Single-ply,SBD,M,
Boys,99.79,3,Cristian Hernandez,Mission,97.43,249.48,129.27,231.33,610.08,Single-ply,SBD,M,
Boys,99.79,4,Quan Nguyen,McAllen,98.07,254.01,131.54,210.92,596.47,Single-ply,SBD,M,
Boys,99.79,5,Dylan De La Garza,Edinburg Vela,95.75,233.6,133.81,226.8,594.21,Single-ply,SBD,M,
Boys,99.79,6,Oscar Cruz,Edinburg,97.57,229.06,136.08,229.06,594.21,Single-ply,SBD,M,
Boys,99.79,7,Erik Flores,La Joya Juarez-Lincoln,99.29,260.82,129.27,195.04,585.13,Single-ply,SBD,M,
Boys,99.79,8,Zac Compean,Rio Grande City,95.71,217.72,142.88,213.19,573.79,Single-ply,SBD,M,
Boys,99.79,9,Daniel Alejandro,McAllen Rowe,97.02,229.06,127.01,208.65,564.72,Single-ply,SBD,M,
Boys,99.79,10,Abelino Lopez,Rio Grande City Grulla,96.52,226.8,104.33,204.12,535.24,Single-ply,SBD,M,
Boys,99.79,11,Devin Gonzalez #1,Rio Grande City,91.26,197.31,129.27,199.58,526.17,Single-ply,SBD,M,
Boys,99.79,12,Ezequiel Coronado,La Joya,97.25,174.63,133.81,199.58,508.02,Single-ply,SBD,M,
Boys,99.79,13,Brandon Santiago,Donna North,97.79,183.7,113.4,192.78,489.88,Single-ply,SBD,M,
Boys,99.79,14,Roy Alaniz,La Joya,95.93,163.29,102.06,192.78,458.13,Single-ply,SBD,M,
Boys,99.79,15,Rene Garcia,La Joya Juarez-Lincoln,92.8,172.37,117.93,163.29,453.59,Single-ply,SBD,M,
Boys,99.79,16,Juan Villarreal,Sharyland Pioneer,91.9,158.76,106.59,183.7,449.06,Single-ply,SBD,M,
Boys,99.79,DQ,Juan Mendoza #2,Edinburg,90.26,199.58,,,,Single-ply,SBD,M,
Boys,99.79,DQ,Joey Cavazos,McAllen Rowe,98.16,,,,,Single-ply,SBD,M,
Boys,99.79,DQ,Brandon Mendez,La Joya Juarez-Lincoln,91.49,181.44,111.13,,,Single-ply,SBD,M,
Boys,109.77,1,Kris Garza,Rio Grande City,107.64,231.33,142.88,231.33,605.55,Single-ply,SBD,M,
Boys,109.77,2,Kaleb Garza,Rio Grande City,107.32,224.53,133.81,229.06,587.4,Single-ply,SBD,M,
Boys,109.77,3,Josue Moralez,Weslaco East,104.92,219.99,147.42,217.72,585.13,Single-ply,SBD,M,
Boys,109.77,4,Houston Torres,Mission,107.32,240.4,142.88,197.31,580.6,Single-ply,SBD,M,
Boys,109.77,5,Erik Flores,La Joya Palmview,103.28,224.53,113.4,222.26,560.19,Single-ply,SBD,M,
Boys,109.77,6,Anthony Celis,McAllen Rowe,102.92,213.19,120.2,219.99,553.38,Single-ply,SBD,M,
Boys,109.77,7,Rusbel Alanis,Rio Grande City Grulla,107.73,208.65,122.47,206.38,537.51,Single-ply,SBD,M,
Boys,109.77,8,Ivan Ordonez,Weslaco East,106.32,192.78,124.74,151.95,469.47,Single-ply,SBD,M,
Boys,109.77,DQ,Steven Pedraza,McAllen,108.82,256.28,,,,Single-ply,SBD,M,
Boys,109.77,DQ,Caleb Vega,McAllen,102.78,176.9,92.99,,,Single-ply,SBD,M,
Boys,109.77,DQ,Jj Johnson,McAllen Memorial,106.68,229.06,,,,Single-ply,SBD,M,
Boys,109.77,DQ,Joshua Herrera,McAllen,101.79,,,,,Single-ply,SBD,M,
Boys,109.77,DQ,Fausto Anaya,McAllen Rowe,108.18,204.12,,,,Single-ply,SBD,M,
Boys,124.74,1,Israel Monsivaiz,La Joya Juarez-Lincoln,123.65,269.89,170.1,249.48,689.46,Single-ply,SBD,M,
Boys,124.74,2,Alex Mendiola,La Joya Palmview,123.65,288.03,156.49,217.72,662.24,Single-ply,SBD,M,
Boys,124.74,3,Ezequiel Garcia,La Joya Juarez-Lincoln,112.13,272.16,165.56,219.99,657.71,Single-ply,SBD,M,
Boys,124.74,4,Jose Molina,McAllen,113.35,233.6,149.69,204.12,587.4,Single-ply,SBD,M,
Boys,124.74,5,Jayden Morales,Mission,121.56,240.4,136.08,201.85,578.33,Single-ply,SBD,M,
Boys,124.74,6,Orlando Camacho,Sharyland Pioneer,114.31,210.92,136.08,210.92,557.92,Single-ply,SBD,M,
Boys,124.74,7,Joey Gonzalez,McAllen Memorial,124.06,233.6,138.35,179.17,551.11,Single-ply,SBD,M,
Boys,124.74,8,Robert Torres,Weslaco East,112.08,201.85,136.08,192.78,530.7,Single-ply,SBD,M,
Boys,124.74,9,Nathan Garza,Edinburg,114.4,204.12,131.54,192.78,528.44,Single-ply,SBD,M,
Boys,124.74,10,Jose Zavala,Weslaco East,111.99,210.92,122.47,192.78,526.17,Single-ply,SBD,M,
Boys,124.74,11,Ricky Martin,Mission,113.62,165.56,104.33,158.76,428.64,Single-ply,SBD,M,
Boys,124.74,DQ,Carlos Olmedo,Mercedes,113.26,238.14,,,,Single-ply,SBD,M,
Boys,124.74,DQ,Thomas Domain,McAllen Memorial,117.48,195.04,,,,Single-ply,SBD,M,
Boys,124.74,DQ,Alexander Guerra,McAllen Memorial,112.54,,,,,Single-ply,SBD,M,
Boys,124.74,DQ,Kobe Duenas,Mercedes,113.85,,,,,Single-ply,SBD,M,
Boys,124.74+,1,Sergio Reyna,McAllen Memorial,130.86,322.05,190.51,226.8,739.36,Single-ply,SBD,M,
Boys,124.74+,2,Genero Paez,Edinburg,159.53,260.82,165.56,235.87,662.24,Single-ply,SBD,M,
Boys,124.74+,3,Anthony Ortiz,Rio Grande City,126.28,240.4,158.76,244.94,644.1,Single-ply,SBD,M,
Boys,124.74+,4,Jimmy Talamantes,McAllen Rowe,136.89,254.01,138.35,204.12,596.47,Single-ply,SBD,M,
Boys,124.74+,5,Jacob Mata,McAllen Rowe,151.95,217.72,172.37,206.38,596.47,Single-ply,SBD,M,
Boys,124.74+,6,Cory Villegas,McAllen,125.74,235.87,117.93,213.19,566.99,Single-ply,SBD,M,
Boys,124.74+,7,Omar Olvera,Weslaco East,134.99,210.92,147.42,204.12,562.45,Single-ply,SBD,M,
Boys,124.74+,8,Humberto Garcia,Edinburg,141.84,226.8,122.47,183.7,532.97,Single-ply,SBD,M,
Boys,124.74+,9,Gustavo Pedraza,Mission,140.16,199.58,124.74,192.78,517.1,Single-ply,SBD,M,
Boys,124.74+,10,Tony Garcia,McAllen Rowe,128.37,163.29,111.13,161.03,435.45,Single-ply,SBD,M,
