Name,WeightClassKg,Division,Sex,Best3SquatKg,Best3BenchKg,Best3DeadliftKg,TotalKg,Event,Equipment,Place
Victor Horne,52,Open,M,120.2,81.65,161.03,362.87,SBD,Single-ply,1
Frank Provenzano,52,Open,M,124.74,88.45,149.69,362.87,SBD,Single-ply,2
K. Wilson,52,Open,M,81.65,47.63,97.52,226.8,SBD,Single-ply,3
D. Bagwell,52,Open,M,45.36,29.48,83.91,158.76,SBD,Single-ply,4
M. Collins,52,Open,M,-129.27,-70.31,-136.08,,SBD,Single-ply,DQ
Mike Cross #1,56,Open,M,156.49,95.25,210.92,462.66,SBD,Single-ply,1
Brett Whatley,56,Open,M,113.4,77.11,158.76,349.27,SBD,Single-ply,2
Tony Provenzano,56,Open,M,102.06,70.31,142.88,315.25,SBD,Single-ply,3
B. Hill,56,Open,M,102.06,70.31,140.61,312.98,SBD,Single-ply,4
R. Casalino,56,Open,M,113.4,70.31,127.01,310.71,SBD,Single-ply,5
K. Roberts,56,Open,M,111.13,70.31,127.01,308.44,SBD,Single-ply,6
John Edenfield,60,Open,M,185.97,108.86,190.51,485.34,SBD,Single-ply,1
Mike Shackelford,60,Open,M,156.49,127.01,181.44,464.93,SBD,Single-ply,2
John Stankewich,60,Open,M,163.29,104.33,176.9,444.52,SBD,Single-ply,3
W. Morris,60,Open,M,131.54,97.52,185.97,415.04,SBD,Single-ply,4
Mary Thompson,60,Open,F,99.79,47.63,143.79,291.21,SBD,Single-ply,5
T. Pearson,60,Open,M,24.95,77.11,122.47,224.53,SBD,Single-ply,6
Daniel Austin #1,67.5,Open,M,233.6,149.69,251.74,635.03,SBD,Single-ply,1
J. Smith #22,67.5,Open,M,190.51,136.08,226.8,553.38,SBD,Single-ply,2
Harvey Coney,67.5,Open,M,199.58,115.67,226.8,542.04,SBD,Single-ply,3
R. Botte,67.5,Open,M,142.88,124.74,190.51,458.13,SBD,Single-ply,4
Chris George,67.5,Open,M,145.15,102.06,204.12,451.32,SBD,Single-ply,5
E. Gagles,67.5,Open,M,163.29,117.93,167.83,449.06,SBD,Single-ply,6
S. Crenshaw,67.5,Open,M,95.25,52.16,129.27,276.69,SBD,Single-ply,7
D. Thompson,67.5,Open,M,,,,,SBD,Single-ply,DQ
D. Head,67.5,Open,M,,,,,SBD,Single-ply,DQ
Troy Hicks,75,Open,M,249.48,147.42,294.84,691.73,SBD,Single-ply,1
Mike Joyner,75,Open,M,213.19,145.15,258.55,616.89,SBD,Single-ply,2
Rickey Posey,75,Open,M,213.19,149.69,247.21,610.08,SBD,Single-ply,3
Steve Wood,75,Open,M,210.92,138.35,249.48,598.74,SBD,Single-ply,4
S. George,75,Open,M,199.58,136.08,244.94,580.6,SBD,Single-ply,5
Charles Thompson,75,Open,M,199.58,127.01,240.4,566.99,SBD,Single-ply,6
Clealan Watts,75,Open,M,185.97,117.93,238.14,542.04,SBD,Single-ply,7
S. Czerepinski,75,Open,M,215.46,113.4,208.65,537.51,SBD,Single-ply,8
D. Daniel,75,Open,M,195.04,138.35,195.04,528.44,SBD,Single-ply,9
R. Whedbee,75,Open,M,154.22,129.27,201.85,485.34,SBD,Single-ply,10
S. Coppock,75,Open,M,117.93,113.4,195.04,426.38,SBD,Single-ply,11
C. Pressley,82.5,Open,M,229.06,188.24,265.35,682.66,SBD,Single-ply,1
R. Lee,82.5,Open,M,219.99,156.49,254.01,630.49,SBD,Single-ply,2
Lonnie Hood,82.5,Open,M,217.72,170.1,240.4,628.23,SBD,Single-ply,3
Robert Petty,82.5,Open,M,190.51,138.35,263.08,591.94,SBD,Single-ply,4
P. Sullivan,82.5,Open,M,213.19,140.61,229.06,582.87,SBD,Single-ply,5
C. Hill,82.5,Open,M,181.44,129.27,204.12,514.83,SBD,Single-ply,6
Ken Newman,90,Open,M,290.3,165.56,294.84,750.7,SBD,Single-ply,1
Lonnie Keyes,90,Open,M,258.55,192.78,276.69,728.02,SBD,Single-ply,2
Mike Stone #1,90,Open,M,272.16,190.51,249.48,712.14,SBD,Single-ply,4
Dan Davidson,90,Open,M,272.16,158.76,294.84,725.75,SBD,Single-ply,3
D. Daniels,90,Open,M,251.74,170.1,290.3,712.14,SBD,Single-ply,5
Darrell Carnes,90,Open,M,249.48,172.37,272.16,694,SBD,Single-ply,6
Ron Tullis,90,Open,M,249.48,156.49,276.69,682.66,SBD,Single-ply,7
Joe Gravitt,90,Open,M,235.87,167.83,278.96,682.66,SBD,Single-ply,8
J. Sanders,90,Open,M,213.19,122.47,249.48,585.13,SBD,Single-ply,9
E. Cole,90,Open,M,192.78,111.13,204.12,508.02,SBD,Single-ply,10
Robert Crawford #1,90,Open,M,,,,,SBD,Single-ply,DQ
Fletcher Carter,100,Open,M,317.52,208.65,324.32,850.49,SBD,Single-ply,1
Danny Moraetes,100,Open,M,322.05,199.58,317.52,839.15,SBD,Single-ply,2
Joe Cummins,100,Open,M,292.57,185.97,260.82,739.36,SBD,Single-ply,3
Victor Harrelson,100,Open,M,272.16,167.83,263.08,703.07,SBD,Single-ply,4
Jerry Beckham,100,Open,M,272.16,170.1,256.28,698.53,SBD,Single-ply,5
R. Bumgarner,100,Open,M,265.35,167.83,249.48,682.66,SBD,Single-ply,6
H. Brown,100,Open,M,238.14,154.22,238.14,630.49,SBD,Single-ply,7
J. Robertoy,100,Open,M,192.78,142.88,226.8,562.46,SBD,Single-ply,8
C. Scoggins,100,Open,M,206.38,149.69,199.58,555.65,SBD,Single-ply,9
Vince Harrelson,110,Open,M,299.37,190.51,317.52,807.4,SBD,Single-ply,1
Eddie Bodkin,110,Open,M,294.84,179.17,294.84,768.84,SBD,Single-ply,2
Johnny Langston,110,Open,M,283.5,188.24,283.5,755.23,SBD,Single-ply,3
Tom King,110,Open,M,272.16,167.83,281.23,721.21,SBD,Single-ply,4
R. Bickers,110,Open,M,226.8,165.56,272.16,664.51,SBD,Single-ply,5
T. Moraetes,110,Open,M,,,,,SBD,Single-ply,DQ
Doug Ricafrente,125,Open,M,324.32,201.85,301.64,827.81,SBD,Single-ply,1
N. Strange,125,Open,M,272.16,163.29,274.42,709.87,SBD,Single-ply,2
EJ Kreis,125,Open,M,274.42,163.29,242.67,680.39,SBD,Single-ply,3
R. English,125,Open,M,249.48,181.44,249.48,680.39,SBD,Single-ply,4
Bob Floyd,125,Open,M,226.8,147.42,226.8,601.01,SBD,Single-ply,5
Gary Reynolds,125+,Open,M,290.3,208.65,353.8,852.75,SBD,Single-ply,1
Bill McElveen,125+,Open,M,331.12,217.72,303.91,852.75,SBD,Single-ply,2
Stephen Stone,125+,Open,M,317.52,181.44,294.84,793.79,SBD,Single-ply,3
Julian Smith,125+,Open,M,272.16,215.46,263.08,750.7,SBD,Single-ply,4
D. Coleman,125+,Open,M,226.8,158.76,317.52,703.07,SBD,Single-ply,5
Kevin Payne #1,125+,Open,M,256.28,199.58,240.4,696.27,SBD,Single-ply,6
