Division,WeightClassKg,Place,Name,Team,BodyweightKg,Best3SquatKg,Best3BenchKg,Best3DeadliftKg,TotalKg,Equipment,Event,Sex,BirthDate
Boys,59.87,1,Cole Schroeder,Huntsville,56.93,111.13,61.23,108.86,281.23,Single-ply,SBD,M,
Boys,67.13,1,Ian Martin,Danbury,65.41,147.42,70.31,102.06,319.78,Single-ply,SBD,M,
Boys,67.13,DQ,Clayton Johnson,Danbury,67.04,129.27,,,,Single-ply,SBD,M,
Boys,74.84,1,Isiah Collins,Huntsville,70.81,102.06,70.31,113.4,285.76,Single-ply,SBD,M,
Boys,82.1,1,Tyler Luchak,Huntsville,78.74,156.49,102.06,183.7,442.25,Single-ply,SBD,M,
Boys,82.1,2,Camron Barmettler,Danbury,78.02,142.88,83.91,149.69,376.48,Single-ply,SBD,M,
Boys,82.1,3,Israel Ayala,Danbury,81.74,127.01,81.65,129.27,337.93,Single-ply,SBD,M,
Boys,89.81,1,Thomas Knapp,Huntsville,89.13,147.42,83.91,142.88,374.21,Single-ply,SBD,M,
Boys,89.81,2,Seth Carroll,Huntsville,82.87,136.08,74.84,136.08,347,Single-ply,SBD,M,
Boys,99.79,1,Keyshawn Mayers,Huntsville,92.08,208.65,131.54,204.12,544.31,Single-ply,SBD,M,
Boys,99.79,2,Dakota Craig,Danbury,98.02,154.22,154.22,154.22,462.66,Single-ply,SBD,M,
Boys,99.79,3,Donato Cortes,Danbury,99.7,147.42,104.33,149.69,401.43,Single-ply,SBD,M,
Boys,109.77,1,James White,Danbury,100.83,222.26,165.56,226.8,614.62,Single-ply,SBD,M,
Boys,109.77,2,Kenry McKinney,Danbury,109.27,204.12,124.74,142.88,471.74,Single-ply,SBD,M,
Boys,124.74,1,Cesar Robledo,Huntsville,117.03,165.56,111.13,142.88,419.57,Single-ply,SBD,M,
Boys,139.71,1,Noel Hunter,Danbury,129.27,199.58,131.54,204.12,535.24,Single-ply,SBD,M,
Boys,139.71,2,Chris Smith #7,Huntsville,129.73,224.53,124.74,183.7,532.97,Single-ply,SBD,M,
Boys,139.71,3,Shamar Standford,Huntsville,137.08,204.12,124.74,185.97,514.83,Single-ply,SBD,M,
Boys,139.71,4,Thomas Rose,Huntsville,128.28,208.65,111.13,181.44,501.22,Single-ply,SBD,M,
