Tested,Event,Equipment,Sex,WeightClassKg,Name,CyrillicName,BirthDate,Age,Division,BodyweightKg,Squat1Kg,Squat2Kg,Squat3Kg,Squat4Kg,Best3SquatKg,Bench1Kg,Bench2Kg,Bench3Kg,Bench4Kg,Best3BenchKg,Deadlift1Kg,Deadlift2Kg,Deadlift3Kg,Deadlift4Kg,Best3DeadliftKg,TotalKg,Place
Yes,B,Raw,F,44,Vladislava Stadnik,Владислава Стадник,2009-05-22,10,Amateur Teen 13,38.8,,,,,,25,27.5,30,,30,,,,,,30,1
Yes,B,Raw,F,48,Nadezhda Savitskaya,Надежда Савицкая,1996-04-20,23,Amateur Juniors 20-23,47.2,,,,,,42.5,-47.5,47.5,,47.5,,,,,,47.5,1
Yes,B,Raw,F,48,Sonya Pisklova,Соня Писклова,1993-03-25,26,Amateur Open,46.7,,,,,,45,-47.5,-47.5,,45,,,,,,45,1
Yes,B,Raw,F,52,Nadezhda Sobchenko,Надежда Собченко,1984-10-23,34,Amateur Open,50.5,,,,,,45,50,-52.5,,50,,,,,,50,1
Yes,B,Raw,F,56,Vitaliya Spilnaya,Виталия Спильная,2004-02-13,15,Amateur Open,55.4,,,,,,60,65,72.5,,72.5,,,,,,72.5,1
Yes,B,Raw,F,56,Natalya Razumova,Наталья Разумова,1976-07-05,43,Amateur Masters 40-44,54.7,,,,,,60,-65,65,,65,,,,,,65,1
Yes,B,Raw,F,56,Natalya Razumova,Наталья Разумова,1976-07-05,43,Amateur Open,54.7,,,,,,60,-65,65,,65,,,,,,65,2
Yes,B,Raw,F,60,Svetlana Khomenkova,Светлана Хоменкова,1980-11-25,38,Amateur Open,59.3,,,,,,70,72.5,75,,75,,,,,,75,1
Yes,B,Raw,F,67.5,Mariya Kosenko,Мария Косенко,1987-06-06,32,Amateur Open,64.1,,,,,,-75,77.5,80,,80,,,,,,80,1
Yes,B,Raw,F,75,Lyubov Borets,Любовь Борец,1973-09-07,46,Amateur Masters 45-49,71.9,,,,,,57.5,65,-67.5,,65,,,,,,65,1
Yes,B,Raw,F,67.5,Anastasiya Kovalyova,Анастасия Ковалёва,1985-10-29,33,Amateur Open,67,,,,,,65,72.5,-77.5,,72.5,,,,,,72.5,2
Yes,B,Raw,M,52,Dmitriy Strelkov,Дмитрий Стрелков,2005-05-14,14,Amateur Teen 14-15,52,,,,,,57.5,60,65,,65,,,,,,65,1
Yes,B,Raw,M,67.5,Daniil Chzhan,Даниил Чжан,2003-12-08,15,Amateur Teen 14-15,61,,,,,,70,72.5,75,,75,,,,,,75,1
Yes,B,Raw,M,60,Ivan Ripenko,Иван Рипенко,2003-06-14,16,Amateur Teen 16-17,57.5,,,,,,85,92.5,-100,,92.5,,,,,,92.5,1
Yes,B,Raw,M,67.5,Viktor Koltsov,Виктор Кольцов,1985-02-02,34,Amateur Open,64.5,,,,,,90,100,-110,,100,,,,,,100,4
Yes,B,Raw,M,67.5,Ilya Sinetskiy,Илья Синецкий,1991-02-25,28,Amateur Open,66.4,,,,,,100,110,-115,,110,,,,,,110,3
Yes,B,Raw,M,67.5,Kirill Kirgizov,Кирилл Киргизов,1986-08-21,33,Amateur Open,66.1,,,,,,145,150,-152.5,,150,,,,,,150,1
Yes,B,Raw,M,67.5,Oleg Antonyan,Олег Антонян,1966-03-05,53,Amateur Masters 50-54,66,,,,,,72.5,77.5,-80,,77.5,,,,,,77.5,1
Yes,B,Raw,M,67.5,Anton Stepanov,Антон Степанов,1981-05-24,38,Amateur Open,67,,,,,,120,125,132.5,,132.5,,,,,,132.5,2
Yes,B,Raw,M,75,Andrey Antonyan,Андрей Антонян,1996-06-05,23,Amateur Juniors 20-23,72.4,,,,,,125,130,-132.5,,130,,,,,,130,1
Yes,B,Raw,M,75,Andrey Antonyan,Андрей Антонян,1996-06-05,23,Amateur Open,72.4,,,,,,125,130,-132.5,,130,,,,,,130,2
Yes,B,Raw,M,75,Andrey Zubarev,Андрей Зубарев,1985-01-06,34,Amateur Open,73.4,,,,,,130,-137.5,137.5,,137.5,,,,,,137.5,1
Yes,B,Raw,M,75,Danil Nenada,Данил Ненада,2002-11-29,16,Amateur Teen 16-17,71.3,,,,,,90,100,-107.5,,100,,,,,,100,1
Yes,B,Raw,M,82.5,Artyom Yurets,Артём Юрец,1986-03-04,33,Amateur Open,80.7,,,,,,160,170,-177.5,,170,,,,,,170,2
Yes,B,Raw,M,82.5,Anton Katkov,Антон Катков,1983-04-25,36,Amateur Open,80.2,,,,,,147.5,-150,-150,,147.5,,,,,,147.5,4
Yes,B,Raw,M,82.5,Aleksey Rodionov,Алексей Родионов,1974-09-21,45,Amateur Masters 45-49,81.7,,,,,,70,-75,-75,,70,,,,,,70,1
Yes,B,Raw,M,82.5,Andrey Rytikov,Андрей Рытиков,1992-01-12,27,Amateur Open,80.8,,,,,,150,160,167.5,,167.5,,,,,,167.5,3
Yes,B,Raw,M,82.5,Eduard Grigoryan,Эдуард Григорян,1977-05-12,42,Amateur Masters 40-44,78.8,,,,,,160,167.5,175,,175,,,,,,175,1
Yes,B,Raw,M,82.5,Eduard Grigoryan,Эдуард Григорян,1977-05-12,42,Amateur Open,78.8,,,,,,160,167.5,175,,175,,,,,,175,1
Yes,B,Raw,M,82.5,Vitaliy Spilnyy,Виталий Спильный,1975-09-14,44,Amateur Masters 40-44,77.4,,,,,,130,135,-142.5,,135,,,,,,135,2
Yes,B,Raw,M,82.5,Artur Mennanov,Артур Меннанов,1988-05-05,31,Amateur Open,81.5,,,,,,132.5,137.5,-140,,137.5,,,,,,137.5,5
Yes,B,Raw,M,90,Sergey Tseluyko,Сергей Целуйко,1976-09-28,43,Amateur Masters 40-44,87,,,,,,155,160,165,,165,,,,,,165,1
Yes,B,Raw,M,90,Mikhail Ulitskiy,Михаил Улицкий,1969-02-14,50,Amateur Masters 50-54,89.3,,,,,,160,165,170,,170,,,,,,170,1
Yes,B,Raw,M,90,Aleksandr Starodubov #1,Олександр Стародубов,1988-03-15,31,Amateur Open,88.7,,,,,,160,177.5,182.5,,182.5,,,,,,182.5,1
Yes,B,Raw,M,90,Vladimir Marevskiy,Владимир Марьевский,1988-04-20,31,Amateur Open,87.4,,,,,,135,142.5,147.5,,147.5,,,,,,147.5,3
Yes,B,Raw,M,90,Dmitriy Yanchukov,Дмитрий Янчуков,1993-07-06,26,Amateur Open,84.1,,,,,,157.5,-162.5,162.5,,162.5,,,,,,162.5,2
Yes,B,Raw,M,100,Ruslan Kharchenko,Руслан Харченко,1988-06-26,31,Amateur Open,94.5,,,,,,135,142.5,145,,145,,,,,,145,3
Yes,B,Raw,M,100,Aleksey Khodukin,Алексей Ходукин,1983-03-10,36,Amateur Open,99.5,,,,,,140,145,-150,,145,,,,,,145,4
Yes,B,Raw,M,100,Valeriy Chernov #1,Валерий Чернов,1970-09-04,49,Amateur Masters 45-49,99.6,,,,,,155,160,163,,163,,,,,,163,1
Yes,B,Raw,M,100,Valentin Borovskiy,Валентин Боровский,1985-05-27,34,Amateur Open,97.2,,,,,,155,165,170,,170,,,,,,170,1
Yes,B,Raw,M,100,Maksim Gorunov,Максим Горунов,1986-11-28,32,Amateur Open,97.2,,,,,,150,160,-167.5,,160,,,,,,160,2
Yes,B,Raw,M,110,Aleksey Makarov,Алексей Макаров,1971-05-24,48,Amateur Masters 45-49,106.5,,,,,,155,-160,-160,,155,,,,,,155,1
Yes,B,Raw,M,110,Sergey Pedosyuk,Сергей Педосюк,1966-07-18,53,Amateur Masters 50-54,108.8,,,,,,130,135,-137.5,,135,,,,,,135,1
Yes,B,Raw,M,110,Artem Matveychuk,Артем Матвейчук,1996-02-26,23,Amateur Open,106.6,,,,,,185,190,195,,195,,,,,,195,1
Yes,B,Raw,M,125,Vladimir Enzel,Владимир Энзель,1983-07-05,36,Amateur Open,116.5,,,,,,120,130,140,,140,,,,,,140,1
Yes,B,Raw,M,140,Ivan Listopad,Иван Листопад,1995-05-29,24,Amateur Open,126.7,,,,,,170,180,185.5,,185.5,,,,,,185.5,1
Yes,B,Single-ply,M,67.5,Aleksandr Onishchenko,Александр Онищенко,1998-01-14,21,Amateur Juniors 20-23,64.6,,,,,,170,-197.5,-197.5,,170,,,,,,170,1
Yes,B,Single-ply,M,82.5,Viktor Zinchenko,Виктор Зинченко,1983-01-07,36,Amateur Open,81.3,,,,,,125,140,-152.2,,140,,,,,,140,2
Yes,B,Single-ply,M,82.5,Ilya Alekseev,Илья Алексеев,1983-11-30,35,Amateur Open,81.9,,,,,,155,165,175,,175,,,,,,175,1
Yes,B,Single-ply,M,90,Aleksey Chadaev,Алексей Чадаев,1989-02-19,30,Amateur Open,87.8,,,,,,150,170,-187.5,,170,,,,,,170,1
Yes,B,Single-ply,M,110,Oleg Shulga,Олег Шульга,1969-03-31,50,Amateur Masters 50-54,106.4,,,,,,190,200,-215,,200,,,,,,200,1
Yes,B,Multi-ply,M,90,Dmitriy Tkachenko,Дмитрий Ткаченко,1981-04-09,38,Amateur Open,88.3,,,,,,235,247.5,252.5,,252.5,,,,,,252.5,1
Yes,B,Multi-ply,M,90,Vasiliy Leonenko,Василий Леоненко,1967-04-06,52,Amateur Masters 50-54,88.8,,,,,,220,230,240,,240,,,,,,240,1
Yes,B,Multi-ply,M,100,Dima Ermolaev,Дима Ермолаев,1989-06-07,30,Amateur Open,98.3,,,,,,-280,280,-302.5,,280,,,,,,280,1
Yes,B,Multi-ply,M,140+,Anton Barskov,Антон Барсков,1984-05-17,35,Amateur Open,159,,,,,,350,370,380,,380,,,,,,380,1
Yes,B,Single-ply,M,90,Vladislav Svezhentsev,Владислав Свеженцев,1995-09-24,24,Amateur Open,87.9,,,,,,140,-152.5,152.5,,152.5,,,,,,152.5,1
Yes,B,Single-ply,M,100,Oleg Belous,Олег Белоус,1974-11-29,44,Amateur Masters 40-44,91.8,,,,,,170,180,-185,,180,,,,,,180,1
No,B,Raw,F,56,Diana Korotkova,Диана Короткова,1987-02-22,32,Pro Open,52.2,,,,,,25,30,-37.5,,30,,,,,,30,1
No,B,Raw,F,60,Irina Vatulyova,Ирина Ватулёва,2006-07-27,13,Pro Teen 13,56.9,,,,,,30,35,37.5,,37.5,,,,,,37.5,1
No,B,Raw,F,67.5,Aleksandra Oreshchuk,Александра Орещук,1981-08-14,38,Pro Open,64.5,,,,,,-45,-45,-45,,,,,,,,,DQ
No,B,Raw,F,67.5,Svetlana Ostapenko,Светлана Остапенко,1970-03-23,49,Pro Masters 45-49,64.9,,,,,,45,-47.5,47.5,,47.5,,,,,,47.5,1
No,B,Raw,F,82.5,Yuliya Kalinchenko,Юлія Калінченко,1977-11-20,41,Pro Masters 40-44,80.1,,,,,,95,100,-107.5,,100,,,,,,100,1
No,B,Raw,M,56,Konstantin Shmelyov,Константин Шмелёв,2001-10-04,17,Pro Teen 16-17,53.6,,,,,,70,75,-77.5,,75,,,,,,75,1
No,B,Raw,M,60,Anatoliy Gorbunov #1,Анатолий Горбунов,1941-09-07,78,Pro Masters 75-79,56.6,,,,,,52.5,-55,57.5,,57.5,,,,,,57.5,1
No,B,Raw,M,60,Danil Kuts,Данил Куц,2001-07-17,18,Pro Teen 18-19,58.9,,,,,,65,67.5,70,,70,,,,,,70,1
No,B,Raw,M,67.5,Denis Nikonov #1,Денис Ніконов,1992-09-21,27,Pro Open,63.5,,,,,,100,105,-110,,105,,,,,,105,1
No,B,Raw,M,67.5,Valeriy Petrov,Валерий Петров,1945-07-11,74,Pro Masters 70-74,67.5,,,,,,80,85,87.5,,87.5,,,,,,87.5,1
No,B,Raw,M,67.5,Kirill Sinitskiy,Кирилл Синицкий,2006-05-12,13,Pro Teen 13,66.5,,,,,,30,-35,-37.5,,30,,,,,,30,1
No,B,Raw,M,75,Vladislav Artyukhov,Владислав Артюхов,2003-05-11,16,Pro Teen 16-17,71.8,,,,,,70,-80,-80,,70,,,,,,70,1
No,B,Raw,M,75,Andrey Konnov,Андрей Коннов,2007-10-18,11,Pro Teen 13,72.5,,,,,,45,55,-60,,55,,,,,,55,1
No,B,Raw,M,82.5,Artur Nennanov,Артур Неннанов,1989-05-05,30,Pro Open,81.5,,,,,,132.5,137.5,-140,,137.5,,,,,,137.5,4
No,B,Raw,M,82.5,Aleksandr Protko,Александр Протько,1972-07-18,47,Pro Masters 45-49,77.1,,,,,,95,100,-107.5,,100,,,,,,100,1
No,B,Raw,M,82.5,Aleksandr Konyukhov,Александр Конюхов,1977-12-24,41,Pro Open,81.1,,,,,,150,160,165,,165,,,,,,165,2
No,B,Raw,M,82.5,Roman Anikushin,Роман Аникушин,1986-08-27,33,Pro Open,82,,,,,,180,195,-205,,195,,,,,,195,1
No,B,Raw,M,82.5,Aleksandr Bezruk,Александр Безрук,1991-01-19,28,Pro Open,81.4,,,,,,140,145,150,,150,,,,,,150,3
No,B,Raw,M,90,Bogdan Babkin,Богдан Бабкин,1995-02-08,24,Pro Open,84.2,,,,,,170,180,190,,190,,,,,,190,1
No,B,Raw,M,90,Artyom Vinogradskiy,Артём Виноградский,1986-08-15,33,Pro Open,87.4,,,,,,167.5,175,-177.5,,175,,,,,,175,2
No,B,Raw,M,100,Sergey Polutin,Сергей Полутин,1975-08-17,44,Pro Masters 40-44,96.6,,,,,,210,215,220,,220,,,,,,220,1
No,B,Raw,M,100,Sergey Polutin,Сергей Полутин,1975-08-17,44,Pro Open,96.6,,,,,,210,215,220,,220,,,,,,220,1
No,B,Raw,M,100,Artyom Stasyuk,Артём Стасюк,1993-05-30,26,Pro Open,98.4,,,,,,-220,-220,,,,,,,,,,DQ
No,B,Raw,M,100,Sergey Bagach,Сергей Багач,1973-05-01,46,Pro Masters 45-49,97.6,,,,,,155,160,-165,,160,,,,,,160,1
No,B,Raw,M,100,Aleksandr Shvalyuk,Александр Швалюк,1993-05-05,26,Pro Open,100,,,,,,105,110,115,,115,,,,,,115,2
No,B,Raw,M,110,Artem Matveychuk,Артем Матвейчук,1996-02-26,23,Pro Juniors 20-23,106.6,,,,,,185,190,195,,195,,,,,,195,1
No,B,Raw,M,110,Ibragim Ilkhasan,Ібрагім Ільхасан,1989-06-21,30,Pro Open,107.7,,,,,,250,-270,,,250,,,,,,250,1
No,B,Raw,M,110,Dmitriy Anufriev,Дмитрий Ануфриев,1985-01-02,34,Pro Open,108,,,,,,190,200,-205,,200,,,,,,200,2
No,B,Raw,M,125,Vladimir Enzel,Владимир Энзель,1983-07-05,36,Pro Open,116.5,,,,,,120,130,140,,140,,,,,,140,1
No,B,Raw,M,125,Alexander Chekachkov,Александр Чекачков,1971-02-18,48,Pro Masters 45-49,112.4,,,,,,140,150,160,,160,,,,,,160,1
No,B,Raw,M,125,Andrey Sorokin,Андрей Сорокин,1973-02-13,46,Pro Masters 45-49,110.6,,,,,,120,125,127.5,,127.5,,,,,,127.5,2
No,B,Raw,M,140,Dzhamshid Ismatillaev,Джамшид Исматиллаев,1983-11-16,35,Pro Open,128.3,,,,,,185,192.5,,,192.5,,,,,,192.5,1
No,B,Raw,M,140,Ivan Listopad,Иван Листопад,1995-05-29,24,Pro Open,126.7,,,,,,170,180,185.5,,185.5,,,,,,185.5,2
No,B,Single-ply,M,110,Oleg Shulga,Олег Шульга,1969-03-13,50,Pro Masters 50-54,106.4,,,,,,190,200,-215,,200,,,,,,200,1
No,B,Multi-ply,M,82.5,Vladimir Blashchitsin,Владимир Блащицин,1985-11-13,33,Pro Open,76.1,,,,,,150,170,190,,190,,,,,,190,1
No,B,Multi-ply,M,90,Andrey Yakushin,Андрей Якушин,1973-12-19,45,Pro Masters 45-49,87.4,,,,,,300,320,-325,,320,,,,,,320,1
No,B,Multi-ply,M,90,Dmitriy Tkachenko,Дмитрий Ткаченко,1981-04-09,38,Pro Open,88.3,,,,,,235,247.5,252.5,,252.5,,,,,,252.5,1
No,B,Multi-ply,M,100,Artyom Stasyuk,Артём Стасюк,1993-05-30,26,Pro Open,98.4,,,,,,330,-360,-360,,330,,,,,,330,1
No,B,Multi-ply,M,100,Sergey Bagach,Сергей Багач,1973-05-01,46,Pro Masters 45-49,97.6,,,,,,190,200,210,,210,,,,,,210,1
No,B,Multi-ply,M,125,Alexander Chekachkov,Александр Чекачков,1971-02-18,48,Pro Masters 45-49,112.4,,,,,,230,250,270,,270,,,,,,270,1
Yes,D,Raw,F,48,Anastasiya Kirillova,Анастасия Кириллова,1981-01-25,38,Amateur Open,47.8,,,,,,,,,,,102.5,-107.5,-107.5,,102.5,102.5,1
Yes,D,Raw,F,52,Tatyana Ivanovskaya,Татьяна Ивановская,1990-03-30,29,Amateur Open,50,,,,,,,,,,,85,90,95,,95,95,2
Yes,D,Raw,F,52,Marina Stashevskaya,Марина Сташевская,1985-05-17,34,Amateur Open,49.8,,,,,,,,,,,110,-117.5,117.5,,117.5,117.5,1
Yes,D,Raw,F,56,Elvira Kataeva,Эльвира Катаева,1988-01-07,31,Amateur Open,55.2,,,,,,,,,,,150,160,165,170,165,165,1
Yes,D,Raw,F,56,Vladislava Stepantsova,Владислава Степанцова,2000-08-03,19,Amateur Teen 18-19,54.7,,,,,,,,,,,100,107.5,112.5,,112.5,112.5,1
Yes,D,Raw,F,56,Aleksandra Korzhel,Александра Коржель,1986-02-09,33,Amateur Open,55.6,,,,,,,,,,,65,75,85,,85,85,1
Yes,D,Raw,F,60,Tatyana Dubachinskaya,Татьяна Дубачинская,1975-04-15,44,Amateur Masters 40-44,58,,,,,,,,,,,107.5,112.5,117.5,,117.5,117.5,1
Yes,D,Raw,F,67.5,Natalya Andrusyak,Наталья Андрусяк,1996-03-31,23,Amateur Juniors 20-23,66,,,,,,,,,,,142.5,147.5,,,147.5,147.5,1
Yes,D,Raw,F,75,Lyubov Borets,Любовь Борец,1973-09-07,46,Amateur Masters 45-49,71.9,,,,,,,,,,,125,135,140,,140,140,1
Yes,D,Raw,M,60,Yuriy Talakh,Юрий Талах,1987-06-05,32,Amateur Open,58.6,,,,,,,,,,,130,135,142.5,,142.5,142.5,1
Yes,D,Raw,M,67.5,Daniil Chzhan,Даниил Чжан,2003-12-08,15,Amateur Teen 14-15,61,,,,,,,,,,,140,150,157.5,,157.5,157.5,1
Yes,D,Raw,M,67.5,Vadim Suprunyuk,Вадим Супрунюк,1996-04-03,23,Amateur Open,63.6,,,,,,,,,,,210,-220,-220,,210,210,1
Yes,D,Raw,M,75,Asan Sattarov,Асан Саттаров,1986-12-07,32,Amateur Open,73.6,,,,,,,,,,,205,210,215,,215,215,1
Yes,D,Raw,M,75,Dmitriy Zhidkov,Дмитрий Жидков,1967-04-07,52,Amateur Masters 50-54,74.5,,,,,,,,,,,160,170,-180,,170,170,1
Yes,D,Raw,M,75,Evgeniy Suvorov,Евгений Суворов,1954-06-02,65,Amateur Masters 65-69,72.2,,,,,,,,,,,170,-182.5,-182.5,,170,170,1
Yes,D,Raw,M,75,David Tkchenko,Давид Ткченко,2001-07-06,18,Amateur Teen 18-19,74,,,,,,,,,,,170,190,-205,,190,190,1
Yes,D,Raw,M,82.5,Sergey Onufriev,Сергей Онуфриев,1994-08-12,25,Amateur Open,79.8,,,,,,,,,,,225,237.5,247.5,250,247.5,247.5,1
Yes,D,Raw,M,90,Vladimir Marevskiy,Владимир Марьевский,1988-04-20,31,Amateur Open,87.4,,,,,,,,,,,200,-225,-225,,200,200,3
Yes,D,Raw,M,90,Vasiliy Leonenko,Василий Леоненко,1967-04-06,52,Amateur Masters 50-54,88.8,,,,,,,,,,,220,230,240,,240,240,1
Yes,D,Raw,M,90,Vasiliy Leonenko,Василий Леоненко,1967-04-06,52,Amateur Open,88.8,,,,,,,,,,,220,230,240,,240,240,1
Yes,D,Raw,M,90,Mikhail Dikhtemirov,Михаил Дихтемиров,1985-11-15,33,Amateur Open,89,,,,,,,,,,,205,225,,,225,225,2
Yes,D,Raw,M,90,Gleb Banasinskiy,Глеб Банасинский,2002-08-24,17,Amateur Teen 16-17,84.6,,,,,,,,,,,185,-190,-190,,185,185,1
Yes,D,Raw,M,100,Viktor Meshkov,Виктор Мешков,1980-11-27,38,Amateur Open,95.7,,,,,,,,,,,205,235,-245,,235,235,1
Yes,D,Raw,M,100,Sergey Pirogov,Сергей Пирогов,1972-12-15,46,Amateur Masters 45-49,97,,,,,,,,,,,215,225,230,,230,230,1
Yes,D,Raw,M,100,Viktor Strelkov,Виктор Стрелков,1976-10-04,42,Amateur Masters 40-44,98.7,,,,,,,,,,,225,237.5,-247.5,,237.5,237.5,1
Yes,D,Raw,M,100,Mark Bondarev,Марк Бондарев,2001-09-27,18,Amateur Teen 18-19,96.5,,,,,,,,,,,150,160,,,160,160,1
Yes,D,Raw,M,100,Andrey Tovkach,Андрей Товкач,1980-01-29,39,Amateur Open,91.4,,,,,,,,,,,175,205,-220,,205,205,2
Yes,D,Raw,M,110,Rostislav Khalyavka,Ростислав Халявка,1984-10-31,34,Amateur Open,102.2,,,,,,,,,,,170,180,190,,190,190,1
Yes,D,Raw,M,140+,Anton Barskov,Антон Барсков,1984-05-17,35,Amateur Open,159,,,,,,,,,,,260,280,-300,,280,280,1
No,D,Raw,F,48,Galina Sidorova,Галина Сидорова,1976-04-17,43,Pro Masters 40-44,44.6,,,,,,,,,,,50,55,60,,60,60,1
No,D,Raw,F,60,Alla Kabanova,Алла Кабанова,1982-08-09,37,Pro Open,58.8,,,,,,,,,,,65,70,75,,75,75,1
No,D,Raw,F,67.5,Anna Belmesova,Анна Бельмесова,1988-02-26,31,Pro Open,64.1,,,,,,,,,,,65,70,75,,75,75,1
No,D,Raw,F,67.5,Lyudmila Goryacheva,Людмила Горячева,1969-09-04,50,Pro Masters 50-54,66.2,,,,,,,,,,,55,60,-65,,60,60,1
No,D,Raw,F,82.5,Eva Marudenko,Ева Маруденко,1995-04-14,24,Pro Open,81.2,,,,,,,,,,,90,100,110,,110,110,1
No,D,Raw,M,44,Ivan Styuflyaev,Иван Стюфляев,2006-09-21,13,Pro Teen 13,37.4,,,,,,,,,,,50,60,-65,,60,60,2
No,D,Raw,M,48,Ivan Lemeshko,Иван Лемешко,2006-10-16,12,Pro Teen 13,46.5,,,,,,,,,,,60,70,80,,80,80,1
No,D,Raw,M,56,Ivan Vusinskiy,Иван Вусинский,2007-04-12,12,Pro Teen 13,54.5,,,,,,,,,,,65,75,80,,80,80,1
No,D,Raw,M,67.5,Vadim Suprunyuk,Вадим Супрунюк,1996-04-03,23,Pro Open,63.6,,,,,,,,,,,210,-220,-220,,210,210,1
No,D,Raw,M,82.5,Aleksandr Bezruk,Александр Безрук,1991-01-19,28,Pro Open,81.4,,,,,,,,,,,170,180,,,180,180,1
No,D,Raw,M,90,Sergey Poltavets,Сергей Полтавец,1993-10-15,25,Pro Open,88.3,,,,,,,,,,,270,285,-292.5,,285,285,1
No,D,Raw,M,100,Aleksandr Shvalyuk,Александр Швалюк,1993-05-03,26,Pro Open,100,,,,,,,,,,,170,182.5,-185,,182.5,182.5,2
No,D,Raw,M,100,Aleksandr Burakov,Александр Бураков,1993-06-15,26,Pro Open,98.1,,,,,,,,,,,240,252.5,260,,260,260,2
No,D,Raw,M,100,Denis Nazarenko,Денис Назаренко,1984-05-23,35,Pro Open,91,,,,,,,,,,,200,220,-230,,220,220,4
No,D,Raw,M,100,Eduard Annenkov,Эдуард Анненков,1988-05-03,31,Pro Open,95.3,,,,,,,,,,,300,-310,-310,,300,300,1
No,D,Raw,M,100,Viktor Strelkov,Виктор Стрелков,1976-10-04,42,Pro Masters 40-44,98.7,,,,,,,,,,,225,237.5,-247.5,,237.5,237.5,1
No,D,Raw,M,100,Denis Bogatyrev,Денис Богатырев,1987-03-23,32,Pro Open,98.7,,,,,,,,,,,230,245,252.5,,252.5,252.5,3
No,D,Raw,M,110,Valeriy Karpov #2,Валерий Карпов,1981-12-25,37,Pro Open,107.3,,,,,,,,,,,205,215,220,,220,220,1
No,D,Raw,M,110,Nikolay Komarov,Николай Комаров,1985-04-27,34,Pro Open,101.7,,,,,,,,,,,190,200,210,,210,210,2
No,D,Raw,M,110,Oleg Sokolov,Олег Соколов,1972-08-14,47,Pro Masters 45-49,103.7,,,,,,,,,,,210,-220,-220,,210,210,1
No,D,Raw,M,125,Andrey Popkovich,Андрей Попкович,1978-10-12,40,Pro Masters 40-44,115.9,,,,,,,,,,,300,310,-320,,310,310,1
No,D,Raw,M,125,Andrey Popkovich,Андрей Попкович,1978-10-12,40,Pro Open,115.9,,,,,,,,,,,300,310,-320,,310,310,1
Yes,SBD,Wraps,F,52,Marina Stashevskaya,Марина Сташевская,1985-05-17,34,Amateur Open,49.8,90,100,102.5,,102.5,45,47.5,50,,50,110,117.5,,,117.5,270,1
Yes,SBD,Wraps,F,56,Elvira Kataeva,Эльвира Катаева,1988-01-07,31,Amateur Open,55.2,130,135,137.5,,137.5,60,62.5,65,,65,150,160,165,170,165,367.5,1
Yes,SBD,Wraps,F,60,Marina Babkina,Марина Бабкина,1991-06-23,28,Amateur Open,57,65,75,77.5,,77.5,35,-37.5,37.5,,37.5,70,-75,75,,75,190,2
Yes,SBD,Wraps,F,60,Diana Kelareva,Диана Келарева,1991-09-24,28,Amateur Open,59.1,90,-95,95,,95,45,-47.5,-47.5,,45,90,100,105,,105,245,1
Yes,SBD,Wraps,F,67.5,Elena Ostapenko,Елена Остапенко,1993-04-21,26,Amateur Open,61.5,70,75,-77.5,,75,40,45,-50,,45,80,-85,90,,90,210,1
Yes,SBD,Wraps,F,75,Elena Murzakhanova,Елена Мурзаханова,1987-05-31,32,Amateur Open,71.2,90,-95,-95,,90,45,-50,-50,,45,90,-100,100,,100,235,1
Yes,SBD,Wraps,F,75,Lyubov Borets,Любовь Борец,1973-09-07,46,Amateur Masters 45-49,71.9,95,105,110,,110,57.5,65,-67.5,,65,125,135,140,,140,315,1
Yes,SBD,Wraps,M,67.5,Nikita Nemolovskiy,Никита Немоловский,1995-10-21,23,Amateur Open,66.3,150,-155,-155,,150,-115,115,-122.5,,115,195,-205,,,195,460,1
Yes,SBD,Wraps,M,82.5,Aleksandr Konyukhov,Александр Конюхов,1977-12-24,41,Amateur Masters 40-44,81.1,160,170,175,,175,150,160,165,,165,210,217.5,220,,220,560,1
Yes,SBD,Wraps,M,82.5,Mustafa Seytnebiev,Мустафа Сейтнебиев,1996-07-15,23,Amateur Open,79.1,200,-210,-210,,200,165,-170,,,165,210,-220,,,210,575,1
Yes,SBD,Wraps,M,90,Daniil Voronin,Даниил Воронин,2002-03-07,17,Amateur Teen 16-17,84.6,160,170,175,,175,-105,110,117.5,,117.5,175,180,185,,185,477.5,1
Yes,SBD,Wraps,M,90,Gleb Banasinskiy,Глеб Банасинский,2002-08-24,17,Amateur Teen 16-17,84.6,160,165,-172.5,,165,95,100,-105,,100,185,-190,-190,,185,450,2
Yes,SBD,Wraps,M,90,Nikolay Mikhaylutin,Николай Михайлутин,1988-03-08,31,Amateur Open,87.3,185,190,195,,195,125,-130,-130,,125,240,250,260,,260,580,1
Yes,SBD,Wraps,M,100,Sergey Sokolov,Сергей Соколов,1973-04-28,46,Amateur Masters 45-49,96.3,155,165,180,,180,140,150,160,,160,170,190,210,,210,550,1
Yes,SBD,Wraps,M,100,Sergey Sokolov,Сергей Соколов,1973-04-28,46,Amateur Open,96.3,155,165,180,,180,140,150,160,,160,-170,-190,,,,,DQ
Yes,SBD,Wraps,M,100,Yuriy Gorshkov,Юрий Горшков,1985-05-02,34,Amateur Open,100,160,-170,-170,,160,140,142.5,-150,,142.5,220,230,240,,240,542.5,1
Yes,SBD,Multi-ply,M,90,Vasiliy Leonenko,Василий Леоненко,1967-04-06,52,Amateur Masters 50-54,88.8,190,200,-210,,200,220,230,240,,240,220,230,240,,240,680,1
Yes,SBD,Multi-ply,M,90,Vasiliy Leonenko,Василий Леоненко,1967-04-06,52,Amateur Open,88.8,190,200,-210,,200,220,230,240,,240,220,230,240,,240,680,1
Yes,SBD,Multi-ply,M,100,Sergey Pirogov,Сергей Пирогов,1972-12-15,46,Amateur Masters 45-49,97,200,210,215,,215,175,-185,-185,,175,215,225,230,,230,620,1
Yes,SBD,Multi-ply,M,125,Mikhail Yakovlev,Михаил Яковлев,1988-02-28,31,Amateur Open,118.7,-180,200,-205,,200,250,-270,-270,,250,215,-220,,,215,665,1
Yes,SBD,Multi-ply,M,140+,Anton Barskov,Антон Барсков,1984-05-17,35,Amateur Open,159,280,300,-320,,300,350,370,380,,380,260,280,-300,,280,960,1
No,SBD,Multi-ply,M,90,Sergey Abalyaev,Сергей Абаляев,1990-06-15,29,Pro Open,88.9,200,215,220,,220,140,145,150,,150,220,225,-230,,225,595,1
No,SBD,Wraps,M,82.5,Sergey Banasinskiy,Сергей Банасинский,1947-02-16,72,Pro Masters 70-74,78,100,105,-115,,105,55,60,,,60,120,130,135,,135,300,1
No,SBD,Wraps,M,90,Sergey Abalyaev,Сергей Абаляев,1990-06-15,29,Pro Open,88.9,-200,,,,,,,,,,-220,,,,,,DQ
No,SBD,Wraps,M,90,Sergey Poltavets,Сергей Полтавец,1993-10-15,25,Pro Open,88.3,205,215,,,215,170,172.5,,,172.5,270,280,-292.5,,280,667.5,1
No,SBD,Wraps,M,100,Eduard Annenkov,Эдуард Анненков,1988-05-03,31,Pro Open,95.3,220,240,260,,260,165,170,-175,,170,300,-310,-310,,300,730,1
No,SBD,Wraps,M,110,Yuriy Gorshkov,Юрий Горшков,1985-05-02,34,Pro Open,,,,,,,,,,,,,,,,,,NS
No,SBD,Wraps,M,110,Mikhail Likhach,Михаил Лихач,1989-04-20,30,Pro Open,108.5,210,220,235,,235,220,240,-250,,240,250,260,270,,270,745,1
No,SBD,Multi-ply,M,100,Denis Bogatyryov,Денис Богатырёв,1987-03-23,32,Pro Open,98.7,240,260,-275,,260,260,280,-310,,280,230,245,252.5,,252.5,792.5,1
