; ModuleID = 'hello.ll'
source_filename = "hello.i"
target datalayout = "e-m:o-i64:64-f80:128-n8:16:32:64-S128"
target triple = "x86_64-apple-macosx10.13.0"

@str = private unnamed_addr constant [12 x i8] c"hello world\00"

; Function Attrs: nounwind ssp uwtable
define void @_Z5hellov() local_unnamed_addr #0 {
entry:
  %puts = tail call i32 @puts(i8* getelementptr inbounds ([12 x i8], [12 x i8]* @str, i64 0, i64 0))
  ret void
}

; Function Attrs: nounwind
declare i32 @puts(i8* nocapture readonly) local_unnamed_addr #1

attributes #0 = { nounwind ssp uwtable "correctly-rounded-divide-sqrt-fp-math"="false" "disable-tail-calls"="false" "less-precise-fpmad"="false" "no-frame-pointer-elim"="true" "no-frame-pointer-elim-non-leaf" "no-infs-fp-math"="false" "no-jump-tables"="false" "no-nans-fp-math"="false" "no-signed-zeros-fp-math"="false" "no-trapping-math"="false" "stack-protector-buffer-size"="8" "target-cpu"="core2" "target-features"="+cx16,+fxsr,+mmx,+sse,+sse2,+sse3,+ssse3,+x87" "unsafe-fp-math"="false" "use-soft-float"="false" }
attributes #1 = { nounwind }

!llvm.module.flags = !{!0}
!llvm.ident = !{!1}

!0 = !{i32 7, !"PIC Level", i32 2}
!1 = !{!"clang version 4.0.0 (git@github.com:asutton/clang-reflect.git 8317e40b61d41300797ead958d7b7c9a13bed863) (git@github.com:llvm-mirror/llvm.git 650050c7c2061ec08da359b57e12ae7a4b8c8911)"}
