Place,WeightClassKg,Sex,Name,Team,BodyweightKg,Squat1Kg,Squat2Kg,Squat3Kg,Best3SquatKg,Bench1Kg,Bench2Kg,Bench3Kg,Best3BenchKg,Deadlift1Kg,Deadlift2Kg,Deadlift3Kg,Best3DeadliftKg,TotalKg,Division,Equipment,Event,BirthDate
1,52,F,Zuzanna Marczak,AWFiS Gdańsk,48.82,105,112.5,117.5,117.5,55,60,-65,60,120,130,135,135,312.5,Seniorki,Raw,SBD,
2,52,F,Anna Pilguj,AMW Gdynia,51.18,-97.5,97.5,-102.5,97.5,52.5,-55,-55,52.5,140,147.5,-160,147.5,297.5,Seniorki,Raw,SBD,
3,52,F,Magdalena Mołoń,AWF Poznań,51.43,95,100,-102.5,100,47.5,50,-52.5,50,120,130,132.5,132.5,282.5,Seniorki,Raw,SBD,
4,52,F,Agnieszka Broncel,AWF Katowice,49.70,100,-105,-105,100,55,57.5,-60,57.5,115,120,-125,120,277.5,Seniorki,Raw,SBD,
5,52,F,Aleksandra Banasiak,AWF Warszawa,50.54,95,100,-105,100,55,57.5,-60,57.5,110,115,-117.5,115,272.5,Seniorki,Raw,SBD,
6,52,F,Wiktoria Boba,US Szczecin,51.27,-90,-90,90,90,55,57.5,60,60,115,120,-122.5,120,270,Seniorki,Raw,SBD,
7,52,F,Natalia Strzymczok,UŚ Katowice,51.04,82.5,90,-100,90,35,40,-45,40,85,95,102.5,102.5,232.5,Seniorki,Raw,SBD,
8,52,F,Aleksandra Dajka,PŚ Gliwice,47.14,-75,75,80,80,35,40,-42.5,40,85,90,95,95,215,Seniorki,Raw,SBD,
9,52,F,Zuzanna Jodłowska,UPr Lublin,51.13,-75,75,82.5,82.5,35,37.5,40,40,85,-90,90,90,212.5,Seniorki,Raw,SBD,
10,52,F,Kamila Błajda,UMK Toruń,49.26,-47.5,47.5,-55,47.5,25,27.5,-30,27.5,60,-65,-65,60,135,Seniorki,Raw,SBD,
DQ,52,F,Ewelina Zielińska,PK Kraków,50.45,-75,-75,-80,,30,35,-40,35,80,85,-90,85,,Seniorki,Raw,SBD,
1,57,F,Aleksandra Blajer,UR Rzeszów,56.70,135,-140,-142.5,135,75,80,-82.5,80,145,155,162.5,162.5,377.5,Seniorki,Raw,SBD,
2,57,F,Michaela Kiełbasa,PG Gdańsk,56.10,130,135,-140,135,60,62.5,-65,62.5,160,-165,-165,160,357.5,Seniorki,Raw,SBD,
3,57,F,Gabriela Marchwica,UJ Kraków,54.66,-115,115,120,120,60,-65,-65,60,137.5,145,152.5,152.5,332.5,Seniorki,Raw,SBD,
4,57,F,Wiktoria Fajer,UJD Częstochowa,55.97,120,-125,125,125,50,-55,-55,50,120,130,140,140,315,Seniorki,Raw,SBD,
5,57,F,Martyna Dędza,PG Gdańsk,54.84,90,95,100,100,57.5,60,-65,60,130,-140,140,140,300,Seniorki,Raw,SBD,
6,57,F,Angelika Cesarz,UJ CM Kraków,55.03,90,97.5,102.5,102.5,45,47.5,50,50,130,140,-150,140,292.5,Seniorki,Raw,SBD,
7,57,F,Klaudia Wawrzycka,UPr Lublin,56.60,90,100,-105,100,52.5,55,57.5,57.5,125,135,-140,135,292.5,Seniorki,Raw,SBD,
8,57,F,Aleksandra Zieleźny,PWr Wrocław,55.42,100,-110,,100,50,55,60,60,120,130,-140,130,290,Seniorki,Raw,SBD,
9,57,F,Andżelika Cyngot,SGGW Warszawa,55.91,100,105,-110,105,55,57.5,-60,57.5,127.5,-132.5,-132.5,127.5,290,Seniorki,Raw,SBD,
10,57,F,Małgorzata Kukiełka,PŚ Gliwice,56.85,80,87.5,92.5,92.5,47.5,50,52.5,52.5,117.5,125,130,130,275,Seniorki,Raw,SBD,
11,57,F,Laura Gwiżdż,ŚUM Katowice,56.90,85,-90,90,90,52.5,-57.5,-57.5,52.5,120,125,-132.5,125,267.5,Seniorki,Raw,SBD,
12,57,F,Weronika Góra,UM Łódź,54.43,82.5,87.5,-90,87.5,50,52.5,55,55,115,120,122.5,122.5,265,Seniorki,Raw,SBD,
13,57,F,Milena Materny,AGH Kraków,57.00,90,-95,95,95,52.5,57.5,-60,57.5,95,105,-112.5,105,257.5,Seniorki,Raw,SBD,
14,57,F,Weronika Kopyciok,PO Opole,55.58,80,85,90,90,57.5,62.5,-65,62.5,97.5,102.5,-107.5,102.5,255,Seniorki,Raw,SBD,
15,57,F,Maria Konarzewska,PG Gdańsk,56.80,-85,85,,85,65,70,72.5,72.5,85,-90,90,90,247.5,Seniorki,Raw,SBD,
16,57,F,Agnieszka Pankowska,UWM Olsztyn,55.87,75,85,-92.5,85,35,40,-42.5,40,100,112.5,120,120,245,Seniorki,Raw,SBD,
17,57,F,Julia Podpora,UW Warszawa,55.87,70,75,80,80,40,-45,-50,40,110,117.5,125,125,245,Seniorki,Raw,SBD,
18,57,F,Zuzanna Bartuzi,KUL Lublin,53.56,80,85,90,90,42.5,45,47.5,47.5,90,-97.5,-97.5,90,227.5,Seniorki,Raw,SBD,
19,57,F,Weronika Trenka,UŚ Katowice,55.60,60,70,-80,70,32.5,35,-40,35,80,95,105,105,210,Seniorki,Raw,SBD,
20,57,F,Martyna Jasina,UR Rzeszów,55.55,65,70,72.5,72.5,37.5,40,-45,40,-90,90,-97.5,90,202.5,Seniorki,Raw,SBD,
21,57,F,Martyna Bujarska,SGGW Warszawa,56.82,-75,-75,75,75,40,42.5,,42.5,80,85,-90,85,202.5,Seniorki,Raw,SBD,
22,57,F,Sylwia Puzio,UMK Toruń,55.03,-55,-55,55,55,40,45,-47.5,45,87.5,-92.5,-92.5,87.5,187.5,Seniorki,Raw,SBD,
23,57,F,Olga Domaradzka,ZUT Szczecin,55.60,-55,65,-70,65,30,32.5,35,35,-65,70,80,80,180,Seniorki,Raw,SBD,
DQ,57,F,Zuzanna Kowalska,Uniwersytet Radom,56.18,-105,-105,-105,,,,,,,,,,,Seniorki,Raw,SBD,
1,63,F,Wiktoria Zapotoczna,AGH Kraków,61.20,140,150,-155,150,82.5,87.5,-90,87.5,170,177.5,182.5,182.5,420,Seniorki,Raw,SBD,
2,63,F,Patrycja Panasiuk,UJ Kraków,62.00,140,142.5,-147.5,142.5,-77.5,77.5,80,80,183,193,-198,193,415.5,Seniorki,Raw,SBD,
3,63,F,Gabriela Blajer,UR Rzeszów,62.30,140,145,150,150,70,75,80,80,150,160,-170,160,390,Seniorki,Raw,SBD,
4,63,F,Nikola Górecka,AWFiS Gdańsk,62.40,135,145,-152.5,145,75,80,-85,80,135,145,-150,145,370,Seniorki,Raw,SBD,
5,63,F,Wiktoria Pieniążek,UKEN Kraków,63.00,142.5,147.5,-152.5,147.5,65,67.5,-70,67.5,147.5,155,-160,155,370,Seniorki,Raw,SBD,
6,63,F,Patrycja Tomczyk,UO Opole,60.70,112.5,117.5,125,125,72.5,75,-77.5,75,142.5,150,157.5,157.5,357.5,Seniorki,Raw,SBD,
7,63,F,Katarzyna Tessmer,PG Gdańsk,62.40,142.5,-147.5,147.5,147.5,65,67.5,-70,67.5,140,-147.5,-147.5,140,355,Seniorki,Raw,SBD,
8,63,F,Julia Rzepka,CMUMK Bydgoszcz,62.30,115,120,125,125,57.5,60,-62.5,60,150,160,-170,160,345,Seniorki,Raw,SBD,
9,63,F,Klaudia Wąsacz,PRz Rzeszów,61.60,120,125,-130,125,60,65,-70,65,137.5,142.5,147.5,147.5,337.5,Seniorki,Raw,SBD,
10,63,F,Katarzyna Szczygielska,PP Poznań,62.10,115,120,122.5,122.5,60,-62.5,-62.5,60,140,-147.5,152.5,152.5,335,Seniorki,Raw,SBD,
11,63,F,Alicja Pająk,AWF w Krakowie,62.10,105,110,-115,110,52.5,55,-57.5,55,150,155,160,160,325,Seniorki,Raw,SBD,
12,63,F,Aleksandra Kukotko,UPP Poznań,60.50,105,112.5,117.5,117.5,45,52.5,-55,52.5,125,137.5,147.5,147.5,317.5,Seniorki,Raw,SBD,
13,63,F,Anna Nalborczyk,PK Kraków,61.30,-105,105,-112.5,105,55,60,65,65,130,135,140,140,310,Seniorki,Raw,SBD,
14,63,F,Zuzanna Połka,AWF Poznań,57.90,115,120,125,125,45,50,-55,50,110,120,130,130,305,Seniorki,Raw,SBD,
15,63,F,Julia Szczypińska,UMP Poznań,62.40,100,107.5,112.5,112.5,50,-55,-55,50,115,125,137.5,137.5,300,Seniorki,Raw,SBD,
16,63,F,Maria Połka,AWF Poznań,60.40,-125,130,-140,130,-40,47.5,-52.5,47.5,-110,110,120,120,297.5,Seniorki,Raw,SBD,
17,63,F,Klaudia Mikulska,CH SGM Warszawa,57.59,-90,90,100,100,55,57.5,-60,57.5,130,-140,-140,130,287.5,Seniorki,Raw,SBD,
18,63,F,Kinga Surma,AGH Kraków,58.60,92.5,97.5,102.5,102.5,52.5,57.5,-60,57.5,110,117.5,127.5,127.5,287.5,Seniorki,Raw,SBD,
19,63,F,Monika Szymanek,UJD Częstochowa,59.51,-100,110,120,120,52.5,57.5,,57.5,110,,,110,287.5,Seniorki,Raw,SBD,
20,63,F,Julianna Mrozińska,URK Kraków,61.15,92.5,-95,100,100,-50,55,57.5,57.5,110,120,127.5,127.5,285,Seniorki,Raw,SBD,
21,63,F,Barbara Brzezina,UJ Kraków,60.80,95,97.5,-100,97.5,-60,62.5,65,65,110,115,117.5,117.5,280,Seniorki,Raw,SBD,
22,63,F,Dominika Nowak,PP Poznań,61.40,-92.5,92.5,100,100,52.5,55,57.5,57.5,105,112.5,117.5,117.5,275,Seniorki,Raw,SBD,
23,63,F,Anna Dutkiewicz,SGGW Warszawa,59.30,85,95,105,105,45,52.5,-60,52.5,95,105,112.5,112.5,270,Seniorki,Raw,SBD,
24,63,F,Oliwia Gaweł,UEP Poznań,61.40,-90,90,100,100,50,-55,-57.5,50,105,110,120,120,270,Seniorki,Raw,SBD,
25,63,F,Marta Pazunczyn,PP Poznań,61.83,90,92.5,95,95,50,-52.5,52.5,52.5,100,110,115,115,262.5,Seniorki,Raw,SBD,
26,63,F,Zuzanna Hajnrych,PBŚ Bydgoszcz,62.72,87.5,90,-95,90,-52.5,-52.5,52.5,52.5,-115,115,117.5,117.5,260,Seniorki,Raw,SBD,
27,63,F,Agnieszka Gula,UM Łódź,59.05,90,95,97.5,97.5,40,42.5,-45,42.5,100,110,115,115,255,Seniorki,Raw,SBD,
28,63,F,Lena Kozieł,ASP Wrocław,61.96,77.5,85,90,90,42.5,45,47.5,47.5,105,112.5,117.5,117.5,255,Seniorki,Raw,SBD,
29,63,F,Emilia Pędzierska,UMCS Lublin,59.30,82.5,-90,92.5,92.5,42.5,45,47.5,47.5,100,-107.5,107.5,107.5,247.5,Seniorki,Raw,SBD,
30,63,F,Wiktoria Owsiak,UMG Gdynia,61.78,60,65,72.5,72.5,32.5,35,37.5,37.5,100,107.5,112.5,112.5,222.5,Seniorki,Raw,SBD,
31,63,F,Aleksandra Szczęsna,WSB Merito Poznań,61.40,65,70,75,75,35,40,-42.5,40,90,97.5,102.5,102.5,217.5,Seniorki,Raw,SBD,
32,63,F,Karolina Koprowska,PO Opole,62.23,70,75,-77.5,75,42.5,-45,-45,42.5,90,95,97.5,97.5,215,Seniorki,Raw,SBD,
33,63,F,Urszula Przyborowska,OSW Olsztyn,62.51,60,67.5,-70,67.5,45,-50,50,50,-90,90,97.5,97.5,215,Seniorki,Raw,SBD,
34,63,F,Karolina Hurek,UO Opole,58.23,55,65,72.5,72.5,40,-45,45,45,85,95,-100,95,212.5,Seniorki,Raw,SBD,
35,63,F,Sylwia Iwaniuk,UMK Toruń,62.47,-75,75,-80,75,42.5,-47.5,-47.5,42.5,75,80,90,90,207.5,Seniorki,Raw,SBD,
36,63,F,Aleksandra Rosołowska,ZUT Szczecin,63.00,65,67.5,-70,67.5,35,37.5,-40,37.5,90,100,-110,100,205,Seniorki,Raw,SBD,
37,63,F,Wiktoria Hawel,ŚUM Katowice,59.71,-50,50,-60,50,62.5,-65,-65,62.5,85,90,-100,90,202.5,Seniorki,Raw,SBD,
38,63,F,Karolina Tokarska,UMK Toruń,62.72,62.5,-65,65,65,35,37.5,-40,37.5,75,82.5,87.5,87.5,190,Seniorki,Raw,SBD,
39,63,F,Alicja Kosakowska,UŚ Katowice,62.73,35,45,50,50,30,35,-37.5,35,80,90,-100,90,175,Seniorki,Raw,SBD,
40,63,F,Oliwia Kurpios,UJD Częstochowa,57.33,-55,55,62.5,62.5,27.5,30,32.5,32.5,-65,70,77.5,77.5,172.5,Seniorki,Raw,SBD,
41,63,F,Wiktoria Sekta,UŚ Katowice,59.64,35,45,-47.5,45,25,27.5,30,30,65,75,85,85,160,Seniorki,Raw,SBD,
DQ,63,F,Kinga Częstochowska,AWF Poznań,58.70,-115,-120,-120,,50,-55,55,55,120,127.5,135,135,,Seniorki,Raw,SBD,
1,69,F,Marika Zandecka,UAM Poznań,68.30,176,182,188,188,95,100,102.5,102.5,175,183,187,187,477.5,Seniorki,Raw,SBD,
2,69,F,Kaja Stabulewska,UWM Olsztyn,68.00,150,160,-167.5,160,110,-118,118,118,172.5,180,,180,458,Seniorki,Raw,SBD,
3,69,F,Aleksandra Łukasik,UJ CM Kraków,65.10,150,160,-170,160,67.5,70,-72.5,70,170,180,-187,180,410,Seniorki,Raw,SBD,
4,69,F,Eliza Fiedorczuk,UG Gdańsk,66.90,125,132.5,-137.5,132.5,67.5,72.5,75,75,155,162.5,170,170,377.5,Seniorki,Raw,SBD,
5,69,F,Julia Gejdel,UE Wrocław,67.80,120,125,130,130,65,67.5,-70,67.5,165,172.5,-177.5,172.5,370,Seniorki,Raw,SBD,
6,69,F,Anastasiia Reutova,AWP Lublin,65.60,117.5,122.5,-130,122.5,72.5,75,-77.5,75,152.5,157.5,162.5,162.5,360,Seniorki,Raw,SBD,
7,69,F,Agnieszka Rojek,UG Gdańsk,67.60,115,125,-135,125,75,80,85,85,135,-147.5,147.5,147.5,357.5,Seniorki,Raw,SBD,
8,69,F,Małgorzata Kupras,UM Lublin,67.10,117.5,122.5,-127.5,122.5,57.5,60,-62.5,60,160,170,-175,170,352.5,Seniorki,Raw,SBD,
9,69,F,Julia Garstka,UD DSW Wrocław,67.70,112.5,120,125,125,62.5,65,67.5,67.5,150,157.5,-162.5,157.5,350,Seniorki,Raw,SBD,
10,69,F,Wiktoria Białacka,UJ Kraków,68.00,115,122.5,130,130,65,70,,70,135,145,-155,145,345,Seniorki,Raw,SBD,
11,69,F,Justyna Tokarz,UG Gdańsk,68.30,-120,125,130,130,65,-70,-70,65,-135,140,-145,140,335,Seniorki,Raw,SBD,
12,69,F,Kinga Łątkowska,PG Gdańsk,68.80,110,117.5,-122.5,117.5,62.5,67.5,-70,67.5,137.5,-145,145,145,330,Seniorki,Raw,SBD,
13,69,F,Dominika Groń,AWF w Krakowie,65.90,100,107.5,112.5,112.5,57.5,60,-62.5,60,140,147.5,152.5,152.5,325,Seniorki,Raw,SBD,
14,69,F,Magdalena Zdunowska,WAT Warszawa,66.50,110,115,-117.5,115,65,-70,-70,65,142.5,,,142.5,322.5,Seniorki,Raw,SBD,
15,69,F,Oliwia Łuczka,UŚ Katowice,67.80,107.5,115,-120,115,55,62.5,-67.5,62.5,130,140,145,145,322.5,Seniorki,Raw,SBD,
16,69,F,Julia Miszczuk,ZUT Szczecin,68.70,120,125,130,130,-50,52.5,57.5,57.5,120,127.5,135,135,322.5,Seniorki,Raw,SBD,
17,69,F,Weronika Tabaczyńska,UPr Lublin,68.00,-110,-112.5,112.5,112.5,57.5,62.5,-67.5,62.5,130,140,-150,140,315,Seniorki,Raw,SBD,
18,69,F,Daria Sitarczuk,WAT Warszawa,67.80,115,122.5,127.5,127.5,-47.5,50,-55,50,120,130,135,135,312.5,Seniorki,Raw,SBD,
19,69,F,Jagoda Stelmach,ŚUM Katowice,67.60,115,-120,122.5,122.5,55,-57.5,-57.5,55,130,-135,-135,130,307.5,Seniorki,Raw,SBD,
20,69,F,Paulina Kaczor,GUMed Gdańsk,68.20,95,102.5,110,110,57.5,60,-65,60,135,-145,-145,135,305,Seniorki,Raw,SBD,
21,69,F,Daria Michałowska,PBŚ Bydgoszcz,65.40,85,-95,-97.5,85,65,67.5,72.5,72.5,130,140,145,145,302.5,Seniorki,Raw,SBD,
22,69,F,Alicja Komorowska,UMG Gdynia,64.50,100,107.5,115,115,55,60,62.5,62.5,110,120,-130,120,297.5,Seniorki,Raw,SBD,
23,69,F,Julia Smreczyńska,AWF w Krakowie,66.10,-95,105,115,115,55,57.5,60,60,110,120,-130,120,295,Seniorki,Raw,SBD,
24,69,F,Julia Bryniowska,PO Opole,67.00,105,112.5,-117.5,112.5,45,50,-52.5,50,120,-130,130,130,292.5,Seniorki,Raw,SBD,
25,69,F,Aleksandra Jakubowska,UJK Kielce,67.00,105,112.5,-115,112.5,62.5,67.5,-70,67.5,107.5,112.5,-115,112.5,292.5,Seniorki,Raw,SBD,
26,69,F,Gabriela Szejner,PBŚ Bydgoszcz,67.00,105,-107.5,-107.5,105,50,52.5,-55,52.5,117.5,122.5,125,125,282.5,Seniorki,Raw,SBD,
27,69,F,Marianna Pilawska,UMG Gdynia,65.40,95,102.5,110,110,47.5,50,-55,50,105,115,120,120,280,Seniorki,Raw,SBD,
28,69,F,Dagmara Rechnio,UW Warszawa,67.50,95,105,110,110,40,-45,-45,40,120,130,-140,130,280,Seniorki,Raw,SBD,
29,69,F,Wiktoria Nowogórska,AGH Kraków,64.50,97.5,-105,107.5,107.5,57.5,-62.5,-62.5,57.5,97.5,105,110,110,275,Seniorki,Raw,SBD,
30,69,F,Paulina Adamska,UO Opole,68.50,90,95,-100,95,50,52.5,-55,52.5,110,120,127.5,127.5,275,Seniorki,Raw,SBD,
31,69,F,Paulina Zębala,PP Poznań,67.40,92.5,97.5,-102.5,97.5,55,57.5,60,60,100,110,115,115,272.5,Seniorki,Raw,SBD,
32,69,F,Maria Wojtas,AGH Kraków,67.20,70,80,90,90,50,55,60,60,95,110,120,120,270,Seniorki,Raw,SBD,
33,69,F,Iryna Hulevata,US Szczecin,68.20,100,105,-110,105,-45,47.5,-50,47.5,105,110,117.5,117.5,270,Seniorki,Raw,SBD,
34,69,F,Dominika Zielińska,PBŚ Bydgoszcz,66.40,87.5,-95,97.5,97.5,45,50,52.5,52.5,102.5,112.5,-117.5,112.5,262.5,Seniorki,Raw,SBD,
35,69,F,Julia Majak,UMCS Lublin,68.00,70,90,-100,90,35,45,-50,45,100,110,-120,110,245,Seniorki,Raw,SBD,
36,69,F,Weronika Florczak,PK Kraków,68.40,70,77.5,-87.5,77.5,40,-45,-45,40,90,100,107.5,107.5,225,Seniorki,Raw,SBD,
37,69,F,Maria Szubska,UŁ Łódź,68.20,55,-60,65,65,40,45,-47.5,45,75,82.5,90,90,200,Seniorki,Raw,SBD,
38,69,F,Julia Bujalska,UŚ Katowice,68.20,65,-72.5,-82.5,65,-30,30,37.5,37.5,75,82.5,-90,82.5,185,Seniorki,Raw,SBD,
DQ,69,F,Julia Adamczyk,PK Kraków,68.50,-110,115,-125,115,-60,-65,-65,,125,132.5,142.5,142.5,,Seniorki,Raw,SBD,
1,76,F,Suzanne Nieuwenburg Izadi,UJ CM Kraków,74.00,-145,145,152.5,152.5,77.5,85,90,90,155,162.5,170,170,412.5,Seniorki,Raw,SBD,
2,76,F,Martyna Piątkowska,AWF Warszawa,72.10,147.5,157.5,-165,157.5,67.5,72.5,-75,72.5,160,170,-175,170,400,Seniorki,Raw,SBD,
3,76,F,Julia Bilicka,UG Gdańsk,70.60,122.5,130,137.5,137.5,77.5,82.5,85,85,160,-170,170,170,392.5,Seniorki,Raw,SBD,
4,76,F,Laura Kosel,GUMed Gdańsk,72.90,135,140,145,145,87.5,-92.5,92.5,92.5,145,155,-167.5,155,392.5,Seniorki,Raw,SBD,
5,76,F,Joanna Karabin,WAT Warszawa,72.70,135,140,-145,140,70,75,-80,75,145,155,-160,155,370,Seniorki,Raw,SBD,
6,76,F,Zuzanna Lenczyk,AWF Katowice,74.30,-120,-125,125,125,67.5,-72.5,-72.5,67.5,160,170,-175,170,362.5,Seniorki,Raw,SBD,
7,76,F,Amelia Borkowska,UG Gdańsk,75.70,115,122.5,125,125,82.5,87.5,-90,87.5,140,147.5,-155,147.5,360,Seniorki,Raw,SBD,
8,76,F,Katarzyna Nowak,UM Lublin,76.00,120,130,-132.5,130,67.5,72.5,-75,72.5,140,147.5,152.5,152.5,355,Seniorki,Raw,SBD,
9,76,F,Karolina Warchał,AWSB Dąbrowa Górnicza,69.50,112.5,117.5,122.5,122.5,70,75,-77.5,75,145,150,152.5,152.5,350,Seniorki,Raw,SBD,
10,76,F,Julianna Łągiewka,UM Łódź,74.00,90,100,110,110,67.5,70,-72.5,70,145,155,162.5,162.5,342.5,Seniorki,Raw,SBD,
11,76,F,Maria Karolak,UJD Częstochowa,73.30,120,130,140,140,55,60,-62.5,60,120,135,140,140,340,Seniorki,Raw,SBD,
12,76,F,Gabriela Naprawa,UJ CM Kraków,70.50,112.5,117.5,-120,117.5,-60,60,-65,60,140,150,155,155,332.5,Seniorki,Raw,SBD,
13,76,F,Marta Klimek,UG Gdańsk,73.00,130,137.5,142.5,142.5,52.5,-57.5,-57.5,52.5,110,120,130,130,325,Seniorki,Raw,SBD,
14,76,F,Julia Jakubowska,UŁ Łódź,71.40,100,115,120,120,62.5,67.5,-72.5,67.5,115,122.5,130,130,317.5,Seniorki,Raw,SBD,
15,76,F,Martyna Sulima,UPr Lublin,73.50,117.5,122.5,125,125,57.5,60,-62.5,60,132.5,-140,-140,132.5,317.5,Seniorki,Raw,SBD,
16,76,F,Agata Stawiarska,PO Opole,72.10,105,112.5,117.5,117.5,57.5,60,62.5,62.5,120,-130,130,130,310,Seniorki,Raw,SBD,
17,76,F,Roksana Winiarska,UO Opole,72.60,-90,-90,90,90,57.5,60,-62.5,60,145,152.5,160,160,310,Seniorki,Raw,SBD,
18,76,F,Gabriela Hydzik,UJ Kraków,71.30,102.5,107.5,110,110,52.5,55,57.5,57.5,125,130,135,135,302.5,Seniorki,Raw,SBD,
19,76,F,Karolina Błaszczyk-Lipska,UG Gdańsk,72.30,105,112.5,-120,112.5,45,-50,-50,45,125,132.5,-145,132.5,290,Seniorki,Raw,SBD,
20,76,F,Julia Dziwosz,UEK Kraków,70.10,85,95,105,105,70,75,-80,75,95,105,-120,105,285,Seniorki,Raw,SBD,
21,76,F,Natalia Misiewicz,UKEN Kraków,71.70,97.5,-105,107.5,107.5,47.5,-52.5,-52.5,47.5,120,-125,125,125,280,Seniorki,Raw,SBD,
22,76,F,Anna Grądalska,PK Kraków,71.60,70,75,82.5,82.5,40,45,-50,45,115,125,132.5,132.5,260,Seniorki,Raw,SBD,
23,76,F,Hanna Przywarka,UE Katowice,74.20,72.5,80,85,85,47.5,50,-52.5,50,100,112.5,120,120,255,Seniorki,Raw,SBD,
24,76,F,Oliwia Skalska,UMG Gdynia,72.70,70,80,87.5,87.5,35,-40,40,40,85,95,105,105,232.5,Seniorki,Raw,SBD,
25,76,F,Klaudia Miernik,UPr Lublin,69.10,55,-65,70,70,45,-50,-50,45,90,100,112.5,112.5,227.5,Seniorki,Raw,SBD,
26,76,F,Maria Zima,AGH Kraków,71.30,60,67.5,-75,67.5,45,47.5,-50,47.5,87.5,95,100,100,215,Seniorki,Raw,SBD,
DQ,76,F,Joanna Rawinis,AWFiS Gdańsk,72.30,-135,-135,-135,,52.5,57.5,62.5,62.5,145,155,-160,155,,Seniorki,Raw,SBD,
1,84,F,Joanna Lewandowska,UJ Kraków,83.50,176,183,186,186,103,108,109.5,109.5,200,210,214.5,214.5,510,Seniorki,Raw,SBD,
2,84,F,Ewelina Wawrzyniak,USWPS Warszawa,81.30,137.5,142.5,147.5,147.5,67.5,70,72.5,72.5,147.5,155,157.5,157.5,377.5,Seniorki,Raw,SBD,
3,84,F,Victoria Daniels,AWFiS Gdańsk,77.50,115,120,125,125,52.5,57.5,-60,57.5,170,180,-182.5,180,362.5,Seniorki,Raw,SBD,
4,84,F,Julia Dyndesz,PG Gdańsk,78.70,127.5,135,-140,135,70,72.5,-75,72.5,155,-160,-160,155,362.5,Seniorki,Raw,SBD,
5,84,F,Magdalena Szymkowiak,PWr Wrocław,79.20,-125,125,130,130,62.5,65,-67.5,65,150,157.5,162.5,162.5,357.5,Seniorki,Raw,SBD,
6,84,F,Noemi Nogaczewska,PG Gdańsk,81.90,120,127.5,-132.5,127.5,65,70,72.5,72.5,140,152.5,-165,152.5,352.5,Seniorki,Raw,SBD,
7,84,F,Martyna Macholak,AWF Katowice,82.00,120,127.5,-132.5,127.5,57.5,62.5,-67.5,62.5,140,155,,155,345,Seniorki,Raw,SBD,
8,84,F,Pernille Uleberg,UJ CM Kraków,80.00,117.5,122.5,130,130,50,57.5,-62.5,57.5,145,155,-162.5,155,342.5,Seniorki,Raw,SBD,
9,84,F,Nina Bornus,UWM Olsztyn,81.00,100,110,115,115,50,-52.5,-52.5,50,140,-147.5,150,150,315,Seniorki,Raw,SBD,
10,84,F,Larysa Lewandowska,AMW Gdynia,79.50,100,-105,-105,100,57.5,-62.5,-62.5,57.5,100,105,112.5,112.5,270,Seniorki,Raw,SBD,
11,84,F,Wiktoria Grams,UMK Toruń,81.40,-90,90,-100,90,55,-57.5,60,60,95,105,120,120,270,Seniorki,Raw,SBD,
12,84,F,Dominika Lachowska,AMW Gdynia,77.50,85,92.5,100,100,57.5,60,-62.5,60,95,100,107.5,107.5,267.5,Seniorki,Raw,SBD,
13,84,F,Justyna Pietrykowska,ŚUM Katowice,79.00,80,,,80,80,,,80,80,,,80,240,Seniorki,Raw,SBD,
14,84,F,Oliwia Świątkowska,UŁ Łódź,82.50,27.5,32.5,35,35,30,-35,35,35,-75,75,80,80,150,Seniorki,Raw,SBD,
1,84+,F,Magdalena Romaniuk,WAT Warszawa,87.70,115,125,132.5,132.5,62.5,70,72.5,72.5,137.5,147.5,160,160,365,Seniorki,Raw,SBD,
2,84+,F,Michalina Głąb,AWFiS Gdańsk,84.10,130,135,140,140,60,-62.5,62.5,62.5,135,147.5,155,155,357.5,Seniorki,Raw,SBD,
3,84+,F,Klara Cieślak,UJD Częstochowa,86.30,110,120,125,125,40,50,52.5,52.5,135,145,150,150,327.5,Seniorki,Raw,SBD,
4,84+,F,Anna Iwan,PL Lublin,84.60,95,100,105,105,57.5,60,62.5,62.5,135,140,150,150,317.5,Seniorki,Raw,SBD,
5,84+,F,Karolina Banasiak,AWFiS Gdańsk,86.30,95,100,-110,100,65,67.5,-70,67.5,120,130,142.5,142.5,310,Seniorki,Raw,SBD,
6,84+,F,Zuzanna Szczepaniak,UMCS Lublin,88.90,80,100,-120,100,55,-60,-60,55,140,150,-160,150,305,Seniorki,Raw,SBD,
7,84+,F,Weronika Kaczmarek,UMK Toruń,123.70,110,-125,-127.5,110,45,50,55,55,-125,130,-142.5,130,295,Seniorki,Raw,SBD,
8,84+,F,Aleksandra Zawistowska,UMK Toruń,96.50,75,85,95,95,35,40,-45,40,105,120,130,130,265,Seniorki,Raw,SBD,
9,84+,F,Aleksandra Geppert,UE Katowice,85.30,70,75,-80,75,50,-55,-55,50,100,110,120,120,245,Seniorki,Raw,SBD,
1,59,M,Kornel Zych,AWFiS Gdańsk,58.90,130,140,-150,140,105,110,115,115,170,180,195,195,450,Seniorzy,Raw,SBD,
2,59,M,Patryk Ciesielski,UWM Olsztyn,58.70,-150,150,-157.5,150,90,97.5,-100,97.5,190,200,-205.5,200,447.5,Seniorzy,Raw,SBD,
3,59,M,Karol Draganik,USWPS Warszawa,58.80,155,163,-170.5,163,90,95,100,100,150,157.5,-165,157.5,420.5,Seniorzy,Raw,SBD,
4,59,M,Dawid Leśniak,PO Opole,58.60,140,145,-147.5,145,95,-100,-100,95,170,175,-190,175,415,Seniorzy,Raw,SBD,
5,59,M,Rafał Cebula,AWF w Krakowie,58.30,120,127.5,132.5,132.5,65,72.5,-75,72.5,-170,170,175,175,380,Seniorzy,Raw,SBD,
6,59,M,Radosław Kwiatkowski,UWM Olsztyn,58.50,-125,125,130,130,75,80,-82.5,80,155,165,-170,165,375,Seniorzy,Raw,SBD,
7,59,M,Mariusz Bąk,PK Kraków,59.00,120,-130,-130,120,75,-80,-80,75,175,-185,-185,175,370,Seniorzy,Raw,SBD,
8,59,M,Mateusz Kaczmarski,PŁ Łódź,58.30,125,132.5,-140,132.5,77.5,80,82.5,82.5,142.5,150,-157.5,150,365,Seniorzy,Raw,SBD,
9,59,M,Igor Osadowski,AWFiS Gdańsk,59.00,-95,102.5,-117.5,102.5,-95,102.5,-110,102.5,120,132.5,-142.5,132.5,337.5,Seniorzy,Raw,SBD,
10,59,M,Jakub Czyżycki,UŚ Katowice,57.70,97.5,102.5,-110,102.5,72.5,77.5,-82.5,77.5,117.5,120,125,125,305,Seniorzy,Raw,SBD,
11,59,M,Mateusz Trębacz,UŚ Katowice,48.90,90,95,-100,95,70,75,77.5,77.5,120,125,130,130,302.5,Seniorzy,Raw,SBD,
12,59,M,Łukasz Głombik,PO Opole,54.80,90,95,100,100,60,65,-72.5,65,90,100,-110,100,265,Seniorzy,Raw,SBD,
1,66,M,Bartosz Kucharczyk,UJK Kielce,64.80,-195,195,-212.5,195,125,130,,130,210,225,-240,225,550,Seniorzy,Raw,SBD,
2,66,M,Maciej Nowak,UEK Kraków,64.00,170,182.5,190,190,105,110,-115,110,197.5,210,-217.5,210,510,Seniorzy,Raw,SBD,
3,66,M,Jakub Knobloch,ŚUM Katowice,65.10,170,-180,180,180,105,-112.5,-112.5,105,200,-212.5,-212.5,200,485,Seniorzy,Raw,SBD,
4,66,M,Filip Kania,AT Tarnów,64.60,165,-175,175,175,90,-100,-100,90,215,-230,-230,215,480,Seniorzy,Raw,SBD,
5,66,M,Szymon Kwiecień,UJK Kielce,65.10,-170,170,180,180,107.5,112.5,-117.5,112.5,175,180,185,185,477.5,Seniorzy,Raw,SBD,
6,66,M,Tomasz Nieradzik,UŚ Katowice,65.90,160,172.5,180,180,95,102.5,107.5,107.5,170,182.5,190,190,477.5,Seniorzy,Raw,SBD,
7,66,M,Eryk Sołomachin,UM Łódź,66.00,155,167.5,172.5,172.5,90,92.5,95,95,195,-215,-215,195,462.5,Seniorzy,Raw,SBD,
8,66,M,Filip Hajda,AWF Katowice,65.30,-150,150,160,160,95,102.5,-107.5,102.5,190,-205,-205,190,452.5,Seniorzy,Raw,SBD,
9,66,M,Łukasz Janik,UŁ Łódź,64.00,-160,-160,160,160,95,97.5,100,100,-190,190,-200,190,450,Seniorzy,Raw,SBD,
10,66,M,Karol Smutek,UPr Lublin,65.80,140,-145,150,150,90,-95,-95,90,202.5,-210,-210,202.5,442.5,Seniorzy,Raw,SBD,
11,66,M,Przemysław Kiełkowski,PBŚ Bydgoszcz,64.20,145,155,-162.5,155,75,82.5,-87.5,82.5,190,200,-207.5,200,437.5,Seniorzy,Raw,SBD,
12,66,M,Kamil Biliński,UR Rzeszów,63.30,-125,125,135,135,90,100,-105,100,180,190,200,200,435,Seniorzy,Raw,SBD,
13,66,M,Marcin Lata,UŚ Katowice,64.80,-130,-130,130,130,95,102.5,-105,102.5,160,180,-195,180,412.5,Seniorzy,Raw,SBD,
14,66,M,Kacper Kulik,UŚ Katowice,63.60,130,135,-140,135,-80,85,-90,85,150,165,175,175,395,Seniorzy,Raw,SBD,
15,66,M,Szymon Nowakowski,UMK Toruń,65.50,-120,-120,120,120,-85,85,92.5,92.5,160,-170,-170,160,372.5,Seniorzy,Raw,SBD,
16,66,M,Filip Grodecki,UWM Olsztyn,62.80,-130,130,-137.5,130,100,-105,-107.5,100,130,-140,-140,130,360,Seniorzy,Raw,SBD,
17,66,M,Jakub Frydlewicz,PRz Rzeszów,64.20,-110,110,125,125,70,75,82.5,82.5,140,150,-160,150,357.5,Seniorzy,Raw,SBD,
18,66,M,Piotr Gurba,AWF w Krakowie,61.90,110,117.5,122.5,122.5,70,75,-77.5,75,140,150,152.5,152.5,350,Seniorzy,Raw,SBD,
19,66,M,Oskar Paprota,UMCS Lublin,65.10,110,-125,-125,110,70,85,-90,85,130,140,-160,140,335,Seniorzy,Raw,SBD,
20,66,M,Aleksander Tokarek,ANS Konin,66.00,80,100,-120,100,60,70,72.5,72.5,100,125,150,150,322.5,Seniorzy,Raw,SBD,
DQ,66,M,Jakub Sikora,PK Kraków,64.40,-145,-145,-145,,75,80,,80,155,165,175,175,,Seniorzy,Raw,SBD,
DQ,66,M,Paweł Bożek,UW Warszawa,65.50,-140,-140,140,140,100,105,-110,105,-185,,,,,Seniorzy,Raw,SBD,
1,74,M,Michał Jasak,PW Warszawa,73.00,195,202.5,210,210,135,140,-145,140,245,255,-265,255,605,Seniorzy,Raw,SBD,
2,74,M,Igor Tomasik,PK Kraków,74.00,-180,180,195,195,150,160,-164,160,220,230,240,240,595,Seniorzy,Raw,SBD,
3,74,M,Rafał Zaremba,UJ Kraków,73.30,180,190,195,195,147.5,152.5,-157.5,152.5,205,215,222.5,222.5,570,Seniorzy,Raw,SBD,
4,74,M,Przemysław Stec,PK Kraków,73.10,170,180,190,190,130,-135,,130,-240,-240,245,245,565,Seniorzy,Raw,SBD,
5,74,M,Dawid Łach,AWP Lublin,72.70,192.5,200,205,205,127.5,-132.5,-135,127.5,227.5,-237.5,-237.5,227.5,560,Seniorzy,Raw,SBD,
6,74,M,Łukasz Darczuk,PL Lublin,73.30,190,200,205,205,130,135,140,140,200,210,-215,210,555,Seniorzy,Raw,SBD,
7,74,M,Szymon Miśkowiec,ANS Nowy Sącz,72.10,175,-182.5,185,185,117.5,120,122.5,122.5,235,245,-250,245,552.5,Seniorzy,Raw,SBD,
8,74,M,Dominik Nowogórski,UJ Kraków,74.00,182.5,190,195,195,125,130,132.5,132.5,215,225,-230,225,552.5,Seniorzy,Raw,SBD,
9,74,M,Patryk Kuczek,PRz Rzeszów,73.10,185,-195,195,195,120,125,127.5,127.5,215,225,227.5,227.5,550,Seniorzy,Raw,SBD,
10,74,M,Mariusz Jaroszek,UPr Lublin,73.90,195,205,-215,205,115,-120,-120,115,230,-240,-240,230,550,Seniorzy,Raw,SBD,
11,74,M,Bartłomiej Pomietło,AGH Kraków,71.70,170,180,187.5,187.5,115,120,125,125,220,227.5,235,235,547.5,Seniorzy,Raw,SBD,
12,74,M,Tomasz Bernat,UJ CM Kraków,73.40,177.5,185,-192.5,185,130,135,-137.5,135,212.5,220,227.5,227.5,547.5,Seniorzy,Raw,SBD,
13,74,M,Wiktor Borysiewicz,UW Warszawa,73.60,-185,190,-195,190,112.5,120,-122.5,120,230,237.5,-242.5,237.5,547.5,Seniorzy,Raw,SBD,
14,74,M,Jan Tarkowski,UR Rzeszów,72.20,190,202.5,212.5,212.5,107.5,112.5,-117.5,112.5,200,212.5,220,220,545,Seniorzy,Raw,SBD,
15,74,M,Oskar Swat,UŁ Łódź,73.30,180,192.5,200,200,110,115,-117.5,115,217.5,230,-235,230,545,Seniorzy,Raw,SBD,
16,74,M,Bartosz Świstak,AWF Warszawa,73.80,200,210,215,215,115,120,-122.5,120,200,210,-220,210,545,Seniorzy,Raw,SBD,
17,74,M,Antoni Winiarek,WAT Warszawa,72.60,180,187.5,195,195,120,-125,-125,120,210,220,225,225,540,Seniorzy,Raw,SBD,
18,74,M,Kacper Bożek,AGH Kraków,73.10,160,172.5,177.5,177.5,107.5,-115,115,115,217.5,232.5,240,240,532.5,Seniorzy,Raw,SBD,
19,74,M,Szymon Azarewicz,PG Gdańsk,72.40,175,185,192.5,192.5,102.5,105,-110,105,220,-232.5,232.5,232.5,530,Seniorzy,Raw,SBD,
20,74,M,Michał Koziar,UMCS Lublin,73.90,160,170,180,180,125,-135,-135,125,200,210,220,220,525,Seniorzy,Raw,SBD,
21,74,M,Juliusz Liecau,UMK Toruń,73.30,175,-185,185,185,120,125,-127.5,125,200,-210,210,210,520,Seniorzy,Raw,SBD,
22,74,M,Mikołaj Jęsiak,AWFiS Gdańsk,72.90,170,180,-190,180,102.5,107.5,-112.5,107.5,210,220,222.5,222.5,510,Seniorzy,Raw,SBD,
23,74,M,Szymon Goch,AWF w Krakowie,72.60,175,182.5,-190,182.5,100,-105,-105,100,200,210,217.5,217.5,500,Seniorzy,Raw,SBD,
24,74,M,Maksymilian Bęczyński,AWF Warszawa,73.80,170,177.5,-180,177.5,-105,107.5,-110,107.5,-215,-215,215,215,500,Seniorzy,Raw,SBD,
25,74,M,Krystian Jasik,UPr Lublin,72.60,170,177.5,-182.5,177.5,105,110,-112.5,110,210,-217.5,-217.5,210,497.5,Seniorzy,Raw,SBD,
26,74,M,Maciej Różański,UMK Toruń,72.20,150,160,-165,160,-110,115,-120,115,210,220,-230,220,495,Seniorzy,Raw,SBD,
27,74,M,Szymon Borowicz,PRz Rzeszów,72.90,170,-180,,170,95,-102.5,-102.5,95,230,-245,-245,230,495,Seniorzy,Raw,SBD,
28,74,M,Maciej Martenka,PBŚ Bydgoszcz,73.50,145,152.5,160,160,115,122.5,-127.5,122.5,190,200,212.5,212.5,495,Seniorzy,Raw,SBD,
29,74,M,Mateusz Wicki,UMG Gdynia,72.40,165,170,-175,170,117.5,122.5,125,125,180,195,-205,195,490,Seniorzy,Raw,SBD,
30,74,M,Jakub Szczerbak,UJD Częstochowa,73.40,160,-170,-170,160,105,112.5,-122.5,112.5,205,217.5,-227.5,217.5,490,Seniorzy,Raw,SBD,
31,74,M,Rafał Waleń,UR Rzeszów,72.10,167.5,-175,-175,167.5,110,115,117.5,117.5,190,200,-215,200,485,Seniorzy,Raw,SBD,
32,74,M,Patryk Wypych,UJ Kraków,72.50,-180,180,185,185,-95,95,-102.5,95,200,205,-210,205,485,Seniorzy,Raw,SBD,
33,74,M,Jakub Mazur,PRz Rzeszów,73.10,165,172.5,-180,172.5,95,102.5,-107.5,102.5,200,210,-215,210,485,Seniorzy,Raw,SBD,
34,74,M,Patryk Łobacz,PL Lublin,73.90,150,160,-170,160,110,117.5,125,125,180,190,200,200,485,Seniorzy,Raw,SBD,
35,74,M,Jakub Jaśków,PWr Wrocław,73.20,170,180,190,190,95,102.5,-105,102.5,190,-202.5,-202.5,190,482.5,Seniorzy,Raw,SBD,
36,74,M,Gabriel Dobromilski,PW Warszawa,73.30,157.5,165,172.5,172.5,100,105,110,110,180,190,200,200,482.5,Seniorzy,Raw,SBD,
37,74,M,Jakub Wierzchowski,UEK Kraków,73.00,160,-170,-170,160,115,120,-125,120,190,200,-205,200,480,Seniorzy,Raw,SBD,
38,74,M,Kamil Osumek,UŁ Łódź,72.20,160,170,-175,170,90,-97.5,-97.5,90,210,-225,-225,210,470,Seniorzy,Raw,SBD,
39,74,M,Hubert Kamiński,AT Tarnów,71.00,150,157.5,165,165,87.5,92.5,-95,92.5,200,210,-220,210,467.5,Seniorzy,Raw,SBD,
40,74,M,Damian Drozdowski,AWF w Krakowie,73.50,150,-157.5,165,165,100,105,110,110,170,182.5,190,190,465,Seniorzy,Raw,SBD,
41,74,M,Bartłomiej Kotara,ŚUM Katowice,72.80,140,150,-155,150,87.5,92.5,95,95,205,212.5,215,215,460,Seniorzy,Raw,SBD,
42,74,M,Emil Ulejczyk,AWF Katowice,72.00,-140,150,160,160,-100,100,-107.5,100,180,190,192.5,192.5,452.5,Seniorzy,Raw,SBD,
43,74,M,Kacper Mikółka,ŚUM Katowice,74.00,-150,160,165,165,100,110,-112.5,110,175,-185,-185,175,450,Seniorzy,Raw,SBD,
44,74,M,Tomasz Sura,AT Tarnów,71.80,135,-145,145,145,105,112.5,-120,112.5,170,185,190,190,447.5,Seniorzy,Raw,SBD,
45,74,M,Kacper Mrowiec,PK Kraków,73.30,152.5,-165,-165,152.5,97.5,102.5,105,105,177.5,190,-197.5,190,447.5,Seniorzy,Raw,SBD,
46,74,M,Karol Cioć,PŚk Kielce,73.00,135,142.5,-150,142.5,-107.5,107.5,-112.5,107.5,170,180,190,190,440,Seniorzy,Raw,SBD,
47,74,M,Bartosz Michalik,PM Szczecin,73.10,145,155,,155,100,107.5,-112.5,107.5,165,177.5,-185,177.5,440,Seniorzy,Raw,SBD,
48,74,M,Mateusz Gurazda,UŁ Łódź,73.70,-125,130,140,140,107.5,110,-112.5,110,190,-200,-200,190,440,Seniorzy,Raw,SBD,
49,74,M,Jan Sobczyk,PŚ Gliwice,73.40,140,145,-150,145,-105,105,107.5,107.5,175,180,-190,180,432.5,Seniorzy,Raw,SBD,
50,74,M,Piotr Rząca,SGGW Warszawa,73.80,140,-150,150,150,90,95,100,100,160,170,180,180,430,Seniorzy,Raw,SBD,
51,74,M,Maksymilian Brela,UJK Kielce,73.40,160,-170,-175,160,95,100,-105,100,160,-165,-165,160,420,Seniorzy,Raw,SBD,
52,74,M,Szymon Bolanowski,UR Rzeszów,72.70,-130,137.5,145,145,95,102.5,-107.5,102.5,167.5,170,-180,170,417.5,Seniorzy,Raw,SBD,
53,74,M,Konrad Synowiec,PK Kraków,72.60,145,150,-152.5,150,100,105,107.5,107.5,145,152.5,-157.5,152.5,410,Seniorzy,Raw,SBD,
54,74,M,Jakub Więcek,AT Tarnów,71.90,130,140,147.5,147.5,72.5,77.5,82.5,82.5,162.5,175,-182.5,175,405,Seniorzy,Raw,SBD,
55,74,M,Daniel Cupryn,UŁ Łódź,72.80,-110,-110,110,110,115,125,-130,125,160,170,-180,170,405,Seniorzy,Raw,SBD,
56,74,M,Szymon Senderp,UWM Olsztyn,73.20,115,122.5,-135,122.5,92.5,97.5,102.5,102.5,160,175,-190,175,400,Seniorzy,Raw,SBD,
57,74,M,Szymon Więcławski,UWM Olsztyn,72.80,135,-142.5,-142.5,135,90,95,-100,95,145,-152.5,152.5,152.5,382.5,Seniorzy,Raw,SBD,
58,74,M,Tomisław Biernat,UE Katowice,72.30,100,-110,110,110,90,95,100,100,155,165,170,170,380,Seniorzy,Raw,SBD,
59,74,M,Bartosz Kozub,AT Tarnów,73.10,110,125,-135,125,85,-92.5,-92.5,85,145,-150,160,160,370,Seniorzy,Raw,SBD,
60,74,M,Aleks Dudziak,UMCS Lublin,73.90,100,115,-130,115,80,-90,-90,80,-110,110,130,130,325,Seniorzy,Raw,SBD,
61,74,M,Marcel Chojnacki,UMCS Lublin,73.10,-80,85,-100,85,80,-90,-90,80,130,140,150,150,315,Seniorzy,Raw,SBD,
62,74,M,Arkadiusz Suska,GUMed Gdańsk,73.00,90,95,100,100,72.5,-75,-75,72.5,-110,110,125,125,297.5,Seniorzy,Raw,SBD,
63,74,M,Szymon Papis,UEP Poznań,69.00,65,75,-85,75,-85,90,-97.5,90,105,-110,110,110,275,Seniorzy,Raw,SBD,
64,74,M,Kamil Turczynowski,ŚUM Katowice,70.40,-80,80,-85,80,60,-75,-75,60,90,100,120,120,260,Seniorzy,Raw,SBD,
65,74,M,Błażej Szymczuk,ŚUM Katowice,68.80,50,55,60,60,65,70,75,75,65,70,75,75,210,Seniorzy,Raw,SBD,
DQ,74,M,Filip Witkowski,SGGW Warszawa,73.70,140,145,-150,145,-120,-120,120,120,-175,-185,-185,,,Seniorzy,Raw,SBD,
DQ,74,M,Patryk Poręba,UR Rzeszów,71.80,142.5,152.5,162.5,162.5,95,100,-105,100,-220,-220,-220,,,Seniorzy,Raw,SBD,
DQ,74,M,Albert Papliński,KUL Lublin,73.40,190,205,-215,205,-115,-120,120,120,-215,-215,-215,,,Seniorzy,Raw,SBD,
1,83,M,Kamil Linstedt,PG Gdańsk,75.40,245,252.5,260.5,260.5,127.5,132.5,,132.5,265,272.5,-277.5,272.5,665.5,Seniorzy,Raw,SBD,
2,83,M,Marcel Boryła,PRz Rzeszów,81.00,220,235,247.5,247.5,150,-155,-155,150,260,-270,-270,260,657.5,Seniorzy,Raw,SBD,
3,83,M,Ignacy Banaszek,UŁ Łódź,82.00,225,240,-245,240,135,140,142.5,142.5,260,270,275,275,657.5,Seniorzy,Raw,SBD,
4,83,M,Damian Rusek,AWF Warszawa,80.00,210,220,225,225,117.5,125,,125,275,288,303,303,653,Seniorzy,Raw,SBD,
5,83,M,Michał Mizia,PW Warszawa,78.80,200,212.5,222.5,222.5,152.5,160,,160,255,265,270,270,652.5,Seniorzy,Raw,SBD,
6,83,M,Przemysław Milczarczyk,WAT Warszawa,81.30,215,225,232.5,232.5,145,155,160,160,240,260,-267.5,260,652.5,Seniorzy,Raw,SBD,
7,83,M,Kamil Światły,UAM Poznań,81.50,222.5,232.5,240,240,142.5,150,155,155,250,-260,-260,250,645,Seniorzy,Raw,SBD,
8,83,M,Hubert Furmankiewicz,UPP Poznań,82.60,207.5,217.5,227.5,227.5,150,157.5,160,160,230,245,-260,245,632.5,Seniorzy,Raw,SBD,
9,83,M,Paweł Drzyzga,PK Kraków,82.10,210,220,,220,135,140,-145,140,-270,270,-289,270,630,Seniorzy,Raw,SBD,
10,83,M,Maciej Preinl,UJ CM Kraków,81.20,205,217.5,225,225,130,137.5,-142.5,137.5,240,252.5,260,260,622.5,Seniorzy,Raw,SBD,
11,83,M,Dominik Pierzchała,UEK Kraków,83.00,220,230,-237.5,230,120,130,-135,130,-250,260,-270,260,620,Seniorzy,Raw,SBD,
12,83,M,Patryk Miszke,PG Gdańsk,81.80,205,215,225,225,145,-152.5,152.5,152.5,225,235,-245,235,612.5,Seniorzy,Raw,SBD,
13,83,M,Daniel Godlewski,UMG Gdynia,80.30,190,200,210,210,-140,140,-142.5,140,-240,240,260,260,610,Seniorzy,Raw,SBD,
14,83,M,Jakub Mońka,AWF w Krakowie,81.50,207.5,217.5,225,225,140,145,-150,145,230,240,-250,240,610,Seniorzy,Raw,SBD,
15,83,M,Jan Kazak,PK Kraków,81.60,225,235,240,240,125,132.5,-140,132.5,227.5,237.5,-240,237.5,610,Seniorzy,Raw,SBD,
16,83,M,Leszek Kuc,UEK Kraków,81.60,225,235,-240,235,135,-140,140,140,-235,235,,235,610,Seniorzy,Raw,SBD,
17,83,M,Sebastian Bojdo,PK Kraków,82.70,200,207.5,-215,207.5,135,140,-142.5,140,250,257.5,-265,257.5,605,Seniorzy,Raw,SBD,
18,83,M,Kacper Błotko,PK Kraków,80.80,220,230,235,235,150,-160,-160,150,210,-220,-220,210,595,Seniorzy,Raw,SBD,
19,83,M,Dominik Witas,PRz Rzeszów,81.20,200,210,-225,210,140,-150,150,150,235,-250,-250,235,595,Seniorzy,Raw,SBD,
20,83,M,Mikołaj Faligowski,WAT Warszawa,82.00,190,200,205,205,145,-150,-150,145,220,235,245,245,595,Seniorzy,Raw,SBD,
21,83,M,Viktor Kwasnik,PP Poznań,79.90,220,230,237.5,237.5,130,-140,140,140,180,200,210,210,587.5,Seniorzy,Raw,SBD,
22,83,M,Kacper Chmura,PRz Rzeszów,82.30,205,-215,-215,205,137.5,142.5,-147.5,142.5,230,240,-252.5,240,587.5,Seniorzy,Raw,SBD,
23,83,M,Oskar Hoffmann,PWr Wrocław,82.50,-200,210,-217.5,210,120,130,-132.5,130,220,230,235,235,575,Seniorzy,Raw,SBD,
24,83,M,Szymon Karpiński,ZUT Szczecin,81.30,200,212.5,-217.5,212.5,132.5,140,,140,220,-230,-230,220,572.5,Seniorzy,Raw,SBD,
25,83,M,Konrad Motyl,AWF w Krakowie,82.00,180,190,200,200,132.5,-137.5,-137.5,132.5,-230,230,240,240,572.5,Seniorzy,Raw,SBD,
26,83,M,Maciej Mitek,AT Tarnów,81.50,190,200,207.5,207.5,125,132.5,-140,132.5,220,230,-235,230,570,Seniorzy,Raw,SBD,
27,83,M,Dawid Szałas,UJK Kielce,82.30,185,200,-205,200,125,132.5,-135,132.5,225,235,-240,235,567.5,Seniorzy,Raw,SBD,
28,83,M,Krzysztof Kolber,PUM w Szczecinie,81.80,170,180,190,190,130,135,-140,135,230,240,,240,565,Seniorzy,Raw,SBD,
29,83,M,Błażej Guzikowski,UJK Kielce,81.50,185,195,200,200,-127.5,127.5,132.5,132.5,215,225,230,230,562.5,Seniorzy,Raw,SBD,
30,83,M,Maks Betlejewski,PG Gdańsk,81.80,182.5,-187.5,187.5,187.5,122.5,125,127.5,127.5,235,245,-250,245,560,Seniorzy,Raw,SBD,
31,83,M,Patryk Jabłoński,PL Lublin,82.20,195,202.5,-210,202.5,120,125,-130,125,230,-240,-240,230,557.5,Seniorzy,Raw,SBD,
32,83,M,Konrad Piwcewicz,PG Gdańsk,81.30,-195,195,200,200,115,-120,,115,230,-237.5,237.5,237.5,552.5,Seniorzy,Raw,SBD,
33,83,M,Mateusz Stermolewski,WSB Merito Poznań,79.90,195,202.5,210,210,107.5,112.5,-117.5,112.5,205,217.5,225,225,547.5,Seniorzy,Raw,SBD,
34,83,M,Oskar Druszcz,UŁ Łódź,80.40,180,192.5,202.5,202.5,107.5,115,-122.5,115,195,210,220,220,537.5,Seniorzy,Raw,SBD,
35,83,M,Marcin Ziółkowski,ANS Konin,81.20,180,-200,-200,180,130,-135,-140,130,200,210,225,225,535,Seniorzy,Raw,SBD,
36,83,M,Damian Giebler,UG Gdańsk,79.80,175,182.5,-192.5,182.5,110,-120,120,120,-210,-220,230,230,532.5,Seniorzy,Raw,SBD,
37,83,M,Tomasz Fedoniuk,UPr Lublin,82.50,190,200,-205,200,117.5,122.5,125,125,207.5,-217.5,-217.5,207.5,532.5,Seniorzy,Raw,SBD,
38,83,M,Kacper Madej,UM Lublin,82.20,172.5,-182.5,182.5,182.5,125,132.5,-135,132.5,205,215,-220,215,530,Seniorzy,Raw,SBD,
39,83,M,Daniel Cisowski,PŚk Kielce,80.80,175,187.5,-200,187.5,105,115,-125,115,200,212.5,225,225,527.5,Seniorzy,Raw,SBD,
40,83,M,Adrian Szymański,PBŚ Bydgoszcz,79.40,160,170,175,175,130,135,-137.5,135,190,200,205,205,515,Seniorzy,Raw,SBD,
41,83,M,Eryk Bartkowiak,PO Opole,82.10,165,172.5,180,180,122.5,127.5,-130,127.5,180,190,205,205,512.5,Seniorzy,Raw,SBD,
42,83,M,Hubert Kozdra,URK Kraków,79.90,-155,160,170,170,115,125,130,130,180,200,210,210,510,Seniorzy,Raw,SBD,
43,83,M,Oleksandr Kucheriavyi,UG Gdańsk,80.90,175,185,200,200,105,110,-115,110,180,200,-205,200,510,Seniorzy,Raw,SBD,
44,83,M,Daniel Pawluczuk,UG Gdańsk,81.00,150,160,-170,160,110,115,-120,115,-230,230,-250,230,505,Seniorzy,Raw,SBD,
45,83,M,Jakub Wojtkowski,PB Białystok,81.10,182.5,190,-195,190,-107.5,112.5,-120,112.5,-200,200,-210,200,502.5,Seniorzy,Raw,SBD,
46,83,M,Filip Dudzinski,UEP Poznań,78.50,140,160,180,180,105,110,-120,110,180,190,210,210,500,Seniorzy,Raw,SBD,
47,83,M,Kacper Barejka,PŁ Łódź,79.80,150,165,177.5,177.5,115,125,-130,125,170,185,197.5,197.5,500,Seniorzy,Raw,SBD,
48,83,M,Patryk Danek,UMG Gdynia,80.90,165,175,-185,175,-100,110,115,115,180,195,210,210,500,Seniorzy,Raw,SBD,
49,83,M,Jakub Kus,UEK Kraków,81.10,165,175,-185,175,125,130,-135,130,-185,185,195,195,500,Seniorzy,Raw,SBD,
50,83,M,Jakub Kutera,SGGW Warszawa,81.70,160,170,180,180,115,122.5,130,130,175,190,-200,190,500,Seniorzy,Raw,SBD,
51,83,M,Wiktor Bieszczad,AT Tarnów,81.80,152.5,162.5,170,170,97.5,105,-110,105,200,210,225,225,500,Seniorzy,Raw,SBD,
52,83,M,Oskar Szczerbowski,AWFiS Gdańsk,81.40,175,180,-185,180,110,-117.5,-117.5,110,200,207.5,-212.5,207.5,497.5,Seniorzy,Raw,SBD,
53,83,M,Przemysław Zawalski,UKW Bydgoszcz,81.50,150,-170,-170,150,-150,150,155,155,190,192.5,-210,192.5,497.5,Seniorzy,Raw,SBD,
54,83,M,Kacper Godlewski,UE Katowice,77.30,165,185,-190,185,105,-110,-110,105,205,-215,-215,205,495,Seniorzy,Raw,SBD,
55,83,M,Adrian Wierzchowski,SGGW Warszawa,81.20,-180,180,190,190,100,-105,105,105,-200,-200,200,200,495,Seniorzy,Raw,SBD,
56,83,M,Dominik Tumidajski,AG Katowice,81.90,160,170,180,180,105,110,115,115,180,190,200,200,495,Seniorzy,Raw,SBD,
57,83,M,Marcel Mika,PŚ Gliwice,81.00,170,177.5,182.5,182.5,105,112.5,115,115,180,187.5,195,195,492.5,Seniorzy,Raw,SBD,
58,83,M,Jędrzej Posłuszny,PP Poznań,79.40,180,190,-200,190,110,-120,120,120,180,-190,-190,180,490,Seniorzy,Raw,SBD,
59,83,M,Jan Kożuch,PK Kraków,82.40,-180,180,-190,180,110,115,-120,115,180,190,-205,190,485,Seniorzy,Raw,SBD,
60,83,M,George Moses Ochieng,GUMed Gdańsk,81.40,160,170,-190,170,100,-120,-130,100,160,180,210,210,480,Seniorzy,Raw,SBD,
61,83,M,Mateusz Wątły,UJ Kraków,81.50,-180,180,-185,180,110,-115,,110,180,190,-200,190,480,Seniorzy,Raw,SBD,
62,83,M,Łukasz Górski,PBŚ Bydgoszcz,79.20,160,170,175,175,100,-105,-105,100,200,-225,-225,200,475,Seniorzy,Raw,SBD,
63,83,M,Mateusz Hołub,AWFiS Gdańsk,78.30,165,170,177.5,177.5,92.5,97.5,102.5,102.5,175,182.5,190,190,470,Seniorzy,Raw,SBD,
64,83,M,Bartłomiej Zygmunt,UJ Kraków,81.90,155,165,170,170,100,-110,-110,100,-180,190,200,200,470,Seniorzy,Raw,SBD,
65,83,M,Franciszek Jędrzejewski,US Szczecin,78.90,130,140,-150,140,-120,120,127.5,127.5,180,200,-205,200,467.5,Seniorzy,Raw,SBD,
66,83,M,Kamil Karwacki,PŚ Gliwice,80.20,170,180,182.5,182.5,90,-95,-95,90,185,190,195,195,467.5,Seniorzy,Raw,SBD,
67,83,M,Mateusz Pisarek,UŚ Katowice,79.70,-170,170,180,180,105,-110,-110,105,165,180,-190,180,465,Seniorzy,Raw,SBD,
68,83,M,Adam Makulec,PL Lublin,80.50,140,150,-170,150,-115,-115,115,115,-170,170,200,200,465,Seniorzy,Raw,SBD,
69,83,M,Krystian Nadrowski,UKW Bydgoszcz,80.90,160,165,-175,165,-107.5,107.5,-110,107.5,175,190,-200,190,462.5,Seniorzy,Raw,SBD,
70,83,M,Wojciech Banyś,ŚUM Katowice,82.00,147.5,160,170,170,110,117.5,-120,117.5,175,-185,-185,175,462.5,Seniorzy,Raw,SBD,
71,83,M,Dawid Zduńczyk,PŚ Gliwice,79.60,177.5,187.5,192.5,192.5,102.5,-110,-110,102.5,165,-175,-177.5,165,460,Seniorzy,Raw,SBD,
72,83,M,Jerzy Dajka,UŚ Katowice,80.31,-160,160,165,165,100,105,-110,105,180,190,-200,190,460,Seniorzy,Raw,SBD,
73,83,M,Aleksander Kowalski,UMG Gdynia,81.90,165,-175,-180,165,95,100,-105,100,180,195,-205,195,460,Seniorzy,Raw,SBD,
74,83,M,Bartosz Boć,PŁ Łódź,81.90,145,150,155,155,110,115,-120,115,190,-200,-200,190,460,Seniorzy,Raw,SBD,
75,83,M,Bartosz Lato,WSB Merito Chorzów,82.40,147.5,155,160,160,95,-100,100,100,187.5,200,-205,200,460,Seniorzy,Raw,SBD,
76,83,M,Kamil Kochanowicz,UM Łódź,80.20,140,150,-160,150,115,122.5,127.5,127.5,177.5,180,-192.5,180,457.5,Seniorzy,Raw,SBD,
77,83,M,Marcin Goleń,UKW Bydgoszcz,81.80,150,160,-170,160,120,-125,125,125,170,-180,-180,170,455,Seniorzy,Raw,SBD,
78,83,M,Klaudiusz Suchecki,ŚUM Katowice,82.20,135,142.5,-147.5,142.5,95,100,-102.5,100,195,205,210,210,452.5,Seniorzy,Raw,SBD,
79,83,M,Jakub Kubalski,AGH Kraków,77.60,145,155,165,165,-110,110,-112.5,110,170,-180,-180,170,445,Seniorzy,Raw,SBD,
80,83,M,Filip Lenartowicz,GUMed Gdańsk,77.80,145,160,-170,160,-100,100,-110,100,-170,170,180,180,440,Seniorzy,Raw,SBD,
81,83,M,Szymon Stankowski,AMW Gdynia,81.50,120,140,-150,140,-120,120,-130,120,-150,150,180,180,440,Seniorzy,Raw,SBD,
82,83,M,Kacper Lesik,PŚk Kielce,79.00,120,132.5,145,145,105,-112.5,115,115,150,160,175,175,435,Seniorzy,Raw,SBD,
83,83,M,Mateusz Urban,UG Gdańsk,82.10,-120,-130,130,130,120,125,-127.5,125,120,150,180,180,435,Seniorzy,Raw,SBD,
84,83,M,Wiktor Choraszewski,UO Opole,78.70,150,157.5,-165,157.5,95,-97.5,-97.5,95,170,180,-185,180,432.5,Seniorzy,Raw,SBD,
85,83,M,Michał Jaroma,UW Warszawa,80.80,130,140,145,145,-85,95,-97.5,95,180,190,-192.5,190,430,Seniorzy,Raw,SBD,
86,83,M,Marek Kolender,PO Opole,81.40,150,-160,-160,150,105,110,120,120,-160,160,-170,160,430,Seniorzy,Raw,SBD,
87,83,M,Jakub Kranz,PBŚ Bydgoszcz,75.90,115,125,-135,125,90,95,100,100,175,190,200,200,425,Seniorzy,Raw,SBD,
88,83,M,Kacper Grzonkowski,AWFiS Gdańsk,81.00,135,140,147.5,147.5,95,100,-105,100,175,-180,-180,175,422.5,Seniorzy,Raw,SBD,
89,83,M,Kamil Gronek,PRz Rzeszów,78.00,120,130,-140,130,85,90,-95,90,175,185,-195,185,405,Seniorzy,Raw,SBD,
90,83,M,Michał Szymański,ANS Konin,82.90,-120,125,135,135,105,107.5,-110,107.5,160,162.5,-175,162.5,405,Seniorzy,Raw,SBD,
91,83,M,Homam Dagheem,GUMed Gdańsk,81.00,140,145,-160,145,90,95,-105,95,100,130,150,150,390,Seniorzy,Raw,SBD,
92,83,M,Konrad Majewski,UŚ Katowice,81.90,-130,135,145,145,-90,95,102.5,102.5,130,140,-155,140,387.5,Seniorzy,Raw,SBD,
93,83,M,Paweł Puzio,PP Poznań,77.90,100,107.5,120,120,80,87.5,-95,87.5,160,175,-187.5,175,382.5,Seniorzy,Raw,SBD,
94,83,M,Ignacy Dytkowski,AWF w Krakowie,77.70,110,120,-130,120,-80,85,90,90,130,145,155,155,365,Seniorzy,Raw,SBD,
95,83,M,Tomasz Cholewiński,PRz Rzeszów,78.90,-110,110,-125,110,102.5,107.5,-112.5,107.5,120,140,-150,140,357.5,Seniorzy,Raw,SBD,
96,83,M,Norbert Tokarz,UEP Poznań,78.90,-105,105,117.5,117.5,-85,87.5,-100,87.5,125,145,-155,145,350,Seniorzy,Raw,SBD,
97,83,M,Konrad Turczynowski,ŚUM Katowice,82.20,80,90,105,105,70,80,-90,80,125,-140,-140,125,310,Seniorzy,Raw,SBD,
98,83,M,Bartosz Gamszej,UEP Poznań,82.00,50,60,-75,60,-50,50,-70,50,60,62.5,100,100,210,Seniorzy,Raw,SBD,
DQ,83,M,Cyprian Skorupski,AWF Gorzów Wlkp.,76.20,-95,-95,-95,,80,-90,-90,80,100,102.5,110,110,,Seniorzy,Raw,SBD,
DQ,83,M,Kacper Rybiński,PK Kraków,80.80,-150,150,165,165,-100,-100,-100,,170,172.5,-175,172.5,,Seniorzy,Raw,SBD,
DQ,83,M,Konrad Sitek,UJ Kraków,80.40,170,175,-180,175,-135,-142.5,-142.5,,230,240,-247.5,240,,Seniorzy,Raw,SBD,
DQ,83,M,Piotr Marcisz,AWF Katowice,78.60,-210,-210,-210,,-127.5,-127.5,-127.5,,-270,,,,,Seniorzy,Raw,SBD,
DQ,83,M,Miron Dembski,UW Warszawa,82.60,245,-260.5,-260.5,245,-130,-130,-130,,-260,-260,-260,,,Seniorzy,Raw,SBD,
1,93,M,Aleksander Koszewski,WSEwS Warszawa,91.60,220,230,237.5,237.5,172.5,177.5,180,180,290,300,307.5,307.5,725,Seniorzy,Raw,SBD,
2,93,M,Marcin Statkiewicz,PG Gdańsk,92.10,240,247.5,-252.5,247.5,145,152.5,157.5,157.5,280,-295,295,295,700,Seniorzy,Raw,SBD,
3,93,M,Michał Jarek,ŚUM Katowice,92.60,225,232.5,-240,232.5,125,130,135,135,300,310.5,315,315,682.5,Seniorzy,Raw,SBD,
4,93,M,Marceli Jerzyński,PP Poznań,92.90,250,257.5,,257.5,140,145,-147.5,145,250,257.5,262.5,262.5,665,Seniorzy,Raw,SBD,
5,93,M,Mateusz Myśliwiec,PK Kraków,91.30,220,230,-240,230,150,-160,,150,260,270,280,280,660,Seniorzy,Raw,SBD,
6,93,M,Mikołaj Tyburcy,AWF Wrocław,92.00,230,242.5,-250,242.5,155,162.5,-167.5,162.5,235,250,-260,250,655,Seniorzy,Raw,SBD,
7,93,M,Kamil Dworaczek,PŚ Gliwice,90.80,225,235,-242.5,235,130,137.5,-140,137.5,255,270,-280,270,642.5,Seniorzy,Raw,SBD,
8,93,M,Kamil Rzóska,UWM Olsztyn,91.00,235,255,-262.5,255,125,135,-140,135,215,230,240,240,630,Seniorzy,Raw,SBD,
9,93,M,Mateusz Szostak,PW Warszawa,92.80,235,242.5,250,250,140,145,-150,145,230,-240,-240,230,625,Seniorzy,Raw,SBD,
10,93,M,Rafał Bednarczyk,UM Łódź,91.90,190,200,207.5,207.5,155,162.5,-167.5,162.5,250,-255,,250,620,Seniorzy,Raw,SBD,
11,93,M,Paweł Zadrożny,UG Gdańsk,92.30,200,212.5,-217.5,212.5,150,-157.5,157.5,157.5,250,-275,-275,250,620,Seniorzy,Raw,SBD,
12,93,M,Maciej Wiśniewski,PG Gdańsk,93.00,195,207.5,215,215,155,160,-165,160,225,237.5,245,245,620,Seniorzy,Raw,SBD,
13,93,M,Mateusz Wójcik,AGH Kraków,90.90,210,220,225,225,145,152.5,157.5,157.5,235,-242.5,-242.5,235,617.5,Seniorzy,Raw,SBD,
14,93,M,Aleksander Cirocki,UMG Gdynia,92.40,200,215,225,225,150,-152.5,,150,220,235,-245,235,610,Seniorzy,Raw,SBD,
15,93,M,Bartosz Rogal,PK Kraków,92.50,200,205,210,210,145,-150,-150,145,250,255,-260,255,610,Seniorzy,Raw,SBD,
16,93,M,Konrad Serwa,PK Kraków,92.00,215,225,230,230,135,-142.5,142.5,142.5,235,-250,-250,235,607.5,Seniorzy,Raw,SBD,
17,93,M,Paweł Bujara,PŚ Gliwice,87.80,217.5,230,-240,230,115,-120,120,120,240,255,-275,255,605,Seniorzy,Raw,SBD,
18,93,M,Igor Szczurek,UMW Wrocław,88.70,220,230,240,240,110,115,-120,115,225,240,250,250,605,Seniorzy,Raw,SBD,
19,93,M,Piotr Szewczyk,UPr Lublin,92.40,200,207.5,212.5,212.5,150,155,157.5,157.5,220,230,235,235,605,Seniorzy,Raw,SBD,
20,93,M,Hubert Zając,AGH Kraków,91.90,210,-222.5,222.5,222.5,120,-125,,120,260,-270,-270,260,602.5,Seniorzy,Raw,SBD,
21,93,M,Wojciech Zawadzki,UM Łódź,84.20,210,220,225,225,115,120,122.5,122.5,230,240,252.5,252.5,600,Seniorzy,Raw,SBD,
22,93,M,Dawid Banach,PWr Wrocław,90.50,200,210,217.5,217.5,130,140,142.5,142.5,230,-240,240,240,600,Seniorzy,Raw,SBD,
23,93,M,Karol Brożyna,UW Warszawa,91.40,215,-220,220,220,115,125,130,130,240,250,-260,250,600,Seniorzy,Raw,SBD,
24,93,M,Karol Kozub,UwB Białystok,84.70,200,215,-230,215,115,-122.5,-122.5,115,230,250,260,260,590,Seniorzy,Raw,SBD,
25,93,M,Nikolaj Hegelstad,GUMed Gdańsk,91.50,207.5,217.5,225,225,120,-130,130,130,220,232.5,-240,232.5,587.5,Seniorzy,Raw,SBD,
26,93,M,Damian Szczygielski,PP Poznań,92.20,190,200,207.5,207.5,145,150,155,155,210,217.5,225,225,587.5,Seniorzy,Raw,SBD,
27,93,M,Remigiusz Zawada,UR Rzeszów,91.00,180,190,200,200,137.5,145,-150,145,225,240,-250,240,585,Seniorzy,Raw,SBD,
28,93,M,Jakub Winiarczyk,AMW Gdynia,88.90,180,190,200,200,160,-170,-170,160,210,220,-230,220,580,Seniorzy,Raw,SBD,
29,93,M,Filip Kulesza,WSEiT Poznań,91.10,185,195,200,200,145,150,-155,150,230,-240,-240,230,580,Seniorzy,Raw,SBD,
30,93,M,Konrad Nojszewski,PW Warszawa,92.40,200,-210,-210,200,142.5,150,-155,150,220,230,-235,230,580,Seniorzy,Raw,SBD,
31,93,M,Antoni Czuwara,UMW Wrocław,91.30,190,197.5,202.5,202.5,125,-130,130,130,235,245,-250,245,577.5,Seniorzy,Raw,SBD,
32,93,M,Klaudiusz Kwaśnik,SGH Warszawa,91.20,195,212.5,220,220,125,135,-140,135,195,210,220,220,575,Seniorzy,Raw,SBD,
33,93,M,Sebastian Burczak,PG Gdańsk,92.70,200,210,,210,135,140,-145,140,220,225,-232,225,575,Seniorzy,Raw,SBD,
34,93,M,Wojciech Łukasik,AWF w Krakowie,85.30,175,182.5,187.5,187.5,115,120,125,125,240,252.5,260,260,572.5,Seniorzy,Raw,SBD,
35,93,M,Szymon Warecki,UEK Kraków,88.90,200,210,-215,210,120,-127.5,-127.5,120,240,-250,-250,240,570,Seniorzy,Raw,SBD,
36,93,M,Szymon Dzięcioł,ŚUM Katowice,91.10,-195,-195,195,195,127.5,132.5,-135,132.5,230,240,-250,240,567.5,Seniorzy,Raw,SBD,
37,93,M,Filip Kowalczewski,PP Poznań,91.30,210,217.5,-222.5,217.5,137.5,145,-150,145,200,205,-210,205,567.5,Seniorzy,Raw,SBD,
38,93,M,Michał Szumański,PRz Rzeszów,89.80,190,202.5,-207.5,202.5,122.5,-127.5,-127.5,122.5,220,230,240,240,565,Seniorzy,Raw,SBD,
39,93,M,Marcin Dawidczyk,UWM Olsztyn,90.50,170,190,200,200,120,130,-132.5,130,220,235,-250,235,565,Seniorzy,Raw,SBD,
40,93,M,Hubert Skiepko,AWFiS Gdańsk,91.40,190,200,-205,200,117.5,122.5,-127.5,122.5,230,-242.5,242.5,242.5,565,Seniorzy,Raw,SBD,
41,93,M,Jakub Miotk,UMG Gdynia,90.90,180,190,-200,190,115,117.5,-120,117.5,230,240,250,250,557.5,Seniorzy,Raw,SBD,
42,93,M,Filip Szemraj,PŚk Kielce,88.60,190,200,-210,200,117.5,-122.5,-122.5,117.5,215,225,232.5,232.5,550,Seniorzy,Raw,SBD,
43,93,M,Bartosz Jamrożek,UJK Kielce,89.30,175,-190,200,200,115,125,-130,125,200,215,225,225,550,Seniorzy,Raw,SBD,
44,93,M,Franciszek Witosz,PŚ Gliwice,91.20,192.5,202.5,-210,202.5,-122.5,127.5,-132.5,127.5,-220,-220,220,220,550,Seniorzy,Raw,SBD,
45,93,M,Krzysztof Stefański,UMK Toruń,92.40,180,190,-195,190,130,140,-145,140,205,220,-230,220,550,Seniorzy,Raw,SBD,
46,93,M,Maksymilian Stach,AGH Kraków,90.70,180,190,197.5,197.5,120,127.5,-135,127.5,205,215,222.5,222.5,547.5,Seniorzy,Raw,SBD,
47,93,M,Jakub Jarczewski,UJ CM Kraków,88.30,192.5,200,205,205,120,-125,-125,120,220,-230,-230,220,545,Seniorzy,Raw,SBD,
48,93,M,Bartosz Załupski,PK Kraków,89.20,190,200,-207.5,200,120,-122.5,125,125,210,220,-225,220,545,Seniorzy,Raw,SBD,
49,93,M,Mateusz Dudzikowski,UPr Lublin,89.70,180,190,195,195,115,125,-130,125,225,-235,-235,225,545,Seniorzy,Raw,SBD,
50,93,M,Jakub Łada,WAT Warszawa,91.20,200,-210,-210,200,-130,-130,130,130,210,215,-220,215,545,Seniorzy,Raw,SBD,
51,93,M,Natan Matusiak,AWF Wrocław,92.10,190,-192.5,205,205,110,115,-117.5,115,205,217.5,225,225,545,Seniorzy,Raw,SBD,
52,93,M,Łukasz Kawa,PG Gdańsk,90.70,180,187.5,192.5,192.5,-120,120,125,125,-215,215,225,225,542.5,Seniorzy,Raw,SBD,
53,93,M,Konrad Milewicz,CW Legnica,84.30,180,190,-200,190,115,120,-125,120,220,230,-242.5,230,540,Seniorzy,Raw,SBD,
54,93,M,Karol Demel,ŚUM Katowice,91.70,187.5,200,-210,200,120,125,130,130,-205,-210,210,210,540,Seniorzy,Raw,SBD,
55,93,M,Patryk Barański,UJD Częstochowa,89.10,180,190,210,210,110,120,125,125,180,200,,200,535,Seniorzy,Raw,SBD,
56,93,M,Michał Wójcik,UR Rzeszów,91.50,160,170,180,180,127.5,135,-140,135,200,212.5,220,220,535,Seniorzy,Raw,SBD,
57,93,M,Jakub Bączek,AT Tarnów,89.80,170,180,-200,180,125,130,-140,130,200,220,-230,220,530,Seniorzy,Raw,SBD,
58,93,M,Mateusz Bladusiak,PBŚ Bydgoszcz,89.80,170,-180,190,190,120,130,-135,130,185,210,-225,210,530,Seniorzy,Raw,SBD,
59,93,M,Kajetan Janusz,UŁ Łódź,91.70,-170,177.5,187.5,187.5,120,-125,-125,120,200,210,220,220,527.5,Seniorzy,Raw,SBD,
60,93,M,Krystian Malek,AMW Gdynia,90.90,170,190,-202.5,190,120,-135,135,135,-200,200,-220,200,525,Seniorzy,Raw,SBD,
61,93,M,Kacper Kłaptocz,UO Opole,86.90,170,180,190,190,110,115,,115,190,205,215,215,520,Seniorzy,Raw,SBD,
62,93,M,Kamil Brania,UJ Kraków,90.80,175,182.5,190,190,-120,120,125,125,190,197.5,205,205,520,Seniorzy,Raw,SBD,
63,93,M,Tomasz Wojciechowski,ANS Konin,92.20,160,170,180,180,120,125,130,130,200,210,-220,210,520,Seniorzy,Raw,SBD,
64,93,M,Jakub Jakubczyk,PŚk Kielce,83.80,160,175,185,185,105,110,-115,110,-200,200,220,220,515,Seniorzy,Raw,SBD,
65,93,M,Szymon Łysik,UJ Kraków,92.80,185,195,-197.5,195,110,115,-120,115,205,-215,-215,205,515,Seniorzy,Raw,SBD,
66,93,M,Jakub Ciomcia,UR Rzeszów,91.80,170,177.5,185,185,117.5,-122.5,122.5,122.5,205,-212.5,-212.5,205,512.5,Seniorzy,Raw,SBD,
67,93,M,Nikodem Rudy,UJ CM Kraków,87.90,165,170,175,175,105,110,-115,110,225,-232.5,-232.5,225,510,Seniorzy,Raw,SBD,
68,93,M,Mateusz Krupa,PP Poznań,86.70,180,187.5,195,195,115,122.5,-127.5,122.5,175,182.5,190,190,507.5,Seniorzy,Raw,SBD,
69,93,M,Jan Kaiser,UMG Gdynia,89.30,170,180,-190,180,110,115,-120,115,190,200,210,210,505,Seniorzy,Raw,SBD,
70,93,M,Piotr Szarzyński,PWr Wrocław,91.40,160,175,190,190,105,-115,-115,105,-195,210,-220,210,505,Seniorzy,Raw,SBD,
71,93,M,Dominik Wachowski,UKW Bydgoszcz,86.70,150,160,172.5,172.5,115,-122.5,125,125,180,190,202.5,202.5,500,Seniorzy,Raw,SBD,
72,93,M,Robert Mileszczyk,UMCS Lublin,90.70,180,190,-200,190,95,100,-105,100,195,210,-220,210,500,Seniorzy,Raw,SBD,
73,93,M,Mateusz Sobiech,SGGW Warszawa,88.20,175,185,-192.5,185,105,-110,-110,105,190,200,205,205,495,Seniorzy,Raw,SBD,
74,93,M,Jakub Zygmuntowicz,PK Kraków,92.00,-180,180,-190,180,125,-130,130,130,170,185,-200,185,495,Seniorzy,Raw,SBD,
75,93,M,Michał Kosiński,PL Lublin,92.20,160,170,-185,170,115,-120,-120,115,-210,210,-215,210,495,Seniorzy,Raw,SBD,
76,93,M,Hubert Krok,PK Kraków,91.90,175,-190,-190,175,-120,127.5,132.5,132.5,175,185,-195,185,492.5,Seniorzy,Raw,SBD,
77,93,M,Kacper Pałka,UMCS Lublin,88.90,160,175,-185,175,115,125,-132.5,125,175,190,-200,190,490,Seniorzy,Raw,SBD,
78,93,M,Luka Tomic,GUMed Gdańsk,89.00,160,170,175,175,95,105,-112.5,105,200,210,-215,210,490,Seniorzy,Raw,SBD,
79,93,M,Oskar Makuch,UWM Olsztyn,89.70,140,150,165,165,110,115,120,120,190,205,-215,205,490,Seniorzy,Raw,SBD,
80,93,M,Przemysław Wilkos,KUL Lublin,88.30,145,155,162.5,162.5,105,112.5,-120,112.5,185,195,210,210,485,Seniorzy,Raw,SBD,
81,93,M,Miłosz Koźlicki,PP Poznań,90.30,150,160,165,165,115,120,-125,120,190,200,-215,200,485,Seniorzy,Raw,SBD,
82,93,M,Paweł Puczkowski,PBŚ Bydgoszcz,91.20,152.5,165,-170,165,-110,120,-122.5,120,175,190,200,200,485,Seniorzy,Raw,SBD,
83,93,M,Oleksandr Bretsko,AGH Kraków,91.90,165,180,-185,180,105,112.5,115,115,172.5,182.5,190,190,485,Seniorzy,Raw,SBD,
84,93,M,Bartosz Stefanowski,PŁ Łódź,89.70,160,170,175,175,95,100,-105,100,200,205,,205,480,Seniorzy,Raw,SBD,
85,93,M,Robert Brodzik,UPr Lublin,88.10,150,160,-170,160,120,125,-130,125,190,-202.5,-202.5,190,475,Seniorzy,Raw,SBD,
86,93,M,Szymon Sulak,PŁ Łódź,88.70,145,150,160,160,110,115,-120,115,180,190,200,200,475,Seniorzy,Raw,SBD,
87,93,M,Kacper Sulak,UMK Toruń,86.60,155,160,170,170,115,120,125,125,165,170,175,175,470,Seniorzy,Raw,SBD,
88,93,M,Adam Szulęcki,AGH Kraków,91.40,145,152.5,160,160,100,105,110,110,190,200,-210,200,470,Seniorzy,Raw,SBD,
89,93,M,Tymoteusz Rojewski,SGH Warszawa,89.80,155,165,172.5,172.5,97.5,102.5,105,105,165,177.5,190,190,467.5,Seniorzy,Raw,SBD,
90,93,M,Michał Bogusławski,PUM w Szczecinie,83.10,-150,155,165,165,110,115,-122.5,115,180,-190,,180,460,Seniorzy,Raw,SBD,
91,93,M,Alexander Stolarczyk,UM Łódź,85.20,135,145,150,150,110,120,-125,120,170,182.5,190,190,460,Seniorzy,Raw,SBD,
92,93,M,Tomasz Maciejczyk,ŚUM Katowice,86.50,175,185,-192.5,185,90,-92.5,-92.5,90,170,180,185,185,460,Seniorzy,Raw,SBD,
93,93,M,Hubert Sulżycki,PP Poznań,92.50,155,167.5,-180,167.5,110,-117.5,-117.5,110,165,175,-185,175,452.5,Seniorzy,Raw,SBD,
94,93,M,Zbigniew Markiewicz,PK Koszalin,86.90,150,170,-180,170,75,90,-95,90,155,172.5,187.5,187.5,447.5,Seniorzy,Raw,SBD,
95,93,M,Adam Rogowski,UJ Kraków,86.70,145,150,-160,150,85,90,-95,90,190,200,-210,200,440,Seniorzy,Raw,SBD,
96,93,M,Jakub Wrzosek,UMK Toruń,90.00,120,145,160,160,90,100,-110,100,-160,160,180,180,440,Seniorzy,Raw,SBD,
97,93,M,Piotr Zimmermann,UMK Toruń,89.50,140,150,-160,150,90,100,-110,100,170,180,-200,180,430,Seniorzy,Raw,SBD,
98,93,M,Jakub Chmiel,UO Opole,90.40,120,130,140,140,100,105,-110,105,160,170,180,180,425,Seniorzy,Raw,SBD,
99,93,M,Mateusz Poterek,ANS Leszno,88.00,130,140,-150,140,100,105,-110,105,140,150,155,155,400,Seniorzy,Raw,SBD,
100,93,M,Radosław Lisowski,UŚ Katowice,89.70,115,130,135,135,90,-100,-100,90,-160,160,175,175,400,Seniorzy,Raw,SBD,
101,93,M,Jonatan Kuncewicz,SGH Warszawa,92.60,110,-120,135,135,90,100,110,110,125,130,140,140,385,Seniorzy,Raw,SBD,
102,93,M,Wojciech Styrkowicz,PRz Rzeszów,88.50,110,115,120,120,-95,-95,95,95,-145,145,155,155,370,Seniorzy,Raw,SBD,
103,93,M,Jakub Mordarski,ŚUM Katowice,83.50,100,120,130,130,75,-85,90,90,100,130,145,145,365,Seniorzy,Raw,SBD,
104,93,M,Kamil Matuszewski,WSB Merito Poznań,90.10,100,115,130,130,-95,95,107.5,107.5,100,125,-142.5,125,362.5,Seniorzy,Raw,SBD,
105,93,M,Jakub Król,ŚUM Katowice,92.20,-120,120,-130,120,95,100,,100,-130,130,135,135,355,Seniorzy,Raw,SBD,
106,93,M,Bartłomiej Kępa,UMCS Lublin,91.00,-100,100,-125,100,90,100,102.5,102.5,130,140,-152.5,140,342.5,Seniorzy,Raw,SBD,
107,93,M,Wojciech Tokarczyk,ŚUM Katowice,86.90,90,100,,100,75,,,75,100,,,100,275,Seniorzy,Raw,SBD,
DQ,93,M,Bartłomiej Molga,GUMed Gdańsk,89.80,230,240,250,250,-150,-150,-150,,270,-285,-285,270,,Seniorzy,Raw,SBD,
DQ,93,M,Marek Kawczyk,UE Katowice,92.60,240,250,255,255,170,175,-180,175,-270,-270,-270,,,Seniorzy,Raw,SBD,
1,105,M,Daniel Jurkowski,AGH Kraków,102.70,260,270,277.5,277.5,180,185,,185,290,302.5,-305,302.5,765,Seniorzy,Raw,SBD,
2,105,M,Jakub Tempka,ŚUM Katowice,101.10,260,275,285,285,165,175,-182.5,175,280,300,-305,300,760,Seniorzy,Raw,SBD,
3,105,M,Łukasz Topór,PP Poznań,103.70,255,265,,265,190,195,200,200,280,-300,-300,280,745,Seniorzy,Raw,SBD,
4,105,M,Bartłomiej Bogdewicz,AWF w Krakowie,105.00,270,285,-293,285,160,167.5,-172.5,167.5,270,282.5,-295,282.5,735,Seniorzy,Raw,SBD,
5,105,M,Nathaniel Kaldahl-Miller,UJ CM Kraków,103.60,-160,190,210,210,130,-150,170,170,290,305,326,326,706,Seniorzy,Raw,SBD,
6,105,M,Patryk Zaniewski,PW Warszawa,104.60,255,262.5,-275,262.5,160,167.5,172.5,172.5,260,270,-275,270,705,Seniorzy,Raw,SBD,
7,105,M,Krystian Kopka,UWM Olsztyn,103.20,242.5,252.5,257.5,257.5,147.5,155,160,160,280,-300,,280,697.5,Seniorzy,Raw,SBD,
8,105,M,Beniamin Duda,UR Rzeszów,103.80,235,247.5,255,255,142.5,150,-157.5,150,270,287.5,-300,287.5,692.5,Seniorzy,Raw,SBD,
9,105,M,Damian Grecki,PK Kraków,103.00,240,-255,255,255,130,-135,,130,270,280,-292.5,280,665,Seniorzy,Raw,SBD,
10,105,M,Bartosz Pigułowski,WAT Warszawa,103.10,230,240,-250,240,140,147.5,-150,147.5,260,270,275,275,662.5,Seniorzy,Raw,SBD,
11,105,M,Dominik Kot,UJK Kielce,102.90,235,250,-260,250,135,142.5,-147.5,142.5,260,265,-270,265,657.5,Seniorzy,Raw,SBD,
12,105,M,Jakub Gąsak,UMCS Lublin,103.90,240,250,-255,250,130,135,140,140,257.5,-265,,257.5,647.5,Seniorzy,Raw,SBD,
13,105,M,Dominik Czestkowski,PŁ Łódź,100.40,225,237.5,250,250,150,-160,-160,150,245,-260,-270,245,645,Seniorzy,Raw,SBD,
14,105,M,Tomasz Dobras,PWr Wrocław,96.60,205,212.5,220,220,180,185,-190,185,220,235,-242.5,235,640,Seniorzy,Raw,SBD,
15,105,M,Kamil Nitecki,UJD Częstochowa,102.50,190,197.5,205,205,190,208.5,210,210,190,205,215,215,630,Seniorzy,Raw,SBD,
16,105,M,Jakub Kołyska,PW Warszawa,98.40,215,222.5,230,230,120,125,130,130,255,265,-270,265,625,Seniorzy,Raw,SBD,
17,105,M,Michał Śliwa,PRz Rzeszów,98.20,200,215,222.5,222.5,132.5,137.5,-140,137.5,230,250,-262.5,250,610,Seniorzy,Raw,SBD,
18,105,M,Hubert Nowakowski,PP Poznań,96.30,200,210,215,215,145,150,-155,150,215,230,240,240,605,Seniorzy,Raw,SBD,
19,105,M,Kacper Olszowy,AGH Kraków,95.10,205,222.5,230,230,120,125,-132.5,125,205,227.5,245,245,600,Seniorzy,Raw,SBD,
20,105,M,Mikołaj Wilczyński,UG Gdańsk,102.90,210,220,225,225,-130,130,-135,130,-225,235,-245,235,590,Seniorzy,Raw,SBD,
21,105,M,Miłosz Falarz,UŚ Katowice,103.80,180,190,207.5,207.5,135,140,-145,140,230,242.5,-252.5,242.5,590,Seniorzy,Raw,SBD,
22,105,M,Michał Zbiegień,PRz Rzeszów,101.00,205,215,-225,215,110,120,-125,120,230,250,-260,250,585,Seniorzy,Raw,SBD,
23,105,M,Jakub Tomaszewski,UJ CM Kraków,102.80,205,215,-225,215,137.5,142.5,-150,142.5,205,215,225,225,582.5,Seniorzy,Raw,SBD,
24,105,M,Aleksander Pasierb,PK Kraków,94.70,195,210,-220,210,140,145,-150,145,200,215,222.5,222.5,577.5,Seniorzy,Raw,SBD,
25,105,M,Kacper Kurys,PUM w Szczecinie,100.90,190,210,-220,210,125,132.5,137.5,137.5,-230,230,-250,230,577.5,Seniorzy,Raw,SBD,
26,105,M,Gabriel Borszowski,AT Tarnów,102.10,200,210,-217.5,210,112.5,120,,120,210,227.5,242.5,242.5,572.5,Seniorzy,Raw,SBD,
27,105,M,Maciej Płoskowicz,UG Gdańsk,102.00,205,-215,215,215,115,-120,-120,115,220,-230,235,235,565,Seniorzy,Raw,SBD,
28,105,M,Bartosz Sajniak,ANS Konin,103.20,180,195,210,210,-130,-130,130,130,210,220,-230,220,560,Seniorzy,Raw,SBD,
29,105,M,Dawid Sanecki,UMG Gdynia,96.80,170,180,190,190,135,-140,147.5,147.5,220,-235,-235,220,557.5,Seniorzy,Raw,SBD,
30,105,M,Jakub Fronczek,UG Gdańsk,102.10,185,197.5,205,205,102.5,107.5,112.5,112.5,230,240,-250,240,557.5,Seniorzy,Raw,SBD,
31,105,M,Damian Wędrocha,AGH Kraków,102.70,187.5,200,-210,200,117.5,125,-130,125,215,230,-240,230,555,Seniorzy,Raw,SBD,
32,105,M,Maciej Charzyński,UMG Gdynia,95.00,185,195,-207.5,195,127.5,-132.5,132.5,132.5,202.5,210,220,220,547.5,Seniorzy,Raw,SBD,
33,105,M,Szymon Szuścik,SWSM Katowice,96.10,200,210,215,215,100,105,-107.5,105,225,-235,-235,225,545,Seniorzy,Raw,SBD,
34,105,M,Kacper Piras,PŚk Kielce,96.30,185,200,-205,200,120,127.5,132.5,132.5,190,200,212.5,212.5,545,Seniorzy,Raw,SBD,
35,105,M,Mateusz Gawarkiewicz,UKW Bydgoszcz,97.40,-185,190,-200,190,115,125,-135,125,-225,230,-245,230,545,Seniorzy,Raw,SBD,
36,105,M,Patryk Jarząbek,UJK Kielce,99.90,185,195,202.5,202.5,115,-120,120,120,210,220,-225,220,542.5,Seniorzy,Raw,SBD,
37,105,M,Karol Zych,LAW Dęblin,97.50,160,170,177.5,177.5,125,132.5,-140,132.5,210,220,230,230,540,Seniorzy,Raw,SBD,
38,105,M,Wojciech Kalota,UJ Kraków,97.50,180,190,200,200,125,132.5,140,140,180,190,200,200,540,Seniorzy,Raw,SBD,
39,105,M,Jakub Panek #1,AT Tarnów,100.50,185,195,202.5,202.5,110,117.5,-120,117.5,190,205,217.5,217.5,537.5,Seniorzy,Raw,SBD,
40,105,M,Krzysztof Kędzia,UMCS Lublin,102.00,170,180,195,195,120,130,135,135,-185,185,200,200,530,Seniorzy,Raw,SBD,
41,105,M,Norbert Piątkowski,UMP Poznań,101.40,165,177.5,190,190,100,105,-110,105,210,-225,225,225,520,Seniorzy,Raw,SBD,
42,105,M,Damian Ławrynowicz,US Szczecin,102.00,162.5,170,-175,170,117.5,120,-125,120,212.5,220,230,230,520,Seniorzy,Raw,SBD,
43,105,M,Bartosz Smutek,AMW Gdynia,102.50,150,160,180,180,130,140,-155,140,180,200,-220,200,520,Seniorzy,Raw,SBD,
44,105,M,Wojciech Łużpiński,PP Poznań,102.90,-160,170,180,180,-120,130,-140,130,190,200,210,210,520,Seniorzy,Raw,SBD,
45,105,M,Piotr Twardowski,SGGW Warszawa,101.50,180,190,200,200,125,-130,-130,125,170,180,190,190,515,Seniorzy,Raw,SBD,
46,105,M,Wojciech Olejarz,PRz Rzeszów,101.40,-165,165,180,180,110,115,-120,115,187.5,205,215,215,510,Seniorzy,Raw,SBD,
47,105,M,Jakub Filiński,AT Tarnów,100.90,170,-185,185,185,105,-112.5,-115,105,180,190,210,210,500,Seniorzy,Raw,SBD,
48,105,M,Dawid Różański,CW Legnica,99.70,160,-170,-170,160,85,92.5,-100,92.5,220,235,-250,235,487.5,Seniorzy,Raw,SBD,
49,105,M,Przemysław Zabrocki,AMW Gdynia,103.00,-140,-140,140,140,130,140,-155,140,-170,170,190,190,470,Seniorzy,Raw,SBD,
50,105,M,Jakub Myjak,AWF Wrocław,102.10,160,170,175,175,95,100,,100,190,-192.5,,190,465,Seniorzy,Raw,SBD,
51,105,M,Jakub Gontarski,UEP Poznań,94.40,120,135,150,150,97.5,105,-115,105,190,-205,205,205,460,Seniorzy,Raw,SBD,
52,105,M,Piotr Daczkowski,KUL Lublin,95.90,125,135,142.5,142.5,-95,95,102.5,102.5,185,205,215,215,460,Seniorzy,Raw,SBD,
53,105,M,Adam Maciołek,KUL Lublin,98.90,145,155,165,165,105,112.5,-117.5,112.5,-180,180,-190,180,457.5,Seniorzy,Raw,SBD,
54,105,M,Mateusz Czyż,UO Opole,103.40,135,142.5,150,150,120,-135,-135,120,160,172.5,180,180,450,Seniorzy,Raw,SBD,
55,105,M,Miłosz Romecki,AHE Łódź,103.80,115,-122.5,122.5,122.5,65,-70,-70,65,130,140,150,150,337.5,Seniorzy,Raw,SBD,
56,105,M,Jakub Palian,ŚUM Katowice,96.00,95,-105,,95,95,-100,100,100,100,,,100,295,Seniorzy,Raw,SBD,
DQ,105,M,Krzysztof Stasiewicz,PP Poznań,100.10,105,,,105,-105,-105,-105,,,,,,,Seniorzy,Raw,SBD,
DQ,105,M,Jakub Jerzy Zaręba,ŚUM Katowice,97.70,-150,-150,-150,,-115,-120,-120,,-160,180,-200,180,,Seniorzy,Raw,SBD,
DQ,105,M,Jakub Zborowski,AGH Kraków,98.60,-150,-150,155,155,120,127.5,132.5,132.5,-195,-195,-195,,,Seniorzy,Raw,SBD,
DQ,105,M,Łukasz Kurpas,AWF Katowice,103.30,205,215,225,225,-147.5,-152.5,-152.5,,230,-245,255,255,,Seniorzy,Raw,SBD,
1,120,M,Szymon Borowy,PRz Rzeszów,118.00,245,260,-267.5,260,150,160,-165,160,285,302.5,-310,302.5,722.5,Seniorzy,Raw,SBD,
2,120,M,Miłosz Wróblewski,PG Gdańsk,114.00,255,262.5,267.5,267.5,155,160,,160,280,292.5,-302.5,292.5,720,Seniorzy,Raw,SBD,
3,120,M,Kacper Śpiewak,PW Warszawa,119.50,245,255,-260,255,155,162.5,165,165,280,290,-305,290,710,Seniorzy,Raw,SBD,
4,120,M,Jakub Pałachniak,PŚ Gliwice,115.70,270,-285,-285,270,-170,170,-175,170,-240,-240,240,240,680,Seniorzy,Raw,SBD,
5,120,M,Bartłomiej Cieciura,WAT Warszawa,112.20,205,215,225,225,167.5,175,-180,175,245,260,270,270,670,Seniorzy,Raw,SBD,
6,120,M,Kacper Liwiński,PG Gdańsk,114.70,220,240,-250,240,130,135,-140,135,250,270,280,280,655,Seniorzy,Raw,SBD,
7,120,M,Dominik Dźwigała,UM Łódź,117.20,215,230,240,240,145,152.5,-160,152.5,245,255,262.5,262.5,655,Seniorzy,Raw,SBD,
8,120,M,Grzegorz Brodziński,WSB Merito Poznań,115.70,195,207.5,220,220,130,137.5,142.5,142.5,245,257.5,270,270,632.5,Seniorzy,Raw,SBD,
9,120,M,Karol Drozdowski,PWr Wrocław,110.00,200,215,225,225,115,122.5,127.5,127.5,235,255,275,275,627.5,Seniorzy,Raw,SBD,
10,120,M,Jakub Szczur,AGH Kraków,111.00,210,-225,232.5,232.5,142.5,-150,-150,142.5,230,245,-265,245,620,Seniorzy,Raw,SBD,
11,120,M,Filip Kruszewski,ŚUM Katowice,109.10,-210,215,225,225,120,127.5,-132.5,127.5,-240,-250,250,250,602.5,Seniorzy,Raw,SBD,
12,120,M,Maksymilian Słowikowski,PW Warszawa,106.60,205,212.5,-220,212.5,142.5,150,157.5,157.5,205,215,-220,215,585,Seniorzy,Raw,SBD,
13,120,M,Adam Sawczak,PRz Rzeszów,112.70,-200,200,-215,200,145,-152.5,-152.5,145,220,237.5,-245,237.5,582.5,Seniorzy,Raw,SBD,
14,120,M,Radosław Wójciak,PK Kraków,109.50,190,200,210,210,120,-130,130,130,225,235,240,240,580,Seniorzy,Raw,SBD,
15,120,M,Ernest Maciejczak,AWF Gorzów Wlkp.,110.00,160,180,-192.5,180,140,-160,-160,140,190,205,215,215,535,Seniorzy,Raw,SBD,
16,120,M,Kacper Szczepaniak,UPr Lublin,118.80,170,-180,180,180,130,135,-140,135,190,200,-207.5,200,515,Seniorzy,Raw,SBD,
17,120,M,Wiktor Krakowski,PP Poznań,108.70,160,170,-177.5,170,120,132.5,-142.5,132.5,210,-212.5,,210,512.5,Seniorzy,Raw,SBD,
18,120,M,Łukasz Gewont,UJ CM Kraków,111.90,160,-172.5,175,175,115,122.5,-127.5,122.5,205,-220,-220,205,502.5,Seniorzy,Raw,SBD,
19,120,M,Filip Kowalski,UMG Gdynia,115.70,180,190,-200,190,80,90,-100,90,180,190,200,200,480,Seniorzy,Raw,SBD,
20,120,M,Nikodem Beberok,PP Poznań,118.10,150,-160,175,175,90,-105,-110,90,-170,180,-190,180,445,Seniorzy,Raw,SBD,
21,120,M,Mateusz Guz,UŁ Łódź,112.60,-140,140,150,150,90,97.5,105,105,162.5,170,175,175,430,Seniorzy,Raw,SBD,
DQ,120,M,Jan Szopa,UG Gdańsk,108.40,-180,-190,-190,,130,137.5,-142.5,137.5,240,255,-265,255,,Seniorzy,Raw,SBD,
1,120+,M,Bartłomiej Tuszyński,AWF Warszawa,167.00,305,320,330,330,170,177.5,182.5,182.5,270,287.5,-305,287.5,800,Seniorzy,Raw,SBD,
2,120+,M,Adrian Kasprzycki,AWFiS Gdańsk,134.90,240,255,270,270,200,210,220,220,250,265,280,280,770,Seniorzy,Raw,SBD,
3,120+,M,Jakub Liszcz,PWr Wrocław,131.40,260,275,282.5,282.5,167.5,172.5,177.5,177.5,275,290,-302.5,290,750,Seniorzy,Raw,SBD,
4,120+,M,Wiktor Hoffer,UWM Olsztyn,134.60,250,270,280,280,135,142.5,147.5,147.5,280,295,-310,295,722.5,Seniorzy,Raw,SBD,
5,120+,M,Maciej Soból,UWM Olsztyn,147.70,250,265,280,280,140,-150,-150,140,260,280,-290,280,700,Seniorzy,Raw,SBD,
6,120+,M,Paweł Regiewicz,UŚ Katowice,121.10,227.5,235,-242.5,235,122.5,127.5,-130,127.5,250,265,-270,265,627.5,Seniorzy,Raw,SBD,
7,120+,M,Dawid Rusin,AGH Kraków,130.40,235,-250,-250,235,127.5,132.5,-135,132.5,220,235,250,250,617.5,Seniorzy,Raw,SBD,
8,120+,M,Jakub Węcławik,SGGW Warszawa,124.40,200,215,225,225,130,-140,-140,130,240,245,250,250,605,Seniorzy,Raw,SBD,
9,120+,M,Mateusz Krzystanek,AHE Łódź,144.60,-170,-185,185,185,97.5,102.5,105,105,180,190,200,200,490,Seniorzy,Raw,SBD,
10,120+,M,Marcin Kucz,UJ Kraków,136.80,180,192.5,200,200,130,142.5,150,150,100,,,100,450,Seniorzy,Raw,SBD,
DQ,120+,M,Dominik Kulasik,UWM Olsztyn,147.80,240,-260,-260,240,145,152.5,-160,152.5,-250,-257.5,-257.5,,,Seniorzy,Raw,SBD,
