Division,WeightClassKg,Place,Name,Team,BodyweightKg,Best3SquatKg,Best3BenchKg,Best3DeadliftKg,TotalKg,Equipment,Event,Sex
Boys,51.71,1,Michael Vargas #4,Beaumont West Brook,48.53,113.4,56.7,117.93,288.03,Single-ply,SBD,M
Boys,51.71,2,Christian Cruz,Newton,45.72,74.84,36.29,102.06,213.19,Single-ply,SBD,M
Boys,51.71,3,Brandon Sarver,Buna,51.44,86.18,36.29,86.18,208.65,Single-ply,SBD,M
Boys,55.79,1,Seth Sanders,Shelbyville,55.7,142.88,72.57,145.15,360.61,Single-ply,SBD,M
Boys,55.79,2,Mykal Vera,Corrigan-Camden,53.52,140.61,65.77,133.81,340.19,Single-ply,SBD,M
Boys,55.79,3,Coy Pellerin,Buna,55.7,97.52,56.7,106.59,260.82,Single-ply,SBD,M
Boys,55.79,DQ,Gabe Hawver,Hemphill,52.07,,,,,Single-ply,SBD,M
Boys,59.87,1,Jordan Foxworth,Woodville,58.24,149.69,92.99,154.22,396.89,Single-ply,SBD,M
Boys,59.87,2,Ke'Tavion Hadnot,Newton,57.7,138.35,74.84,149.69,362.87,Single-ply,SBD,M
Boys,59.87,3,Dewayne Stevens,Buna,58.97,127.01,72.57,149.69,349.27,Single-ply,SBD,M
Boys,59.87,4,Evan Salazar,Cleveland,56.79,117.93,74.84,142.88,335.66,Single-ply,SBD,M
Boys,59.87,5,Colton Spell,Buna,56.15,97.52,58.97,102.06,258.55,Single-ply,SBD,M
Boys,59.87,DQ,Roger Whittley,Beaumont Central,59.87,,,,,Single-ply,SBD,M
Boys,67.13,1,Emmanuel Walker,Corrigan-Camden,65.32,208.65,102.06,226.8,537.51,Single-ply,SBD,M
Boys,67.13,2,DeMarcus Coleman,Beaumont West Brook,66.86,204.12,108.86,183.7,496.68,Single-ply,SBD,M
Boys,67.13,3,Joseph Tarver,Joaquin,60.42,181.44,111.13,142.88,435.45,Single-ply,SBD,M
Boys,67.13,4,Edwin Uribe,Cleveland,65.95,142.88,97.52,154.22,394.63,Single-ply,SBD,M
Boys,67.13,5,Michael Jackson,Buna,67.13,136.08,86.18,147.42,369.68,Single-ply,SBD,M
Boys,67.13,6,Izaiah Miller,Buna,64.95,117.93,88.45,124.74,331.12,Single-ply,SBD,M
Boys,74.84,1,Eric Perez,Cleveland,67.95,206.38,111.13,229.06,546.58,Single-ply,SBD,M
Boys,74.84,2,Jacobi Jackson,Shelbyville,68.67,192.78,95.25,183.7,471.74,Single-ply,SBD,M
Boys,74.84,3,Christian Randell,Cleveland,73.75,188.24,111.13,165.56,464.93,Single-ply,SBD,M
Boys,74.84,4,Kobi Poage,Corrigan-Camden,70.58,161.03,102.06,172.37,435.45,Single-ply,SBD,M
Boys,74.84,5,Tedrick Bogany,Cleveland,69.13,142.88,88.45,183.7,415.04,Single-ply,SBD,M
Boys,74.84,6,Gustavo Heredia,Corrigan-Camden,68.13,149.69,86.18,145.15,381.02,Single-ply,SBD,M
Boys,74.84,7,Christian Burns,Hemphill,70.49,142.88,70.31,149.69,362.87,Single-ply,SBD,M
Boys,74.84,8,David Rauwerda,Buna,69.31,102.06,72.57,129.27,303.91,Single-ply,SBD,M
Boys,82.1,1,Kristian Paulette,Newton,81.92,208.65,133.81,226.8,569.26,Single-ply,SBD,M
Boys,82.1,2,Fabian Bogany,Cleveland,81.74,188.24,92.99,215.46,496.68,Single-ply,SBD,M
Boys,82.1,3,Ian Shahan,Joaquin,82.01,188.24,111.13,183.7,483.08,Single-ply,SBD,M
Boys,82.1,4,Chris McClain,Cleveland,81.01,183.7,104.33,190.51,478.54,Single-ply,SBD,M
Boys,82.1,5,Jesus Bravo,Joaquin,81.1,181.44,108.86,170.1,460.4,Single-ply,SBD,M
Boys,82.1,6,Mark Davis,Buna,81.28,172.37,104.33,176.9,453.59,Single-ply,SBD,M
Boys,82.1,7,Trevor Jackson #3,Shelbyville,78.83,161.03,104.33,181.44,446.79,Single-ply,SBD,M
Boys,89.81,1,Austin Cartwright,Cleveland,88.81,258.55,136.08,251.74,646.37,Single-ply,SBD,M
Boys,89.81,2,Richard Garza,Beaumont West Brook,87.54,208.65,147.42,215.46,571.53,Single-ply,SBD,M
Boys,89.81,3,Alan Casper,Corrigan-Camden,83.64,222.26,113.4,233.6,569.26,Single-ply,SBD,M
Boys,89.81,4,Jaylon Hunt,Corrigan-Camden,86,206.38,117.93,208.65,532.97,Single-ply,SBD,M
Boys,89.81,5,Jadrian McGraw,Newton,84.19,183.7,129.27,204.12,517.1,Single-ply,SBD,M
Boys,89.81,6,Jose Sanchez,Cleveland,88.36,197.31,117.93,199.58,514.83,Single-ply,SBD,M
Boys,89.81,7,Ty Graffeo,Hemphill,85.73,136.08,111.13,181.44,428.64,Single-ply,SBD,M
Boys,89.81,8,Jordan Malvo,Beaumont Central,89.72,163.29,92.99,165.56,421.84,Single-ply,SBD,M
Boys,89.81,9,Logan Carlton,Buna,85.73,136.08,99.79,154.22,390.09,Single-ply,SBD,M
Boys,89.81,DQ,Garrett Franks,Newton,88.45,120.2,,,,Single-ply,SBD,M
Boys,99.79,1,Makoyee Franks,Newton,92.17,185.97,106.59,213.19,505.76,Single-ply,SBD,M
Boys,99.79,2,Kade Elliott,Corrigan-Camden,90.81,188.24,102.06,190.51,480.81,Single-ply,SBD,M
Boys,99.79,3,Alberto Castillo,Shelbyville,99.79,181.44,92.99,165.56,439.98,Single-ply,SBD,M
Boys,99.79,4,Cole Casper,Corrigan-Camden,92.53,147.42,83.91,174.63,405.97,Single-ply,SBD,M
Boys,99.79,5,Gage Watlington,Joaquin,97.98,136.08,90.72,136.08,362.87,Single-ply,SBD,M
Boys,99.79,DQ,Braylon Simmons,Hemphill,99.43,,,,,Single-ply,SBD,M
Boys,99.79,DQ,Jaime Morales,Cleveland,92.17,274.42,142.88,,,Single-ply,SBD,M
Boys,109.77,1,Evander Williams,Newton,104.33,254.01,136.08,260.82,650.91,Single-ply,SBD,M
Boys,109.77,2,Marcos Hernandez,Cleveland,100.79,210.92,120.2,215.46,546.58,Single-ply,SBD,M
Boys,109.77,3,Frederick Herring,Beaumont Central,108.14,192.78,133.81,181.44,508.02,Single-ply,SBD,M
Boys,109.77,4,Donovan Forward,Newton,102.6,185.97,113.4,188.24,487.61,Single-ply,SBD,M
Boys,109.77,5,Orlando Ramirez,Corrigan-Camden,106.23,204.12,77.11,165.56,446.79,Single-ply,SBD,M
Boys,109.77,6,TreDerrick Simmons,Corrigan-Camden,106.68,165.56,83.91,190.51,439.98,Single-ply,SBD,M
Boys,109.77,7,Malik Wilkerson,Hemphill,102.15,147.42,99.79,172.37,419.57,Single-ply,SBD,M
Boys,109.77,8,Billy Davis,Hemphill,102.51,170.1,92.99,154.22,417.3,Single-ply,SBD,M
Boys,109.77,9,Lance Collins #2,Hemphill,105.05,145.15,92.99,163.29,401.43,Single-ply,SBD,M
Boys,109.77,DQ,Titus Harvey,Joaquin,105.96,181.44,,,,Single-ply,SBD,M
Boys,109.77,DQ,Logan Vickers,Hemphill,103.69,190.51,,,,Single-ply,SBD,M
Boys,124.74,1,Kawon McCowin,Shelbyville,123.1,272.16,174.63,260.82,707.6,Single-ply,SBD,M
Boys,124.74,2,Patrick Davis,Newton,111.04,256.28,136.08,217.72,610.08,Single-ply,SBD,M
Boys,124.74,3,Tristan Cuevas,Corrigan-Camden,122.74,217.72,122.47,204.12,544.31,Single-ply,SBD,M
Boys,124.74+,1,Zach Bell,Joaquin,150.86,294.84,185.97,226.8,707.6,Single-ply,SBD,M
Boys,124.74+,2,Yavin Shankle,Newton,142.07,233.6,136.08,226.8,596.47,Single-ply,SBD,M
Boys,124.74+,3,Richard Bronson,Kirbyville,128.37,183.7,97.52,188.24,469.47,Single-ply,SBD,M
Boys,124.74+,DQ,Seth Fabela,Woodville,139.71,,,,,Single-ply,SBD,M
Boys,124.74+,DQ,Kendall Major,Beaumont West Brook,131.45,,,,,Single-ply,SBD,M
