Place,Name,Sex,BirthDate,BirthYear,Age,Country,State,Equipment,Division,BodyweightKg,WeightClassKg,Squat1Kg,Squat2Kg,Squat3Kg,Best3SquatKg,Bench1Kg,Bench2Kg,Bench3Kg,Best3BenchKg,Deadlift1Kg,Deadlift2Kg,Deadlift3Kg,Best3DeadliftKg,TotalKg,Event
4,Barry Patchett,M,,1945,79,New Zealand,,Raw,Masters 4,73.25,74,-110,110,-112.5,110,80,85,90,90,130,135,-140,135,335,SBD
2,Dan Oppenheim,M,,1945,79,South Africa,,Raw,Masters 4,79.3,83,125,135,140,140,85,90,95,95,160,170,,170,405,SBD
1,John Terragni,M,,1947,77,Denmark,,Raw,Masters 4,72.1,74,150,157.5,160,160,105,110,115,115,165,175,185,185,460,SBD
1,Manuel Rodriguez #1,M,,1949,75,USA,,Raw,Masters 4,64.95,66,135,140,145,145,85,90,92.5,92.5,185,190,195,195,432.5,SBD
2,Dale Garlitz,M,,1950,74,USA,,Raw,Masters 4,71,74,155,160,-167.5,160,97.5,102.5,105,105,175,182.5,-195,182.5,447.5,SBD
1,Sæmundur Guðmundsson,M,,1952,72,Iceland,,Raw,Masters 4,81.2,83,140,150,160,160,85,90,97.5,97.5,170,180,190,190,447.5,SBD
3,Guenter Runniger,M,,1952,72,Germany,,Raw,Masters 4,73.3,74,130,135,140,140,82.5,87.5,-92.5,87.5,172.5,185,-190,185,412.5,SBD
1,Robert Moore #13,M,,1953,71,USA,,Raw,Masters 4,88.8,93,165,-172.5,172.5,172.5,125,130,132.5,132.5,170,182.5,185,185,490,SBD
2,Josef Weiß,M,,1954,70,Germany,,Raw,Masters 4,86.75,93,90,97.5,105,105,50,57.5,62.5,62.5,140,150,-167,150,317.5,SBD
1,Arnold Leesemann,M,,1954,70,Germany,,Raw,Masters 4,101.8,105,150,160,165,165,120,125,-130,125,-220,220,235.5,235.5,525.5,SBD
2,Flosi Jónsson,M,,1954,70,Iceland,,Raw,Masters 4,99.9,105,120,-145,150,150,-120,120,-125,120,175,-190,190,190,460,SBD
2,Kevin Strachan,M,,1954,70,New Zealand,,Raw,Masters 4,65.5,66,122.5,125,127.5,127.5,67.5,72.5,75,75,-145,150,-165,150,352.5,SBD
2,Carlos Lewis,M,,1958,66,USA,,Raw,Masters 3,73.55,74,182.5,192.5,200,200,122.5,127.5,130,130,190,205,-217.5,205,535,SBD
7,Charles Ley,M,,1958,66,Canada,,Raw,Masters 3,76.2,83,137.5,142.5,147.5,147.5,77.5,-82.5,-82.5,77.5,160,167.5,175,175,400,SBD
4,Hordur Birkirsson,M,,1958,66,Iceland,,Raw,Masters 3,73.15,74,165,175,-182.5,175,-90,95,-100,95,175,185,195,195,465,SBD
2,Shoichi Watanabe,M,,1958,66,Japan,,Raw,Masters 3,65.1,66,172.5,182.5,-187.5,182.5,110,115,-117.5,115,172.5,-185,-185,172.5,470,SBD
4,Ronald Kilpatrick,M,,1959,65,Canada,,Raw,Masters 3,102.75,105,222.5,230,235,235,107.5,112.5,115,115,222.5,230,-240,230,580,SBD
3,Ladislav Horny,M,,1959,65,Slovakia,,Raw,Masters 3,104.55,105,197.5,207.5,215,215,140,145,-150,145,210,220,230,230,590,SBD
1,David Ricks,M,,1959,65,US Virgin Islands,,Raw,Masters 3,91.8,93,240,275,295,295,182.5,192.5,-206,192.5,235,-260,260,260,747.5,SBD
5,Larry Nash,M,,1960,64,USA,,Raw,Masters 3,79.3,83,172.5,180,187.5,187.5,127.5,135,137.5,137.5,205,-210,-210,205,530,SBD
DQ,Norman Tepa Sr,M,,1960,64,New Zealand,,Raw,Masters 3,89.05,93,-195,-195,-195,-195,115,120,125,125,202.5,212.5,217.5,217.5,,SBD
6,James Fitzgerald,M,,1960,64,Ireland,,Raw,Masters 3,73.55,74,135,145,-150,145,97.5,105,107.5,107.5,160,170,172.5,172.5,425,SBD
5,Daniel Jouannic,M,,1960,64,France,,Raw,Masters 3,73.45,74,150,160,165,165,95,-100,-100,95,170,180,-185,180,440,SBD
1,Rick Lewis #1,M,,1960,64,Australia,,Raw,Masters 3,134.5,120+,255,270,-275,270,140,147.5,150,150,265,280,292.5,292.5,712.5,SBD
4,Clifford MacDuff,M,,1961,63,UK,,Raw,Masters 3,90.4,93,187.5,-195,200,200,115,120,125,125,-220,225,232.5,232.5,557.5,SBD
3,Harri Hagfors,M,,1961,63,Finland,,Raw,Masters 3,92.7,93,185,192.5,197.5,197.5,110,115,117.5,117.5,225,-235,245,245,560,SBD
5,Abbas Pordel,M,,1961,63,Australia,,Raw,Masters 3,117.05,120,165,172.5,180,180,165,177.5,-180,177.5,185,205,-222.5,205,562.5,SBD
3,Geoffrey Holmes,M,,1961,63,New Zealand,,Raw,Masters 3,139.05,120+,205,-215,215,215,105,110,115,115,205,220,230,230,560,SBD
2,Bob Sadler,M,,1962,62,UK,,Raw,Masters 3,129.6,120+,202.5,212.5,217.5,217.5,70,100,110,110,220,230,232.5,232.5,560,SBD
3,Stephen Varady,M,,1962,62,Australia,,Raw,Masters 3,82.5,83,-170,170,177.5,177.5,145,151,-152,151,205,-220,-220,205,533.5,SBD
2,Grant Sugarman,M,,1962,62,UK,,Raw,Masters 3,81.4,83,170,-182.5,182.5,182.5,110,115,-117.5,115,225,245,-250,245,542.5,SBD
3,Ireneusz Franusik,M,,1963,61,Poland,,Raw,Masters 3,65.45,66,145,-155,155,155,80,90,100,100,160,170,-175,170,425,SBD
8,Tommie de Nysschen,M,,1963,61,South Africa,,Raw,Masters 3,82.75,83,140,,,140,142.5,145,-151.5,145,100,,,100,385,SBD
6,John Fitzgerald,M,,1963,61,Australia,,Raw,Masters 3,102,105,145,-155,155,155,117.5,122.5,125,125,172.5,185,192.5,192.5,472.5,SBD
2,Sterling Nering,M,,1963,61,Canada,,Raw,Masters 3,103.65,105,210,220,225,225,155,162.5,165,165,230,240,250,250,640,SBD
6,Claude St-Hilaire,M,,1963,61,Canada,,Raw,Masters 3,80.6,83,155,-162.5,-162.5,155,110,115,-117.5,115,172.5,185,190,190,460,SBD
7,Richard Carni,M,,1963,61,USA,,Raw,Masters 3,73.6,74,120,125,-135,125,90,95,100,100,137.5,145,150,150,375,SBD
3,Jean-Claude Pinat,M,,1963,61,France,,Raw,Masters 3,116.9,120,-200,200,210,210,120,130,140,140,240,250,255,255,605,SBD
2,Ronny Andersen,M,,1964,60,Norway,,Raw,Masters 3,119.1,120,205,215,-220,215,160,167.5,170,170,240,250,257.5,257.5,642.5,SBD
1,Carlos Burgos,M,,1964,60,Argentina,,Raw,Masters 3,73.1,74,170,182.5,-190,182.5,110,120,125,125,220,238,252,252,559.5,SBD
1,David Gray #1,M,,1964,60,UK,,Raw,Masters 3,64.45,66,160,170,175,175,107.5,112.5,115,115,210,220,227.5,227.5,517.5,SBD
6,Mark Magnuson,M,,1964,60,Canada,,Raw,Masters 3,115.25,120,155,167.5,175,175,117.5,122.5,127.5,127.5,202.5,212.5,-220,212.5,515,SBD
1,Eric Dumas,M,,1964,60,Australia,,Raw,Masters 3,96,105,232.5,245,252.5,252.5,125,130,132.5,132.5,232.5,242.5,255,255,640,SBD
2,Robert Rodney,M,,1964,60,UK,,Raw,Masters 3,86.6,93,155,165,,165,125,132.5,-135,132.5,240,270,-290,270,567.5,SBD
4,Hugo Agostino,M,,1964,60,Argentina,,Raw,Masters 3,82.25,83,180,192.5,-200,192.5,107.5,117.5,122.5,122.5,200,215,217.5,217.5,532.5,SBD
4,Voitto Riihimäki,M,,1964,60,Sweden,,Raw,Masters 3,126.55,120+,175,185,-190,185,100,110,-115,110,215,225,230,230,525,SBD
1,Harold Veilleux,M,,1964,60,Canada,,Raw,Masters 3,116.8,120,245,257.5,269.5,269.5,152.5,160,167.5,167.5,245,262.5,-281.5,262.5,699.5,SBD
1,Irving Harris,M,,1964,60,Nauru,,Raw,Masters 3,82.35,83,205,215,222.5,222.5,110,120,125,125,205,215,225,225,572.5,SBD
4,David Charnock,M,,1964,60,UK,,Raw,Masters 3,113.75,120,195,210,225,225,125,132.5,137.5,137.5,210,222.5,-237.5,222.5,585,SBD
4,David Hrynkow,M,,1964,60,Canada,,Raw,Masters 3,65.35,66,115,120,,120,82.5,87.5,90,90,170,182.5,-187.5,182.5,392.5,SBD
1,Tomoyoshi Shiiki,M,,1964,60,Japan,,Raw,Masters 3,58.6,59,-130,130,-140,130,107.5,112.5,-118,112.5,-140,140,150,150,392.5,SBD
3,Ian Hacker,M,,1964,60,South Africa,,Raw,Masters 3,73.05,74,190,200,205,205,105,110,115,115,185,200,205,205,525,SBD
4,Garmez Parks,M,,1965,59,US Virgin Islands,,Raw,Masters 2,112.35,120,207.5,215,232.5,232.5,150,157.5,162.5,162.5,240,255,265,265,660,SBD
11,Andrew Robertson,M,,1965,59,Singapore,,Raw,Masters 2,91.55,93,152.5,-162.5,170,170,115,-120,120,120,190,205,210,210,500,SBD
7,Denis Bensch,M,,1965,59,South Africa,,Raw,Masters 2,118,120,-220,220,245,245,135,-145,-145,135,220,240,-250,240,620,SBD
8,Alan Ridgard,M,,1966,58,South Africa,,Raw,Masters 2,92.1,93,185,197.5,202.5,202.5,105,112.5,120,120,200,220,230,230,552.5,SBD
2,Eric Kupperstein,M,,1966,58,USA,,Raw,Masters 2,58.35,59,145,-152.5,155,155,55,57.5,60,60,192.5,-202.5,-212.5,192.5,407.5,SBD
9,Chad Anderson,M,,1966,58,New Zealand,,Raw,Masters 2,91.8,93,180,185,190,190,112.5,117.5,-122.5,117.5,207.5,217.5,-227.5,217.5,525,SBD
DQ,Oscar Aristi,M,,1966,58,Argentina,,Raw,Masters 2,90.3,93,180,190,200,200,-125,-125,-125,-125,195,205,-212.5,205,,SBD
4,Terje Myrvold,M,,1967,57,Norway,,Raw,Masters 2,65.65,66,120,130,135,135,90,97.5,100,100,145,160,165,165,400,SBD
5,Frédéric Spitz,M,,1967,57,France,,Raw,Masters 2,113.45,120,-235,235,-250,235,145,150,-152.5,150,245,265,-277.5,265,650,SBD
1,Shaun Bateman,M,,1967,57,UK,,Raw,Masters 2,58.2,59,125,135,140,140,90,95,100,100,175,185,-190,185,425,SBD
6,Derek Hayden,M,,1968,56,South Africa,,Raw,Masters 2,103.1,105,150,170,180,180,110,117.5,-122.5,117.5,160,182.5,202.5,202.5,500,SBD
3,Nicolás Urioste,M,,1968,56,Uruguay,,Raw,Masters 2,104.7,105,232.5,245,-250,245,160,165,167.5,167.5,240,247.5,252.5,252.5,665,SBD
3,Alejandro Rodríguez Acuña,M,,1968,56,Spain,,Raw,Masters 2,91.85,93,230,240,245,245,160,165,167.5,167.5,235,245,-260,245,657.5,SBD
1,Frode Rui,M,,1969,55,Norway,,Raw,Masters 2,123.55,120+,260,272.5,282.5,282.5,170,175,-177.5,175,300,321,325.5,325.5,783,SBD
3,Roger Rogers,M,,1969,55,Guyana,,Raw,Masters 2,116.4,120,245,-260,260,260,157.5,162.5,-175,162.5,225,240,-260,240,662.5,SBD
1,Rick Brink,M,,1969,55,USA,,Raw,Masters 2,65.5,66,175,182.5,187.5,187.5,97.5,102.5,107.5,107.5,207.5,220,227.5,227.5,522.5,SBD
5,Les Laban,M,,1969,55,New Zealand,,Raw,Masters 2,104.5,105,210,222.5,-227.5,222.5,132.5,137.5,140,140,245,260,-265,260,622.5,SBD
8,John Crain,M,,1969,55,South Africa,,Raw,Masters 2,127.3,120+,205,,,205,170,177.5,-180,177.5,225,252.5,260,260,642.5,SBD
13,Mark du Plessis,M,,1970,54,Singapore,,Raw,Masters 2,82.95,83,-172.5,172.5,187.5,187.5,92.5,97.5,102.5,102.5,-200,-205,205,205,495,SBD
6,Hermanus de Beer,M,,1970,54,South Africa,,Raw,Masters 2,114,120,185,200,215,215,145,150,152.5,152.5,245,265,-280,265,632.5,SBD
5,Tetsuo Koike,M,,1970,54,Singapore,,Raw,Masters 2,72.65,74,165,-175,-175,165,122.5,127.5,132.5,132.5,200,215,-225,215,512.5,SBD
2,Darren Greville,M,,1970,54,UK,,Raw,Masters 2,119.8,120,227.5,242.5,255,255,160,170,-172.5,170,227.5,245,257.5,257.5,682.5,SBD
2,Jeff Butt,M,,1970,54,Canada,,Raw,Masters 2,92.35,93,235,245,252.5,252.5,135,-137.5,-137.5,135,260,275,-287.5,275,662.5,SBD
5,Jonathan Pye,M,,1970,54,New Zealand,,Raw,Masters 2,142.45,120+,-252.5,-252.5,252.5,252.5,147.5,155,-160,155,240,255,262.5,262.5,670,SBD
3,Andy Liddle,M,,1970,54,UK,,Raw,Masters 2,58.9,59,110,120,122.5,122.5,77.5,82.5,-85,82.5,145,157.5,-165,157.5,362.5,SBD
3,Robert Fuller,M,,1970,54,Puerto Rico,,Raw,Masters 2,138.4,120+,237.5,250,257.5,257.5,157.5,167.5,-170,167.5,252.5,267.5,277.5,277.5,702.5,SBD
5,Danny Horth,M,,1970,54,Canada,,Raw,Masters 2,90.7,93,215,-225,-225,215,142.5,152.5,-160,152.5,235,242.5,-245,242.5,610,SBD
6,Johny Paelinck,M,,1970,54,Belgium,,Raw,Masters 2,70.2,74,175,187.5,-190,187.5,100,105,-110,105,190,200,-207.5,200,492.5,SBD
2,Riad Sollien,M,,1970,54,Norway,,Raw,Masters 2,145.3,120+,250,265,275,275,162.5,170,-172.5,170,270,290,-305,290,735,SBD
2,Michael McQueen,M,,1971,53,USA,,Raw,Masters 2,101.05,105,230,240,250,250,170,177.5,-180,177.5,260,270,275,275,702.5,SBD
1,Robert Lane #1,M,,1971,53,USA,,Raw,Masters 2,73.4,74,175,185,192.5,192.5,127.5,135,-137.5,135,235,250,252.5,252.5,580,SBD
6,Vesa Kovalainen,M,,1971,53,Finland,,Raw,Masters 2,92.8,93,-230,-230,230,230,122.5,125,-127.5,125,240,250,-267.5,250,605,SBD
10,Juan Antonio Rodriguez Judias,M,,1971,53,Spain,,Raw,Masters 2,91.85,93,165,175,-185,175,107.5,112.5,115,115,190,215,220,220,510,SBD
4,Sean Minto,M,,1971,53,Australia,,Raw,Masters 2,91.7,93,210,220,-230,220,-137.5,142.5,-147.5,142.5,245,265,280,280,642.5,SBD
7,Alexander Le,M,,1971,53,Australia,,Raw,Masters 2,82.5,83,175,187.5,-192.5,187.5,110,117.5,122.5,122.5,210,227.5,245,245,555,SBD
3,Hirokazu Honda,M,,1971,53,Japan,,Raw,Masters 2,73.4,74,-185,185,207.5,207.5,100,110,-112.5,110,190,220,227.5,227.5,545,SBD
9,James Rossborough,M,,1972,52,UK,,Raw,Masters 2,81.75,83,190,-205,-205,190,135,140,-142.5,140,202.5,220,-230,220,550,SBD
8,Adrian Murphy,M,,1972,52,UK,,Raw,Masters 2,80.55,83,190,200,-210,200,112.5,120,122.5,122.5,220,230,-235,230,552.5,SBD
12,Edward Ruland,M,,1972,52,USA,,Raw,Masters 2,90.6,93,25,,,25,165,175,-182.5,175,75,,,75,275,SBD
2,Donald Bigham,M,,1972,52,US Virgin Islands,,Raw,Masters 2,81.75,83,205,225,237.5,237.5,125,135,140,140,215,235,252.5,252.5,630,SBD
2,Sami Siltala,M,,1972,52,Finland,,Raw,Masters 2,73.8,74,190,200,205,205,122.5,127.5,-132.5,127.5,237.5,-247.5,247.5,247.5,580,SBD
5,Thaddeus Say,M,,1972,52,USA,,Raw,Masters 2,82.45,83,175,185,192.5,192.5,122.5,127.5,-130,127.5,230,240,-255,240,560,SBD
12,Rob Dyke,M,,1972,52,Canada,,Raw,Masters 2,80.3,83,-170,170,-175,170,140,147.5,150,150,165,175,182.5,182.5,502.5,SBD
4,Kevin Steiger,M,,1972,52,Canada,,Raw,Masters 2,80.8,83,185,195,202.5,202.5,112.5,117.5,120,120,235,250,-272.5,250,572.5,SBD
1,Karel Rada #1,M,,1973,51,Czechia,,Raw,Masters 2,104.1,105,255,265,272.5,272.5,160,167.5,-170,167.5,250,270,275,275,715,SBD
2,Zack Toh,M,,1973,51,Singapore,,Raw,Masters 2,63.8,66,140,150,160,160,110,115,117.5,117.5,170,180,187.5,187.5,465,SBD
6,Tirth Ram,M,,1973,51,Belgium,,Raw,Masters 2,79.65,83,170,180,187.5,187.5,140,147.5,-152.5,147.5,220,-227.5,,220,555,SBD
4,Darren Scarfe,M,,1973,51,UK,,Raw,Masters 2,155.75,120+,210,230,240,240,160,170,175,175,260,280,-290,280,695,SBD
3,Thomas Konstanty,M,,1973,51,Germany,,Raw,Masters 2,81.25,83,170,185,192.5,192.5,105,112.5,-115,112.5,270,290,-292.5,290,595,SBD
6,Marcel Benzler,M,,1974,50,Germany,,Raw,Masters 2,135.65,120+,200,220,-230,220,175,180,182.5,182.5,200,230,250,250,652.5,SBD
1,Claudio Pereira,M,,1974,50,Australia,,Raw,Masters 2,91.15,93,242.5,257.5,265,265,125,130,135,135,245,265,272.5,272.5,672.5,SBD
11,Xavier Piard,M,,1974,50,France,,Raw,Masters 2,79.8,83,182.5,192.5,200,200,112.5,117.5,-120,117.5,182.5,192.5,202.5,202.5,520,SBD
10,Andrew de Lepervanche,M,,1974,50,Australia,,Raw,Masters 2,81.7,83,160,175,182.5,182.5,115,120,122.5,122.5,210,220,-230,220,525,SBD
1,Adem Biyikoğlu,M,,1974,50,Turkey,,Raw,Masters 2,82.1,83,240,252.5,-257.5,252.5,160,167.5,170,170,270,290,296,296,718.5,SBD
8,Charif Rabah,M,,1974,50,Lebanon,,Raw,Masters 2,108.7,120,190,205,212.5,212.5,160,167.5,-175,167.5,197.5,212.5,220,220,600,SBD
4,Kenji Nakama,M,,1974,50,Peru,,Raw,Masters 2,73.25,74,165,172.5,182.5,182.5,135,142.5,147.5,147.5,190,200,212.5,212.5,542.5,SBD
7,Bert Lynskey,M,,1974,50,Ireland,,Raw,Masters 2,127.75,120+,210,222.5,227.5,227.5,150,157.5,-162.5,157.5,250,265,-270,265,650,SBD
7,Jan Fellegi,M,,1974,50,Slovakia,,Raw,Masters 2,91.9,93,170,180,187.5,187.5,132.5,140,147.5,147.5,225,237.5,247.5,247.5,582.5,SBD
14,Bystrik Vidasic,M,,1974,50,Slovakia,,Raw,Masters 2,80.85,83,-192.5,200,-205,200,95,,,95,175,,,175,470,SBD
1,Scott Simon #1,M,,1974,50,UK,,Raw,Masters 2,114.5,120,280,297.5,307.5,307.5,207.5,-212.5,212.5,212.5,280,300,-307.5,300,820,SBD
4,Mark Crandall,M,,1974,50,Canada,,Raw,Masters 2,102.2,105,190,215,-220,215,172.5,180,-182.5,180,232.5,245,-260,245,640,SBD
9,Shaifulizzam Rouse,M,,1975,49,Singapore,,Raw,Masters 1,127.3,120+,192.5,202.5,-210,202.5,135,-140,-140,135,210,245,257.5,257.5,595,SBD
5,Ruben Serfaty,M,,1975,49,Argentina,,Raw,Masters 1,73.1,74,145,-160,162.5,162.5,102.5,107.5,-110,107.5,180,200,-210,200,470,SBD
10,Marlon Daniels,M,,1975,49,South Africa,,Raw,Masters 1,81.6,83,240,250,-255,250,145,-152.5,-152.5,145,240,-250,-250,240,635,SBD
5,Michele Tegon,M,,1976,48,UK,,Raw,Masters 1,91.15,93,252.5,260,267.5,267.5,132.5,140,-145,140,260,270,-275,270,677.5,SBD
2,Nathan Gorham,M,,1977,47,USA,,Raw,Masters 1,118.4,120,295,-312.5,312.5,312.5,200,210,217.5,217.5,275,-300,-312.5,275,805,SBD
9,Russell McLaren,M,,1977,47,South Africa,,Raw,Masters 1,90.9,93,180,195,-200,195,125,135,137.5,137.5,210,230,237.5,237.5,570,SBD
2,Jesús Daniel Prieto Freire,M,,1977,47,Spain,,Raw,Masters 1,159.4,120+,-330,340,355,355,-182.5,182.5,187.5,187.5,290,300,-310,300,842.5,SBD
6,Hamad Al Ajm,M,,1977,47,UAE,,Raw,Masters 1,118.6,120,235,-250,-250,235,170,-177.5,-180,170,230,245,-260,245,650,SBD
7,Tom Snow,M,,1978,46,New Zealand,,Raw,Masters 1,81.85,83,207.5,217.5,225,225,162.5,170,175,175,237.5,252.5,260,260,660,SBD
8,Firas Afani,M,,1978,46,Qatar,,Raw,Masters 1,92.25,93,185,195,-202.5,195,125,-130,-130,125,275,-290,-290,275,595,SBD
4,Milan Smiljanić,M,,1978,46,Serbia,,Raw,Masters 1,151.05,120+,300,315,-320,315,215,220,225,225,250,270,-292.5,270,810,SBD
8,Akira Kurokawa,M,,1978,46,Japan,,Raw,Masters 1,143.1,120+,175,190,205,205,155,162.5,167.5,167.5,200,230,-255,230,602.5,SBD
1,Carlos Santoliquido,M,,1978,46,USA,,Raw,Masters 1,109.9,120,287.5,302.5,310,310,175,185,190,190,305,322.5,-340,322.5,822.5,SBD
11,Patrick Rodrigue,M,,1978,46,Canada,,Raw,Masters 1,81.5,83,200,-210,215,215,117.5,122.5,-127.5,122.5,227.5,235,245,245,582.5,SBD
2,LS McClain,M,,1978,46,USA,,Raw,Masters 1,104.3,105,267.5,285,300,300,195,205,-210,205,285,-300,307.5,307.5,812.5,SBD
9,Frederico Oliveira,M,,1979,45,Brazil,,Raw,Masters 1,103.4,105,205,-210,-210,205,127.5,132.5,-140,132.5,227.5,235,-262.5,235,572.5,SBD
3,Steven Coleman,M,,1979,45,South Africa,,Raw,Masters 1,65.55,66,110,120,125,125,117.5,-125,-125,117.5,130,145,157.5,157.5,400,SBD
6,Paul Walker #1,M,,1979,45,UK,,Raw,Masters 1,138.15,120+,260,-270,-270,260,167.5,177.5,182.5,182.5,260,277.5,-285,277.5,720,SBD
1,Jani Haapamäki,M,,1979,45,Finland,,Raw,Masters 1,73.7,74,230,240,247.5,247.5,155,162.5,167.5,167.5,-260,260,-275,260,675,SBD
8,Joseph Chamberlain,M,,1979,45,Canada,,Raw,Masters 1,104.55,105,227.5,235,240,240,147.5,-155,-155,147.5,220,-222.5,-222.5,220,607.5,SBD
3,Florent Lenglet,M,,1979,45,France,,Raw,Masters 1,82.6,83,240,-255,-255,240,172.5,180,-182.5,180,257.5,275,287.5,287.5,707.5,SBD
6,Chris Forget,M,,1979,45,South Africa,,Raw,Masters 1,81.65,83,242.5,257.5,-260,257.5,120,127.5,132.5,132.5,240,260,272.5,272.5,662.5,SBD
9,Eduardo Assis,M,,1980,44,Brazil,,Raw,Masters 1,81.35,83,207.5,222.5,232.5,232.5,130,137.5,142.5,142.5,235,252.5,260,260,635,SBD
4,Jussi Harmaala,M,,1980,44,Finland,,Raw,Masters 1,92.35,93,237.5,-247.5,247.5,247.5,157.5,167.5,-170,167.5,250,270,-277.5,270,685,SBD
3,Rob Ward #1,M,,1980,44,USA,,Raw,Masters 1,144.2,120+,310,327.5,342.5,342.5,182.5,-190,-190,182.5,285,305,-317.5,305,830,SBD
DQ,Mohammed Ali Alkhanbouli,M,,1980,44,UAE,,Raw,Masters 1,103.7,105,-235,-235,-235,-235,165,175,-180,175,285,300,-310,300,,SBD
7,Braam Van Huyssteen,M,,1980,44,South Africa,,Raw,Masters 1,110.3,120,200,215,-230,215,110,115,-117.5,115,220,230,-235,230,560,SBD
5,Jari Kaarnais,M,,1980,44,Finland,,Raw,Masters 1,81.3,83,222.5,232.5,237.5,237.5,142.5,150,155,155,245,260,270,270,662.5,SBD
1,Rajesh Babu,M,,1980,44,New Zealand,,Raw,Masters 1,58.8,59,125,130,137.5,137.5,112.5,117.5,120,120,200,210,220,220,477.5,SBD
8,Mark Fulton,M,,1981,43,UK,,Raw,Masters 1,82.6,83,220,230,-235,230,140,145,-147.5,145,265,280,-287.5,280,655,SBD
5,Newton Mudau,M,,1981,43,South Africa,,Raw,Masters 1,119.45,120,255,265,272.5,272.5,175,-185,-185,175,227.5,237.5,242.5,242.5,690,SBD
10,Jon-paul Pritchard,M,,1981,43,Singapore,,Raw,Masters 1,103.55,105,170,182.5,192.5,192.5,92.5,97.5,102.5,102.5,-212.5,212.5,227.5,227.5,522.5,SBD
2,Simon Voakes,M,,1981,43,UK,,Raw,Masters 1,65.45,66,-165,165,-172.5,165,115,-122.5,-125,115,200,210,217.5,217.5,497.5,SBD
1,Tuan Nguyen #1,M,,1981,43,USA,,Raw,Masters 1,65.7,66,-180,185,-192.5,185,105,110,115,115,210,217.5,222.5,222.5,522.5,SBD
1,Anthony McLeggan,M,,1981,43,Ireland,,Raw,Masters 1,102.75,105,247.5,267.5,280,280,197.5,205,207.5,207.5,300,322.5,325,325,812.5,SBD
1,Layne Norton,M,,1981,43,USA,,Raw,Masters 1,92.6,93,270,287.5,-295,287.5,155,165,-167.5,165,300,310,328,328,780.5,SBD
3,Mehmet Ali Deniz,M,,1982,42,Turkey,,Raw,Masters 1,108.15,120,280,295,305,305,165,172.5,180,180,265,277.5,-282.5,277.5,762.5,SBD
8,Yuosef Al Hashme,M,,1982,42,Qatar,,Raw,Masters 1,118.6,120,167.5,-175,175,175,115,-122.5,122.5,122.5,190,207.5,215,215,512.5,SBD
7,Kimmo Matilainen,M,,1982,42,Finland,,Raw,Masters 1,156.2,120+,250,265,-277.5,265,192.5,200,-205,200,220,240,252.5,252.5,717.5,SBD
2,David White #1,M,,1982,42,UK,,Raw,Masters 1,73.65,74,250,262.5,-270,262.5,122.5,130,-132.5,130,240,250,260,260,652.5,SBD
3,Julien Idier,M,,1982,42,France,,Raw,Masters 1,92.7,93,250,265,272.5,272.5,172.5,182.5,185,185,245,-267.5,-267.5,245,702.5,SBD
5,Paul Doherty,M,,1982,42,UK,,Raw,Masters 1,131.25,120+,265,272.5,277.5,277.5,160,172.5,180,180,280,295,300,300,757.5,SBD
7,Jason Raby,M,,1982,42,Australia,,Raw,Masters 1,100.95,105,197.5,210,220,220,167.5,175,180,180,235,247.5,250,250,650,SBD
11,Adam John Horsewood,M,,1982,42,Singapore,,Raw,Masters 1,91.55,93,160,172.5,-180,172.5,90,100,105,105,205,220,230,230,507.5,SBD
4,Mathew Dempsey,M,,1983,41,UK,,Raw,Masters 1,104.85,105,255,272.5,282.5,282.5,155,165,172.5,172.5,240,257.5,-275,257.5,712.5,SBD
5,Ahmed Dawy,M,,1983,41,Qatar,,Raw,Masters 1,101.3,105,-252.5,252.5,-257.5,252.5,155,162.5,-165,162.5,270,277.5,-285,277.5,692.5,SBD
4,Jacco Daniel,M,,1983,41,Nauru,,Raw,Masters 1,82,83,200,-245,245,245,165,172.5,177.5,177.5,265,275,282.5,282.5,705,SBD
6,Jonas Vagtholm Willemoes Lundberg,M,,1983,41,Denmark,,Raw,Masters 1,103.2,105,197.5,210,217.5,217.5,150,157.5,162.5,162.5,245,260,275,275,655,SBD
2,Steven Cormier,M,,1983,41,Canada,,Raw,Masters 1,79.95,83,250,265,-275,265,165,170,-175,170,282.5,292.5,-312.5,292.5,727.5,SBD
4,Andrew Stewart #1,M,,1983,41,Canada,,Raw,Masters 1,117.95,120,262.5,275,282.5,282.5,170,-182.5,182.5,182.5,267.5,-287.5,-300,267.5,732.5,SBD
6,Dino Camire,M,,1983,41,Canada,,Raw,Masters 1,91.05,93,-207.5,207.5,215,215,150,155,160,160,250,260,270,270,645,SBD
1,Robert Kun,M,,1984,40,Nauru,,Raw,Masters 1,144.3,120+,325,340,352.5,352.5,-190,222.5,225,225,240,255,265,265,842.5,SBD
2,Axel Raymond,M,,1984,40,France,,Raw,Masters 1,91.75,93,262.5,-272.5,272.5,272.5,165,172.5,175,175,285,295,-310,295,742.5,SBD
4,Timothy Halim,M,,1984,40,Australia,,Raw,Masters 1,72.15,74,167.5,175,180,180,92.5,97.5,-100,97.5,200,215,-235,215,492.5,SBD
7,Deon Smedley,M,,1984,40,South Africa,,Raw,Masters 1,92.1,93,230,237.5,-245,237.5,132.5,137.5,140,140,240,255,-267.5,255,632.5,SBD
3,Xavier Nudant,M,,1984,40,France,,Raw,Masters 1,102.35,105,250,-257.5,257.5,257.5,165,170,175,175,280,295,-300,295,727.5,SBD
3,Phil Brown,M,,1968,56,Canada,,Raw,Masters 2,63.25,66,120,130,140,140,65,67.5,70,70,,175,190,190,400,SBD
1,Paul Kerin,M,,1952,72,Australia,,Raw,Masters 4,108.9,120,65,77.5,-90,77.5,60,70,75,75,140,170,-192.5,170,322.5,SBD
3,Lorenzo Poletto,M,,1952,72,Australia,,Raw,Masters 4,103.45,105,115,122.5,132.5,132.5,95,100,105,105,150,-162.5,167.5,167.5,405,SBD
5,Patrick Ruiz,M,,1964,60,France,,Raw,Masters 3,103.75,105,200,-215,-215,200,115,-120,120,120,235,250,-255,250,570,SBD
10,Faisal Alzaabi,M,,1978,46,UAE,,Raw,Masters 1,88.25,93,170,-180,180,180,170,-180,180,180,180,195,205,205,565,SBD
3,Christopher Smith #2,M,,1982,42,Australia,,Raw,Masters 1,73.2,74,170,180,-187.5,180,115,122.5,-127.5,122.5,180,195,210,210,512.5,SBD
1,Ross Leppala,M,,1984,40,USA,,Raw,Masters 1,82.4,83,242.5,260,270,270,170,180,187.5,187.5,267.5,282.5,290,290,747.5,SBD
2,Dan Oppenheim,M,,1945,79,South Africa,,Single-ply,Masters 4,79.75,83,140,155,165,165,90,105,110,110,-150,150,,150,425,SBD
1,John Terragni,M,,1947,77,Denmark,,Single-ply,Masters 4,72.2,74,175,185,-190,185,-120,120,125,125,170,182.5,-195,182.5,492.5,SBD
1,Perenlei Shagdar,M,,1951,73,Mongolia,,Single-ply,Masters 4,65.35,66,110,130,150,150,65,70,-75,70,135,155,-167.5,155,375,SBD
DQ,Sæmundur Guðmundsson,M,,1952,72,Iceland,,Single-ply,Masters 4,81.15,83,-160,-160,-160,-160,115,120,,120,190,-200,-200,190,,SBD
1,Bill Clayton,M,,1953,71,USA,,Single-ply,Masters 4,83.5,93,125,130,137.5,137.5,90,97.5,-102.5,97.5,150,,,150,385,SBD
1,Brad Salter,M,,1954,70,USA,,Single-ply,Masters 4,112.45,120,140,155,165,165,-92.5,92.5,102.5,102.5,150,170,180,180,447.5,SBD
1,Flosi Jónsson,M,,1954,70,Iceland,,Single-ply,Masters 4,100.4,105,125,140,155,155,125,-150,-167.5,125,160,180,-195,180,460,SBD
1,Antero Juntunen,M,,1954,70,Finland,,Single-ply,Masters 4,82.7,83,175,180,190,190,85,90,-95,90,190,205,215,215,495,SBD
5,Keith Taylor #2,M,,1956,68,USA,,Single-ply,Masters 3,96.2,105,-182.5,182.5,-195,182.5,110,150,160,160,185,195,205,205,547.5,SBD
2,Anton Mihok,M,,1957,67,Slovakia,,Single-ply,Masters 3,72.7,74,195,-205,205,205,155,162.5,167.5,167.5,195,205,-210,205,577.5,SBD
6,Roberto Alessio,M,,1958,66,Argentina,,Single-ply,Masters 3,81.95,83,-150,-150,150,150,55,65,,65,190,-202.5,-202.5,190,405,SBD
4,Hordur Birkirsson,M,,1958,66,Iceland,,Single-ply,Masters 3,73.2,74,-170,-170,170,170,110,115,120,120,180,-202.5,-202.5,180,470,SBD
3,Ronald Kilpatrick,M,,1959,65,Canada,,Single-ply,Masters 3,103,105,240,-250,250,250,170,-175,-175,170,230,237.5,-252.5,237.5,657.5,SBD
DQ,Koichi Taniguchi,M,,1960,64,Japan,,Single-ply,Masters 3,73.15,74,-195,-195,-195,-195,-135,135,140,140,125,175,200,200,,SBD
5,Tomas Ring,M,,1960,64,Sweden,,Single-ply,Masters 3,82.8,83,160,170,-182.5,170,-185,185,190,190,75,90,100,100,460,SBD
4,Gerard Dally,M,,1960,64,USA,,Single-ply,Masters 3,89.95,93,180,192.5,202.5,202.5,105,112.5,120,120,187.5,205,207.5,207.5,530,SBD
3,Thomas Cencich,M,,1960,64,USA,,Single-ply,Masters 3,91.45,93,175,-195,195,195,190,203.5,-208,203.5,185,202.5,207.5,207.5,606,SBD
3,Allen Ottolangui,M,,1960,64,UK,,Single-ply,Masters 3,73.8,74,205,215,220,220,115,120,122.5,122.5,190,200,-210,200,542.5,SBD
1,Sigve Valentinsen,M,,1960,64,Norway,,Single-ply,Masters 3,88,93,235,-245,245,245,160,170,180,180,200,215,225,225,650,SBD
2,Harri Hagfors,M,,1961,63,Finland,,Single-ply,Masters 3,92,93,210,220,225,225,-135,135,140,140,225,237.5,242.5,242.5,607.5,SBD
2,Abbas Pordel,M,,1961,63,Australia,,Single-ply,Masters 3,117.1,120,165,180,190,190,205,222.5,232.5,232.5,185,210,220,220,642.5,SBD
1,Štefan Koľšovský,M,,1961,63,Slovakia,,Single-ply,Masters 3,58,59,155,165,,165,120,127.5,132.5,132.5,130,140,145,145,442.5,SBD
3,Katsumi Akiyama,M,,1962,62,Japan,,Single-ply,Masters 3,107.35,120,100,170,-190,170,100,165,175,175,125,155,175,175,520,SBD
1,Shunsuke Yabu,M,,1962,62,Japan,,Single-ply,Masters 3,65.15,66,-185,-185,185,185,85,92.5,95,95,160,180,-190,180,460,SBD
2,Stephen King #1,M,,1962,62,New Zealand,,Single-ply,Masters 3,82.4,83,202.5,222.5,232.5,232.5,100,107.5,112.5,112.5,185,200,-217.5,200,545,SBD
4,Tommie de Nysschen,M,,1963,61,South Africa,,Single-ply,Masters 3,82.65,83,140,155,167.5,167.5,150,-162.5,162.5,162.5,152.5,162.5,172.5,172.5,502.5,SBD
1,Chris Boillot,M,,1963,61,USA,,Single-ply,Masters 3,80.85,83,220,230,-240,230,140,150,155,155,205,215,-225,215,600,SBD
1,Paul Gidney,M,,1963,61,Canada,,Single-ply,Masters 3,103.35,105,230,235,-240,235,-165,165,170,170,276.5,280.5,-285.5,280.5,685.5,SBD
4,Richard Johnson #2,M,,1963,61,USA,,Single-ply,Masters 3,96.65,105,210,-235,-235,210,117.5,122.5,125,125,210,-225,225,225,560,SBD
1,Ronny Andersen,M,,1964,60,Norway,,Single-ply,Masters 3,119.3,120,240,250,-252.5,250,220,-227.5,227.5,227.5,230,240,250,250,727.5,SBD
1,Carlos Burgos,M,,1964,60,Argentina,,Single-ply,Masters 3,72.75,74,-190,190,200,200,125,130,135,135,241,-257.5,260,260,595,SBD
2,Lars Höglander,M,,1964,60,Sweden,,Single-ply,Masters 3,95.7,105,-250,255,-265,255,170,-175,-175,170,232.5,240,245,245,670,SBD
2,David Hrynkow,M,,1964,60,Canada,,Single-ply,Masters 3,65.2,66,137.5,145,150,150,82.5,-92.5,-92.5,82.5,180,-190,-190,180,412.5,SBD
3,Rami Huovinen,M,,1964,60,Finland,,Single-ply,Masters 3,82.55,83,180,-210,-210,180,120,-127.5,-127.5,120,205,217.5,-227.5,217.5,517.5,SBD
1,Eric Verbel,M,,1965,59,USA,,Single-ply,Masters 2,65.45,66,170,185,-195,185,75,-112.5,-112.5,75,175,187.5,200,200,460,SBD
1,Eric Kupperstein,M,,1966,58,USA,,Single-ply,Masters 2,58.45,59,175,-195,205,205,50,55,-57.5,55,175,-195,-215,175,435,SBD
3,John Demchak,M,,1967,57,USA,,Single-ply,Masters 2,82.25,83,195,205,210,210,102.5,-110,-110,102.5,230,242.5,-252.5,242.5,555,SBD
4,Vladan Hasečić,M,,1970,54,Serbia,,Single-ply,Masters 2,103.7,105,275,290,-300,290,190,195,200,200,240,-255,-257.5,240,730,SBD
3,Hermanus de Beer,M,,1970,54,South Africa,,Single-ply,Masters 2,114,120,185,200,215,215,155,165,170,170,245,260,265,265,650,SBD
1,Jeff Butt,M,,1970,54,Canada,,Single-ply,Masters 2,92.25,93,260,270,277.5,277.5,167.5,175,180,180,270,277.5,280,280,737.5,SBD
5,Toshio Nakamura,M,,1970,54,Japan,,Single-ply,Masters 2,98.25,105,225,237.5,-252.5,237.5,180,192.5,202.5,202.5,180,202.5,-210,202.5,642.5,SBD
4,Mitsuhisa Ogawa,M,,1971,53,Japan,,Single-ply,Masters 2,92.2,93,225,245,-265,245,175,185,197.5,197.5,210,220,-230,220,662.5,SBD
3,Petteri Nousiainen,M,,1971,53,Finland,,Single-ply,Masters 2,91.65,93,255,265,272.5,272.5,175,-180,-180,175,240,247.5,262.5,262.5,710,SBD
2,Travis Pardue,M,,1971,53,USA,,Single-ply,Masters 2,74,74,195,205,-215,205,130,137.5,-140,137.5,227.5,245,247.5,247.5,590,SBD
3,Ariunjargal Luvsanchultem,M,,1971,53,Mongolia,,Single-ply,Masters 2,101.4,105,285,295,305,305,-150,150,160,160,270,280,-295,280,745,SBD
1,Ali Qaband,M,,1972,52,Syria,,Single-ply,Masters 2,82.15,83,170,195,205,205,140,150,155,155,190,215,220,220,580,SBD
2,Michael Kalter,M,,1972,52,USA,,Single-ply,Masters 2,115.4,120,290,300,310,310,200,-207.5,-207.5,200,-285,285,-312.5,285,795,SBD
2,Robert Nyborg Jaeger,M,,1972,52,Denmark,,Single-ply,Masters 2,130.65,120+,180,200,215,215,155,165,170,170,220,240,-250,240,625,SBD
2,Mohamad Ghazi,M,,1972,52,Syria,,Single-ply,Masters 2,58,59,90,110,127.5,127.5,70,80,-87.5,80,100,130,150,150,357.5,SBD
2,Ole Andreas Ådnanes,M,,1972,52,Norway,,Single-ply,Masters 2,90.9,93,260,272.5,277.5,277.5,185,192.5,197.5,197.5,-235,242.5,260,260,735,SBD
2,Karel Rada #1,M,,1973,51,Czechia,,Single-ply,Masters 2,104.05,105,285,300,-310,300,185,-190,190,190,250,265,270,270,760,SBD
1,Sorin Cazacu,M,,1973,51,Romania,,Single-ply,Masters 2,122.05,120+,265,280,-292.5,280,235,245,,245,205,217.5,220,220,745,SBD
4,Joergen Michael Rasmussen,M,,1973,51,Denmark,,Single-ply,Masters 2,112.55,120,-235,235,250,250,-170,170,-175,170,205,210,225,225,645,SBD
1,Travis Koehn,M,,1973,51,USA,,Single-ply,Masters 2,119.45,120,290,305,317.5,317.5,-220,-225,225,225,262.5,275,280,280,822.5,SBD
DQ,Uurtsaikh Tsolmon,M,,1974,50,Mongolia,,Single-ply,Masters 2,120.35,120+,-260,-260,-260,-260,-185,185,-200,185,200,-215,-215,200,,SBD
1,Sune Bak,M,,1974,50,Denmark,,Single-ply,Masters 2,104.5,105,285,295,305,305,215,222.5,-227.5,222.5,275,285,295,295,822.5,SBD
1,Enkhbat Sanduijav,M,,1974,50,Mongolia,,Single-ply,Masters 2,72.7,74,245,255,265,265,145,152.5,157.5,157.5,220,230,245,245,667.5,SBD
2,Bystrik Vidasic,M,,1974,50,Slovakia,,Single-ply,Masters 2,81.2,83,205,-215,215,215,130,-135,-135,130,217.5,-230,-230,217.5,562.5,SBD
5,Ruben Serfaty,M,,1975,49,Argentina,,Single-ply,Masters 1,72.5,74,-190,190,207.5,207.5,115,-120,120,120,200,215,-225,215,542.5,SBD
2,Roy Vojacek,M,,1977,47,Norway,,Single-ply,Masters 1,73.1,74,240,-250,-250,240,135,137.5,140,140,210,220,-225,220,600,SBD
3,Batbileg Otgonsuren,M,,1977,47,Mongolia,,Single-ply,Masters 1,71.8,74,215,225,230,230,122.5,127.5,132.5,132.5,220,230,-237.5,230,592.5,SBD
2,Cristian Oproiu,M,,1978,46,Romania,,Single-ply,Masters 1,104.1,105,255,-260,260,260,-170,170,-172.5,170,217.5,232.5,-242.5,232.5,662.5,SBD
1,Patrick Rodrigue,M,,1978,46,Canada,,Single-ply,Masters 1,81.95,83,222.5,-237.5,242.5,242.5,145,150,155,155,240,255,-265,255,652.5,SBD
1,Norbert Kropf,M,,1978,46,Germany,,Single-ply,Masters 1,103.2,105,240,-250,-250,240,195,205,-210,205,200,215,225,225,670,SBD
6,Kevin Fletcher,M,,1979,45,UK,,Single-ply,Masters 1,73.65,74,215,-220,-220,215,125,-132.5,132.5,132.5,185,195,-200,195,542.5,SBD
2,Michael Jean Sr,M,,1979,45,USA,,Single-ply,Masters 1,160.9,120+,235,245,270,270,210,-230,-230,210,270,290,305,305,785,SBD
2,Amer Khorshid,M,,1979,45,Syria,,Single-ply,Masters 1,113.55,120,-230,-230,230,230,210,220,-227.5,220,250,260,267.5,267.5,717.5,SBD
1,Takuya Ishikawa,M,,1979,45,Japan,,Single-ply,Masters 1,65.25,66,100,180,-192.5,180,80,140,-160,140,140,165,175,175,495,SBD
3,Janne Hakala,M,,1979,45,Finland,,Single-ply,Masters 1,123.75,120+,255,270,277.5,277.5,100,175,-185,175,230,252.5,-265,252.5,705,SBD
4,Nash Hunter,M,,1979,45,UK,,Single-ply,Masters 1,72.75,74,195,207.5,-210,207.5,115,125,-127.5,125,235,-245,-245,235,567.5,SBD
1,Sturla Abrahamsen Maeland,M,,1980,44,Norway,,Single-ply,Masters 1,92.5,93,-292.5,292.5,300,300,212.5,220,225,225,205,245,-282.5,245,770,SBD
2,Sebastian Kienast,M,,1981,43,Germany,,Single-ply,Masters 1,78.75,83,235,245,250,250,120,127.5,132.5,132.5,210,227.5,232.5,232.5,615,SBD
3,Sami Al Barni,M,,1982,42,Syria,,Single-ply,Masters 1,98.75,105,160,190,-200,190,130,145,152.5,152.5,220,240,242.5,242.5,585,SBD
1,John MacDonald #1,M,,1983,41,Canada,,Single-ply,Masters 1,132.2,120+,240,305,325,325,260,275,280,280,225,250,277.5,277.5,882.5,SBD
1,Weerasinghe Darin,M,,1983,41,Sri Lanka,,Single-ply,Masters 1,119.5,120,240,252.5,260,260,180,187.5,-197.5,187.5,245,257.5,272.5,272.5,720,SBD
1,Yngve Hopen,M,,1984,40,Norway,,Single-ply,Masters 1,72.2,74,270,280,-290,280,135,142.5,147.5,147.5,270,-280,-280,270,697.5,SBD
DQ,Carol Brady,F,,1950,74,Canada,,Single-ply,Masters 4,65,69,80,-87.5,90,90,-62.5,-62.5,-62.5,-62.5,90,97.5,102.5,102.5,,SBD
1,Jenny Hunter,F,,1958,66,UK,,Single-ply,Masters 3,50.55,52,62.5,70,75,75,52.5,57.5,60,60,95,102.5,105,105,240,SBD
1,Elsa Pálsdóttir,F,,1960,64,Iceland,,Single-ply,Masters 3,74.95,76,-155,155,-170.5,155,70,80,-85,80,140,160,175.5,175.5,410.5,SBD
2,Lene Einarsen,F,,1963,61,Norway,,Single-ply,Masters 3,72.45,76,-120,120,-130,120,92.5,95,97.5,97.5,120,-130,130,130,347.5,SBD
1,Jackie Blasbery,F,,1963,61,UK,,Single-ply,Masters 3,98.5,84+,110,120,130,130,100,112.5,122.5,122.5,55,-75,-75,55,307.5,SBD
1,Helen Birathlilja,F,,1963,61,Sweden,,Single-ply,Masters 3,61.65,63,80,-100,105,105,40,-45,-45,40,110,122.5,135,135,280,SBD
DQ,Gro-Berit Stavheim,F,,1964,60,Norway,,Single-ply,Masters 3,72.8,76,-145,-145,-145,-145,65,70,75,75,130,140,-150,140,,SBD
2,Heather Leighton,F,,1964,60,South Africa,,Single-ply,Masters 3,68.4,69,85,92.5,-97.5,92.5,65,67.5,-70,67.5,90,100,107.5,107.5,267.5,SBD
1,Maureen Gordon,F,,1964,60,UK,,Single-ply,Masters 3,67.75,69,125,-130,132.5,132.5,115,120,-125.5,120,140,147.5,152.5,152.5,405,SBD
1,Sharon McCarthy,F,,1965,59,Canada,,Single-ply,Masters 2,90.7,84+,-135,135,145,145,70,75,77.5,77.5,130,137.5,142.5,142.5,365,SBD
2,Rita Shergold,F,,1965,59,UK,,Single-ply,Masters 2,62.05,63,132.5,-142.5,142.5,142.5,87.5,95,100,100,125,135,140,140,382.5,SBD
3,Anita Stavik,F,,1965,59,Norway,,Single-ply,Masters 2,62.5,63,155,160,-165,160,65,67.5,70,70,147.5,152.5,-155,152.5,382.5,SBD
5,Yvonne Treharne,F,,1966,58,UK,,Single-ply,Masters 2,62.25,63,112.5,-120,120,120,62.5,67.5,72.5,72.5,95,105,110,110,302.5,SBD
2,Allison Rodney,F,,1966,58,UK,,Single-ply,Masters 2,56.75,57,100,110,-120,110,-70,70,77.5,77.5,110,120,130,130,317.5,SBD
2,Carol Anthony,F,,1966,58,South Africa,,Single-ply,Masters 2,51.5,52,95,105,110,110,47.5,-52.5,52.5,52.5,110,120,-125,120,282.5,SBD
1,Yukiko Yanagisawa,F,,1967,57,Japan,,Single-ply,Masters 2,46.75,47,65,75,85,85,40,42.5,45,45,75,85,90,90,220,SBD
2,Florence Leccese,F,,1969,55,France,,Single-ply,Masters 2,69.75,76,140,147.5,152.5,152.5,92.5,95,-100,95,115,125,-135,125,372.5,SBD
1,Eva Buxbom,F,,1969,55,Denmark,,Single-ply,Masters 2,51.7,52,150,157.5,163,163,-72.5,72.5,-75,72.5,-145,145,-155,145,380.5,SBD
1,Merci Colorado,F,,1971,53,Ecuador,,Single-ply,Masters 2,59.95,63,150,160,170,170,75,-80,80,80,160,-170,170,170,420,SBD
1,Annelie Izindre,F,,1972,52,Sweden,,Single-ply,Masters 2,55.25,57,115,122.5,127.5,127.5,85,90,-92.5,90,120,130,135,135,352.5,SBD
4,Marieke van Linge,F,,1972,52,South Africa,,Single-ply,Masters 2,61.5,63,105,117.5,-122.5,117.5,55,57.5,60,60,120,127.5,135,135,312.5,SBD
1,Ulrika Johansson,F,,1972,52,Sweden,,Single-ply,Masters 2,74.4,76,160,170,-175,170,100,110,-117.5,110,140,160,-170,160,440,SBD
2,Denise Westbrook,F,,1973,51,UK,,Single-ply,Masters 2,87.35,84+,117.5,-125,-127.5,117.5,70,75,-80,75,105,112.5,120,120,312.5,SBD
1,Jenni Sherwood #1,F,,1973,51,UK,,Single-ply,Masters 2,81.05,84,150,-160,-160,150,40,-50,-50,40,75,-90,-120,75,265,SBD
2,Joanne Rose,F,,1973,51,Canada,,Single-ply,Masters 2,67.65,69,135,140,145,145,87.5,92.5,97.5,97.5,145,155,-157.5,155,397.5,SBD
3,Linda Veedfald,F,,1973,51,Denmark,,Single-ply,Masters 2,67.85,69,125,-135,-135,125,-62.5,62.5,67.5,67.5,127.5,135,142.5,142.5,335,SBD
1,Laura de Wet,F,,1974,50,South Africa,,Single-ply,Masters 2,67.5,69,170,180,185,185,-85,85,90,90,160,175,190,190,465,SBD
2,Joanne Parkin,F,,1975,49,UK,,Single-ply,Masters 1,122,84+,125,140,-150,140,75,85,-95,85,165,175,187.5,187.5,412.5,SBD
3,Danielle Hussey,F,,1976,48,Canada,,Single-ply,Masters 1,56.1,57,145,-152.5,152.5,152.5,77.5,82.5,-85,82.5,132.5,142.5,-147.5,142.5,377.5,SBD
1,Iolanda Costa Zolyome,F,,1977,47,Brazil,,Single-ply,Masters 1,75.75,76,210,230,-235,230,120,130,-137.5,130,180,185,187.5,187.5,547.5,SBD
2,Amber Hinchelwood,F,,1978,46,UK,,Single-ply,Masters 1,60.25,63,110,115,125,125,55,60,67.5,67.5,107.5,120,125,125,317.5,SBD
2,Amanda Hughes,F,,1979,45,UK,,Single-ply,Masters 1,55.75,57,130,137.5,142.5,142.5,-90,90,95,95,130,140,-142.5,140,377.5,SBD
1,Jacqui Rees,F,,1980,44,South Africa,,Single-ply,Masters 1,90.85,84+,190,-200,-200,190,120,125,-130,125,165,175,-185,175,490,SBD
1,Lena Kruuse Skovby Andersen,F,,1981,43,Denmark,,Single-ply,Masters 1,67.3,69,170,-180,-180,170,90,-95,95,95,170,-177.5,177.5,177.5,442.5,SBD
1,Nora Bjerregaard Jensen,F,,1982,42,Denmark,,Single-ply,Masters 1,77.7,84,185,-195,-195,185,80,85,-87.5,85,125,-140,-140,125,395,SBD
1,Hege Berge,F,,1982,42,Norway,,Single-ply,Masters 1,62.2,63,175,182.5,190,190,105,107.5,110,110,-165,165,175,175,475,SBD
1,Gemma Salter,F,,1983,41,UK,,Single-ply,Masters 1,56.5,57,140,147.5,-152.5,147.5,80,-85,85,85,150,-155,155,155,387.5,SBD
2,Nina Mäkinen,F,,1983,41,Finland,,Single-ply,Masters 1,64.95,69,125,135,140,140,65,70,75,75,130,140,,140,355,SBD
2,Beulah Toews,F,,1944,80,Australia,,Raw,Masters 4,50.6,52,45,50,55,55,27.5,32.5,-35,32.5,70,77.5,-80,77.5,165,SBD
3,Denise Johnson,F,,1947,77,USA,,Raw,Masters 4,50.05,52,37.5,40,45,45,30,-32.5,32.5,32.5,75,80,-87.5,80,157.5,SBD
1,Lois Sprang,F,,1949,75,Trinidad and Tobago,,Raw,Masters 4,56.15,57,77.5,85,-90.5,85,35,40,-45,40,105,112.5,120,120,245,SBD
2,Cherry Wilson,F,,1950,74,New Zealand,,Raw,Masters 4,56.2,57,75,-80,-80,75,40,42.5,-45,42.5,95,102.5,-107.5,102.5,220,SBD
1,Linda Gorham,F,,1951,73,USA,,Raw,Masters 4,98.95,84+,-107.5,112.5,117.5,117.5,65,70,72.5,72.5,-122.5,-122.5,122.5,122.5,312.5,SBD
1,Joy Follis,F,,1952,72,UK,,Raw,Masters 4,50.35,52,50,55,57.5,57.5,-40,40,42.5,42.5,92.5,-100,-100,92.5,192.5,SBD
2,Marina Cornwall,F,,1954,70,UK,,Raw,Masters 4,44.4,47,50,55,60,60,35,-37.5,37.5,37.5,90,97.5,102.5,102.5,200,SBD
1,Susan Sabuda,F,,1954,70,UK,,Raw,Masters 4,61.4,63,85,90,92.5,92.5,50,-52.5,52.5,52.5,120,127.5,130,130,275,SBD
2,Vicki Stamoulis,F,,1954,70,Australia,,Raw,Masters 4,93.45,84+,45,57.5,-62.5,57.5,45,50,52.5,52.5,125,135.5,140.5,140.5,250.5,SBD
3,Melanie Lester,F,,1954,70,UK,,Raw,Masters 4,64.65,69,75,80,85,85,37.5,40,42.5,42.5,-120,120,125,125,252.5,SBD
2,Alma Kimura,F,,1954,70,USA,,Raw,Masters 4,66.8,69,105,-111,113,113,47.5,52.5,-55,52.5,132.5,142.5,145,145,310.5,SBD
1,Kirsti Løken,F,,1954,70,Norway,,Raw,Masters 4,68.35,69,105,112.5,117,117,60,65,66,66,130,142.5,146,146,329,SBD
1,Trish Muldrock,F,,1954,70,New Zealand,,Raw,Masters 4,45.8,47,75,-77.5,-77.5,75,58,61,62,62,120,126,131,131,268,SBD
3,Joan Trimble,F,,1955,69,UK,,Raw,Masters 3,66.55,69,110,115,121,121,57.5,62.5,65,65,135,145,152.5,152.5,338.5,SBD
8,Helen Southwell,F,,1957,67,Australia,,Raw,Masters 3,61.45,63,82.5,-90,90,90,42.5,45,47.5,47.5,117.5,125,132.5,132.5,270,SBD
4,Brith Ediassen,F,,1957,67,Norway,,Raw,Masters 3,96.55,84+,92.5,-100,102.5,102.5,45,50,-55,50,112.5,120,122.5,122.5,275,SBD
4,Mary Fusco,F,,1957,67,Ireland,,Raw,Masters 3,71.65,76,105,-112.5,-112.5,105,55,60,-62.5,60,115,122.5,-127.5,122.5,287.5,SBD
7,Arlene van Diepen,F,,1957,67,Canada,,Raw,Masters 3,61.7,63,80,82.5,85,85,47.5,50,-55,50,122.5,130,137.5,137.5,272.5,SBD
6,Caroline Cunniffe,F,,1957,67,Ireland,,Raw,Masters 3,61.35,63,85,92.5,97.5,97.5,47.5,50,52.5,52.5,112.5,122.5,130,130,280,SBD
2,Jenny Hunter,F,,1958,66,UK,,Raw,Masters 3,50.65,52,62.5,70,75,75,52.5,57.5,60,60,95,105,115,115,250,SBD
2,Pranee Pascoe,F,,1958,66,Thailand,,Raw,Masters 3,46.75,47,77.5,82.5,-85,82.5,47.5,50,52.5,52.5,120,126.5,-130.5,126.5,261.5,SBD
2,Peta Day,F,,1959,65,Australia,,Raw,Masters 3,94.1,84+,130,137.5,142,142,70,72.5,75,75,157.5,167.5,175.5,175.5,392.5,SBD
5,Linda Thorne,F,,1959,65,UK,,Raw,Masters 3,74.55,76,70,75,80,80,45,50,-55,50,125,132.5,135,135,265,SBD
5,Pamela King,F,,1959,65,Canada,,Raw,Masters 3,68.2,69,100,105,110,110,67.5,72.5,75,75,125,-135,-147.5,125,310,SBD
5,Susan Bonneau,F,,1960,64,Canada,,Raw,Masters 3,96.1,84+,90,97.5,-102.5,97.5,50,55,-57.5,55,102.5,105,112.5,112.5,265,SBD
7,Sari Juvonen,F,,1960,64,Finland,,Raw,Masters 3,65.75,69,-80,80,85,85,40,42.5,-45,42.5,100,-110,110,110,237.5,SBD
4,Gail-Ann Breese,F,,1960,64,Canada,,Raw,Masters 3,64.55,69,102.5,107.5,112.5,112.5,60,62.5,-65,62.5,145,152.5,-165,152.5,327.5,SBD
4,Isodora Elsebeth Annemarie Nielsen,F,,1960,64,Denmark,,Raw,Masters 3,82.65,84,82.5,-90,-90,82.5,47.5,50,-52.5,50,110,117.5,120,120,252.5,SBD
3,Ann Jordebo,F,,1960,64,Sweden,,Raw,Masters 3,82.8,84,115,122.5,127.5,127.5,-60,60,-65,60,130,140,-147.5,140,327.5,SBD
6,Irene Matinpalo,F,,1961,63,Finland,,Raw,Masters 3,71.7,76,80,85,90,90,40,42.5,45,45,115,-122.5,-122.5,115,250,SBD
1,Tracy Chipping,F,,1961,63,New Zealand,,Raw,Masters 3,83.95,84,117.5,122.5,125,125,67.5,72.5,77.5,77.5,140,150,152.5,152.5,355,SBD
1,Leena Jokitalo,F,,1961,63,Finland,,Raw,Masters 3,55.95,57,112.5,120.5,125.5,125.5,52.5,55,57.5,57.5,130,140,142.5,142.5,325.5,SBD
6,Åshild Bjørnerem,F,,1961,63,Norway,,Raw,Masters 3,68.45,69,95,100,-105,100,55,57.5,60,60,125,130,135,135,295,SBD
1,Shigemi Imai,F,,1962,62,Japan,,Raw,Masters 3,50.7,52,75,80,85,85,47.5,50,-52.5,50,102.5,115,117.5,117.5,252.5,SBD
5,Kelly Wharton,F,,1962,62,Canada,,Raw,Masters 3,60.75,63,97.5,105,110,110,52.5,55,-57.5,55,-115,115,122.5,122.5,287.5,SBD
5,Sue Moar,F,,1962,62,New Zealand,,Raw,Masters 3,54.7,57,77.5,87.5,-90,87.5,42.5,45,-47.5,45,107.5,117.5,122.5,122.5,255,SBD
3,Clair Angel,F,,1963,61,Australia,,Raw,Masters 3,56.8,57,90,97.5,-100,97.5,47.5,52.5,55,55,120,127.5,-135,127.5,280,SBD
1,Deborah Tiernan,F,,1963,61,UK,,Raw,Masters 3,60.15,63,115,120,-122.5,120,65,70,-72.5,70,135,145,152.5,152.5,342.5,SBD
4,Annette Taylor,F,,1963,61,Australia,,Raw,Masters 3,61.75,63,110,-117.5,-117.5,110,55,60,-62.5,60,137.5,145,-150,145,315,SBD
2,Denise Bird,F,,1963,61,UK,,Raw,Masters 3,55.55,57,102.5,105,107.5,107.5,52.5,-57.5,57.5,57.5,127.5,135,140,140,305,SBD
4,Mari Noguchi,F,,1963,61,Japan,,Raw,Masters 3,56,57,80,85,90,90,40,42.5,-45,42.5,120,130,-135,130,262.5,SBD
2,Karen Humphreys,F,,1963,61,New Zealand,,Raw,Masters 3,62.45,63,112.5,117.5,120.5,120.5,62.5,65,67.5,67.5,142.5,150,-155,150,338,SBD
2,Catherine Davies,F,,1963,61,UK,,Raw,Masters 3,82.1,84,117.5,122.5,127.5,127.5,55,62.5,-65,62.5,135,142.5,150,150,340,SBD
3,Jackie Blasbery,F,,1963,61,UK,,Raw,Masters 3,97.7,84+,110,120,127.5,127.5,75,85,90,90,155,165,-175.5,165,382.5,SBD
2,Jessica Marshall #1,F,,1963,61,USA,,Raw,Masters 3,66.1,69,112.5,120.5,123,123,52.5,57.5,62.5,62.5,152.5,162.5,167.5,167.5,353,SBD
3,Gro-Berit Stavheim,F,,1964,60,Norway,,Raw,Masters 3,73.2,76,115,120,122.5,122.5,72.5,75,76.5,76.5,120,125,130,130,329,SBD
DQ,Susanne Steidle,F,,1964,60,Germany,,Raw,Masters 3,90.15,84+,-120,-120,-125,-120,55,65,72.5,72.5,130,140,150,150,,SBD
1,Outi Nurmilaukas,F,,1964,60,Finland,,Raw,Masters 3,66.85,69,95,105,-112.5,105,70,72.5,-75,72.5,165,175,177.5,177.5,355,SBD
9,Michelle Cheam,F,,1964,60,Singapore,,Raw,Masters 3,60.6,63,62.5,67.5,72.5,72.5,35,37.5,40,40,87.5,95,-100,95,207.5,SBD
2,Ulla Nancy Jensen,F,,1964,60,Denmark,,Raw,Masters 3,70,76,100,107.5,115,115,55,60,62.5,62.5,140,147.5,152.5,152.5,330,SBD
1,Noriko Tsuji,F,,1964,60,Japan,,Raw,Masters 3,46.15,47,95,100,105,105,40,42.5,45,45,110,115,-120,115,265,SBD
1,Katarina Beremark,F,,1964,60,Sweden,,Raw,Masters 3,103.1,84+,125,135,141.5,141.5,85,90,93,93,162.5,174,177.5,177.5,412,SBD
5,Linda Jensen,F,,1965,59,Australia,,Raw,Masters 2,56.35,57,100,-105,105,105,62.5,67.5,-70,67.5,147.5,155,160,160,332.5,SBD
11,Fiona Wallace,F,,1966,58,Australia,,Raw,Masters 2,73.8,76,105,110,112.5,112.5,62.5,65,67.5,67.5,130,137.5,-142.5,137.5,317.5,SBD
7,Christine Nguyen,F,,1966,58,Canada,,Raw,Masters 2,61.9,63,117.5,122.5,127.5,127.5,52.5,55,57.5,57.5,127.5,132.5,135,135,320,SBD
2,Heather Tagg,F,,1966,58,UK,,Raw,Masters 2,74.65,76,-150,150,157.5,157.5,70,75,77.5,77.5,180,190,198.5,198.5,433.5,SBD
3,Tomoko Tasaka,F,,1966,58,Japan,,Raw,Masters 2,51.8,52,-95,97.5,102.5,102.5,57.5,60,-62.5,60,107.5,115,-125,115,277.5,SBD
7,Hope Powers,F,,1967,57,Australia,,Raw,Masters 2,121.05,84+,120,142.5,150,150,70,-77.5,77.5,77.5,130,150,-162.5,150,377.5,SBD
2,Noémie Girot,F,,1967,57,France,,Raw,Masters 2,61.75,63,125,130,135,135,75,77.5,-80,77.5,160,167.5,-172.5,167.5,380,SBD
6,Sue Sweeney,F,,1967,57,Australia,,Raw,Masters 2,67.45,69,97.5,105,110,110,47.5,52.5,-55,52.5,125,135,-142.5,135,297.5,SBD
9,Sabine Wittenburg,F,,1967,57,Germany,,Raw,Masters 2,62.3,63,85,90,92.5,92.5,55,60,62.5,62.5,107.5,112.5,117.5,117.5,272.5,SBD
DQ,Magdolna Petróczki,F,,1968,56,Hungary,,Raw,Masters 2,50.75,52,-80,-85,-85,-80,70,72.5,-75,72.5,115,125,135,135,,SBD
2,Suzanne Hartwig-Gary,F,,1968,56,USA,,Raw,Masters 2,56.25,57,132.5,140.5,143,143,62.5,67.5,72.5,72.5,132.5,142.5,-147.5,142.5,358,SBD
4,Florence Leccese,F,,1969,55,France,,Raw,Masters 2,67.5,69,125,130,135,135,77.5,-80,-80,77.5,120,125,130,130,342.5,SBD
3,Jane Kvelland Berntsen,F,,1969,55,Norway,,Raw,Masters 2,56.8,57,115,122.5,127.5,127.5,65,70,72.5,72.5,127.5,140,-150,140,340,SBD
1,Eva Buxbom,F,,1969,55,Denmark,,Raw,Masters 2,51.45,52,95,100,105,105,55,60,-62.5,60,130,140,145,145,310,SBD
4,Cathy Avery,F,,1969,55,USA,,Raw,Masters 2,63,63,125,-132.5,-132.5,125,77.5,82.5,85,85,140,147.5,-155,147.5,357.5,SBD
2,Angelina Lane,F,,1969,55,UK,,Raw,Masters 2,51.75,52,95,100,-105,100,50,55,57.5,57.5,110,120,-127.5,120,277.5,SBD
10,Bonita Bloem,F,,1969,55,South Africa,,Raw,Masters 2,73.85,76,112.5,120,125,125,-57.5,57.5,62.5,62.5,120,130,137.5,137.5,325,SBD
4,Vanessa Schlebusch,F,,1970,54,South Africa,,Raw,Masters 2,50,52,60,70,-80,70,40,45,-47.5,45,105,-110,110,110,225,SBD
3,Lilyan Jackson,F,,1970,54,USA,,Raw,Masters 2,172.35,84+,160,167.5,175,175,110,117.5,125,125,165,180,192.5,192.5,492.5,SBD
9,Corrinna Fahey,F,,1970,54,Canada,,Raw,Masters 2,75.75,76,120,125,127.5,127.5,52.5,57.5,60,60,132.5,140,145,145,332.5,SBD
1,Patricia Johnson,F,,1970,54,USA,,Raw,Masters 2,101.45,84+,-180,180,-192.5,180,115,122.5,-128,122.5,210,220,230,230,532.5,SBD
4,Gillian Lomax,F,,1970,54,UK,,Raw,Masters 2,100.9,84+,147.5,155,162.5,162.5,82.5,85,87.5,87.5,165,175,185,185,435,SBD
DQ,Leah Cruciani,F,,1970,54,USA,,Raw,Masters 2,61.1,63,-110,-110,-110,-110,,,,,,,,,,SBD
3,Terrie Redmore,F,,1970,54,UK,,Raw,Masters 2,68.4,69,137.5,-145,145,145,80,85,87.5,87.5,140,147.5,155,155,387.5,SBD
6,Kylie Dwyer,F,,1970,54,Australia,,Raw,Masters 2,73.25,76,-115,115,120,120,65,70,72.5,72.5,155,162.5,172.5,172.5,365,SBD
8,Misako Hashimoto,F,,1970,54,Japan,,Raw,Masters 2,55.45,57,-85,85,-97.5,85,50,52.5,-55,52.5,110,120,-130,120,257.5,SBD
7,Paulina Tanoto,F,,1970,54,Singapore,,Raw,Masters 2,53.4,57,97.5,102.5,-105,102.5,45,47.5,50,50,112.5,120,-125,120,272.5,SBD
8,Bobby-Jo Williamson,F,,1971,53,New Zealand,,Raw,Masters 2,74.65,76,115,120,125,125,80,85,,85,137.5,145,-150,145,355,SBD
5,Ali Cosner,F,,1971,53,New Zealand,,Raw,Masters 2,83.05,84,122.5,130,137.5,137.5,82.5,87.5,90,90,172.5,185,-192.5,185,412.5,SBD
2,Lisa Herrington,F,,1971,53,UK,,Raw,Masters 2,82.15,84,142.5,150,157.5,157.5,77.5,82.5,-85,82.5,182.5,195,-200,195,435,SBD
5,Jessica Jading,F,,1971,53,Sweden,,Raw,Masters 2,62.1,63,100,110,115,115,57.5,60,65,65,155,165,175,175,355,SBD
1,Antoinette Kriel,F,,1971,53,South Africa,,Raw,Masters 2,55.75,57,120,125,-130,125,75,80,82.5,82.5,162.5,171,181,181,388.5,SBD
4,Suellen Lugg,F,,1971,53,New Zealand,,Raw,Masters 2,82.8,84,162.5,-170,170,170,75,77.5,80,80,162.5,172.5,-180,172.5,422.5,SBD
5,Mervi Sirkiä,F,,1972,52,Finland,,Raw,Masters 2,51.8,52,25,,,25,62.5,65,-67.5,65,45,,,45,135,SBD
2,Ime Telea,F,,1972,52,New Zealand,,Raw,Masters 2,115.2,84+,155,165,-170,165,102.5,110,115,115,192.5,207.5,212.5,212.5,492.5,SBD
6,Jillian Sproul,F,,1972,52,Canada,,Raw,Masters 2,76.1,84,-125,-125,125,125,70,-75,-75,70,130,140,147.5,147.5,342.5,SBD
5,Lorraine McKenna,F,,1973,51,Ireland,,Raw,Masters 2,87.9,84+,147.5,157.5,165,165,62.5,67.5,70,70,160,167.5,175,175,410,SBD
1,Elisabeth Barry,F,,1973,51,South Africa,,Raw,Masters 2,46.9,47,65,75,-82.5,75,32.5,35,37.5,37.5,80,95,105,105,217.5,SBD
1,Joah Iannotta,F,,1973,51,USA,,Raw,Masters 2,75.3,76,145,152.5,157.5,157.5,105,110,-115,110,180,187.5,195,195,462.5,SBD
8,Hege Velten,F,,1973,51,Norway,,Raw,Masters 2,62.25,63,110,117.5,120,120,60,62.5,65,65,130,-137.5,-137.5,130,315,SBD
4,Anna Sashegyi,F,,1973,51,Hungary,,Raw,Masters 2,75.05,76,135,145,147.5,147.5,80,-85,-87.5,80,155,165,177.5,177.5,405,SBD
1,Sylvia Atkinson #1,F,,1973,51,Canada,,Raw,Masters 2,67.85,69,160,168.5,173,173,75,80,82.5,82.5,185,192.5,196,196,451.5,SBD
2,Tasha Williams,F,,1973,51,New Zealand,,Raw,Masters 2,68.35,69,110,117.5,-122.5,117.5,75,80,82.5,82.5,165,185,187.5,187.5,387.5,SBD
6,Theresa Kwan,F,,1973,51,Canada,,Raw,Masters 2,56.55,57,95,100,105,105,55,57.5,60,60,140,147.5,-152.5,147.5,312.5,SBD
3,Nadina Taharally,F,,1973,51,Guyana,,Raw,Masters 2,74.75,76,142.5,147.5,150,150,75,77.5,-80,77.5,170,175,182.5,182.5,410,SBD
5,Joanne Rose,F,,1973,51,Canada,,Raw,Masters 2,67.55,69,105,-110,-110,105,62.5,67.5,70,70,145,152.5,157.5,157.5,332.5,SBD
3,Siri Hoogen,F,,1974,50,USA,,Raw,Masters 2,82.15,84,145,155,160,160,85,90,92.5,92.5,165,175,-180,175,427.5,SBD
3,Katja Kärkkäinen,F,,1974,50,Finland,,Raw,Masters 2,61.85,63,130,135,137.5,137.5,77.5,80,82.5,82.5,140,145,147.5,147.5,367.5,SBD
6,Elizabeth Hall,F,,1974,50,New Zealand,,Raw,Masters 2,85.9,84+,145,-160,-162.5,145,70,75,77.5,77.5,145,160,-167.5,160,382.5,SBD
7,Christina Fordyce,F,,1974,50,New Zealand,,Raw,Masters 2,73.65,76,100,110,115,115,75,80,82.5,82.5,145,157.5,167.5,167.5,365,SBD
4,Kimberly Ellis #1,F,,1974,50,Belgium,,Raw,Masters 2,56.25,57,112.5,117.5,-120,117.5,67.5,-70,-70,67.5,135,142.5,150,150,335,SBD
5,Amelie Mayo,F,,1974,50,Canada,,Raw,Masters 2,74.15,76,100,107.5,115,115,60,65,67.5,67.5,175,187.5,192.5,192.5,375,SBD
9,Solveig Mehlum Teppen,F,,1975,49,Norway,,Raw,Masters 1,56.8,57,95,-102.5,102.5,102.5,70,-75,-75,70,130,140,150,150,322.5,SBD
1,Adriana Pence,F,,1975,49,US Virgin Islands,,Raw,Masters 1,51.9,52,130,135,140,140,57.5,60,62.5,62.5,157.5,165,-170,165,367.5,SBD
6,Jacqui Broesky,F,,1975,49,Canada,,Raw,Masters 1,90.7,84+,140,150,155,155,90,95,100,100,145,155,162.5,162.5,417.5,SBD
4,Sandra Burke,F,,1976,48,Ireland,,Raw,Masters 1,56.05,57,-112.5,112.5,117.5,117.5,57.5,60,62.5,62.5,160,170,175,175,355,SBD
10,Danielle Hussey,F,,1976,48,Canada,,Raw,Masters 1,56.45,57,117.5,-122.5,127.5,127.5,60,62.5,65,65,115,122.5,127.5,127.5,320,SBD
4,Emmannuelle Archambault,F,,1976,48,Canada,,Raw,Masters 1,67.3,69,130,137.5,142.5,142.5,87.5,92.5,95,95,172.5,182.5,187.5,187.5,425,SBD
5,Michelle Vandegriend,F,,1976,48,Canada,,Raw,Masters 1,60.4,63,100,107.5,-112.5,107.5,75,80,82.5,82.5,162.5,-170,-170,162.5,352.5,SBD
8,Jasmin Treimer,F,,1976,48,Germany,,Raw,Masters 1,56.95,57,97.5,105,110,110,55,60,-62.5,60,150,157.5,160,160,330,SBD
2,Helen Hughes #1,F,,1976,48,UK,,Raw,Masters 1,55.95,57,117.5,-125,125,125,80,82.5,-85,82.5,147.5,157.5,160,160,367.5,SBD
3,Karen Tvedt,F,,1977,47,Norway,,Raw,Masters 1,82,84,150,162.5,175,175,97.5,102.5,-107.5,102.5,175,182.5,-187.5,182.5,460,SBD
1,Iolanda Costa Zolyome,F,,1977,47,Brazil,,Raw,Masters 1,77.55,84,-165,175,180,180,97.5,102.5,107.5,107.5,182.5,187.5,192.5,192.5,480,SBD
9,Sarah Wheal,F,,1977,47,Australia,,Raw,Masters 1,75.35,76,120,127.5,132.5,132.5,85,90,,90,147.5,155,162.5,162.5,385,SBD
11,Phokwane Moloele,F,,1977,47,South Africa,,Raw,Masters 1,81.55,84,-130,130,145,145,65,72.5,77.5,77.5,155,170,-180,170,392.5,SBD
1,Melissa Copeland,F,,1977,47,USA,,Raw,Masters 1,123.4,84+,202.5,212.5,215,215,130,-135,135,135,200,205,-210,205,555,SBD
10,Laurence Barlieu,F,,1977,47,France,,Raw,Masters 1,68.2,69,105,112.5,117.5,117.5,52.5,57.5,-60,57.5,140,150,-160,150,325,SBD
1,Rebecca Heath #1,F,,1977,47,UK,,Raw,Masters 1,46.35,47,105,-110,110,110,62.5,67.5,70,70,125,135,142.5,142.5,322.5,SBD
DQ,Lauren Jones,F,,1977,47,South Africa,,Raw,Masters 1,120.4,84+,-177.5,-177.5,-177.5,-177.5,77.5,87.5,-90,87.5,175,185,-192.5,185,,SBD
7,Anita Broczek,F,,1977,47,New Zealand,,Raw,Masters 1,67.4,69,120,125,130,130,77.5,82.5,85,85,145,155,157.5,157.5,372.5,SBD
6,Aileen Muldoon,F,,1978,46,Ireland,,Raw,Masters 1,73.8,76,137.5,147.5,-152.5,147.5,80,85,-87.5,85,165,175,185,185,417.5,SBD
7,Helen Frank,F,,1978,46,Australia,,Raw,Masters 1,56.35,57,117.5,125,-127.5,125,67.5,72.5,75,75,122.5,132.5,137.5,137.5,337.5,SBD
4,Tarryn Valle,F,,1978,46,South Africa,,Raw,Masters 1,51.3,52,85,90,-92.5,90,50,55,-57.5,55,132.5,140,-142.5,140,285,SBD
7,Pia Marangoni,F,,1978,46,South Africa,,Raw,Masters 1,75.35,76,145,152.5,-155,152.5,70,75,77.5,77.5,160,170,180,180,410,SBD
1,Kimberly Walford,F,,1978,46,US Virgin Islands,,Raw,Masters 1,74.95,76,165,172.5,177.5,177.5,102.5,107.5,110,110,230,237.5,-245,237.5,525,SBD
8,Camilla Kjærside,F,,1978,46,Denmark,,Raw,Masters 1,62.45,63,102.5,110,115,115,55,-57.5,-57.5,55,130,-140,,130,300,SBD
7,Anne Bernard,F,,1978,46,France,,Raw,Masters 1,61.9,63,110,112.5,115,115,60,-65,65,65,145,155,165,165,345,SBD
6,Teija Grönlund,F,,1979,45,Finland,,Raw,Masters 1,65.85,69,127.5,135,140,140,67.5,72.5,77.5,77.5,157.5,170,-180,170,387.5,SBD
10,Lakesha Lee,F,,1979,45,US Virgin Islands,,Raw,Masters 1,71.65,76,107.5,115,125,125,77.5,85,-92.5,85,135,155,-175,155,365,SBD
4,Meaghan Trovato,F,,1979,45,Australia,,Raw,Masters 1,62,63,125,-130,130,130,77.5,82.5,85,85,152.5,157.5,-165,157.5,372.5,SBD
12,Morgan Haupt,F,,1979,45,Canada,,Raw,Masters 1,83.6,84,122.5,127.5,132.5,132.5,75,-80,80,80,155,165,-170,165,377.5,SBD
3,Kazuyo Shindo,F,,1979,45,Japan,,Raw,Masters 1,46.65,47,82.5,87.5,-90,87.5,45,47.5,50,50,100,107.5,110,110,247.5,SBD
3,Jennifer Sauter,F,,1979,45,USA,,Raw,Masters 1,68.55,69,150,157.5,-162.5,157.5,77.5,82.5,85,85,170,180,187.5,187.5,430,SBD
9,Jeri Munroe,F,,1979,45,Canada,,Raw,Masters 1,67.35,69,117.5,122.5,-125,122.5,65,-70,-70,65,145,155,160,160,347.5,SBD
11,Natsuki Iha,F,,1980,44,Japan,,Raw,Masters 1,56.75,57,107.5,115,-122.5,115,52.5,57.5,-60,57.5,130,145,-157.5,145,317.5,SBD
4,Genevieve Collins,F,,1980,44,UK,,Raw,Masters 1,74.25,76,155,162.5,165,165,87.5,92.5,95,95,172.5,182.5,187.5,187.5,447.5,SBD
5,Saudi Tan Sze Yin,F,,1980,44,Singapore,,Raw,Masters 1,66.85,69,130,135,142.5,142.5,75,80,-85,80,152.5,160,167.5,167.5,390,SBD
9,Angela Vitanza,F,,1980,44,Australia,,Raw,Masters 1,83.95,84,135,145,150,150,90,95,97.5,97.5,170,177.5,182.5,182.5,430,SBD
10,Abbi Bosward-Fielding,F,,1981,43,Australia,,Raw,Masters 1,82.05,84,-147.5,-147.5,147.5,147.5,80,85,-90,85,162.5,177.5,-195,177.5,410,SBD
8,Cassie Moreland,F,,1981,43,New Zealand,,Raw,Masters 1,83.45,84,160,167.5,172.5,172.5,65,70,72.5,72.5,182.5,187.5,-195,187.5,432.5,SBD
6,Therese Opsahl,F,,1981,43,Norway,,Raw,Masters 1,56.6,57,110,115,120,120,57.5,62.5,65,65,145,155,-157.5,155,340,SBD
8,Yunie Yang,F,,1981,43,Singapore,,Raw,Masters 1,87.9,84+,115,125,132.5,132.5,80,85,-90,85,147.5,160,-170,160,377.5,SBD
2,Melissa Stone,F,,1981,43,Canada,,Raw,Masters 1,75,76,172.5,177.5,182.5,182.5,87.5,92.5,95,95,192.5,200,-205,200,477.5,SBD
2,Natalie Bartolo,F,,1981,43,Australia,,Raw,Masters 1,51.7,52,-110,110,-117.5,110,67.5,72.5,-75,72.5,130,140,142.5,142.5,325,SBD
5,Chereny Woodard,F,,1981,43,USA,,Raw,Masters 1,80.9,84,130,142.5,150,150,92.5,97.5,102.5,102.5,170,185,195,195,447.5,SBD
5,Naomi Mynott,F,,1982,42,Australia,,Raw,Masters 1,74.2,76,145,155,-160,155,77.5,82.5,-85,82.5,170,-182.5,182.5,182.5,420,SBD
2,Hira Teirney,F,,1982,42,UK,,Raw,Masters 1,82,84,152.5,160,165,165,80,82.5,85,85,197.5,212.5,215,215,465,SBD
8,Michelle Kramarczuk,F,,1982,42,Australia,,Raw,Masters 1,68.65,69,120,127.5,135,135,77.5,82.5,-85,82.5,137.5,147.5,155,155,372.5,SBD
5,Berni Ong,F,,1982,42,Singapore,,Raw,Masters 1,54.7,57,100,107.5,112.5,112.5,65,70,72.5,72.5,140,147.5,155,155,340,SBD
7,Rhonda Sanchez,F,,1982,42,Trinidad and Tobago,,Raw,Masters 1,97.9,84+,145,155,162.5,162.5,65,70,-77.5,70,-150,150,167.5,167.5,400,SBD
4,Wendy MacFarlane,F,,1982,42,UK,,Raw,Masters 1,83.55,84,172.5,180,-185,180,82.5,90,92.5,92.5,182.5,-190,-190,182.5,455,SBD
2,Morayo Akinsanya,F,,1982,42,Canada,,Raw,Masters 1,61.7,63,127.5,132.5,137.5,137.5,72.5,77.5,82.5,82.5,167.5,180,187.5,187.5,407.5,SBD
1,Hannah Yardy,F,,1982,42,UK,,Raw,Masters 1,62.6,63,142.5,150,-155,150,87.5,92.5,97.5,97.5,175,185,197.5,197.5,445,SBD
2,Alexa Sperske,F,,1982,42,USA,,Raw,Masters 1,68.65,69,152.5,157.5,162.5,162.5,72.5,77.5,80,80,182.5,192.5,197.5,197.5,440,SBD
7,Margaret Carey #1,F,,1982,42,Ireland,,Raw,Masters 1,82.5,84,152.5,160,167.5,167.5,80,85,87.5,87.5,177.5,-187.5,-187.5,177.5,432.5,SBD
4,Marie Duprat,F,,1983,41,France,,Raw,Masters 1,46,47,80,85,87.5,87.5,37.5,40,-42.5,40,110,-115,-120,110,237.5,SBD
2,Claire Roberts,F,,1983,41,UK,,Raw,Masters 1,99.65,84+,180,192.5,197.5,197.5,100,107.5,112.5,112.5,207.5,217.5,222.5,222.5,532.5,SBD
11,Patsakrit Nualnim,F,,1983,41,Thailand,,Raw,Masters 1,69.05,76,120,127.5,135,135,55,60,-65,60,145,155,162.5,162.5,357.5,SBD
DQ,Leah Goldring,F,,1983,41,USA,,Raw,Masters 1,51.3,52,-127.5,-127.5,-127.5,-127.5,80,85,87.5,87.5,165,175,-182.5,175,,SBD
5,Marina van der Linde,F,,1983,41,South Africa,,Raw,Masters 1,105.8,84+,165,175,185,185,95,100,102.5,102.5,185,200,-207.5,200,487.5,SBD
2,Britt Kapteina,F,,1983,41,Germany,,Raw,Masters 1,44.25,47,92.5,97.5,100,100,52.5,55,-60,55,112.5,120,-130,120,275,SBD
4,Rebecca Coggle,F,,1983,41,UK,,Raw,Masters 1,148.8,84+,202.5,-212.5,212.5,212.5,120,127.5,-132.5,127.5,155,165,-177.5,165,505,SBD
3,Nopparat Rerkpisut,F,,1984,40,Thailand,,Raw,Masters 1,49.9,52,92.5,100,-105,100,45,47.5,-50,47.5,140,147.5,-155,147.5,295,SBD
3,Erin Riddle,F,,1984,40,USA,,Raw,Masters 1,55.45,57,130,137.5,140,140,65,70,-72.5,70,145,152.5,155,155,365,SBD
6,Mayumi Honda,F,,1984,40,Japan,,Raw,Masters 1,61.9,63,125,-135,-135,125,67.5,-75,77.5,77.5,130,145,150,150,352.5,SBD
1,Johanna Kankus-Mikkola,F,,1984,40,Finland,,Raw,Masters 1,66.35,69,170,180,188,188,92.5,97.5,102.5,102.5,150,157.5,162.5,162.5,453,SBD
8,Melanie Leibold,F,,1984,40,Germany,,Raw,Masters 1,74,76,127.5,135,140,140,77.5,82.5,85,85,150,160,167.5,167.5,392.5,SBD
3,Esther Scott,F,,1984,40,USA,,Raw,Masters 1,74.7,76,167.5,175,180,180,92.5,97.5,100,100,175,185,-192.5,185,465,SBD
3,Kim Gough,F,,1958,66,UK,,Raw,Masters 3,62.05,63,107.5,112.5,117.5,117.5,55,57.5,-60,57.5,145,155,-160,155,330,SBD
1,Elsa Pálsdóttir,F,,1960,64,Iceland,,Raw,Masters 3,74.65,76,135,-146,-146,135,57.5,62.5,65,65,155,160,162.5,162.5,362.5,SBD
1,Lapanda Mampikin,F,,1967,57,Netherlands,,Raw,Masters 2,81.2,84,150,160,165,165,80,90,-92.5,90,190,-220,-220,190,445,SBD
6,Sonia Reeve,F,,1972,52,UK,,Raw,Masters 2,62.15,63,-102.5,102.5,105,105,45,50,52.5,52.5,170,180,185,185,342.5,SBD
8,Eulalia Baltrons Vieta,F,,1973,51,Spain,,Raw,Masters 2,88.35,84+,120,-125,130,130,50,-60,-60,50,130,140,150,150,330,SBD
1,Colette Haddon,F,,1974,50,Netherlands,,Raw,Masters 2,62.75,63,140,146,-150.5,146,70,72.5,75,75,165,172.5,175,175,396,SBD
6,Mirjam Loerakker,F,,1979,45,Netherlands,,Raw,Masters 1,82.4,84,165,175,-180,175,85,-90,-90,85,175,182.5,-187.5,182.5,442.5,SBD
3,Rachida Moumen,F,,1980,44,Morocco,,Raw,Masters 1,62.6,63,-150,150,-160,150,75,-77.5,,75,170,-177.5,-177.5,170,395,SBD
1,Zoraida Bermúdez Doce,F,,1983,41,Spain,,Raw,Masters 1,56.5,57,-132.5,-132.5,132.5,132.5,85,87.5,90,90,145,152.5,157.5,157.5,380,SBD
3,Anna Wieczorek,F,,1984,40,Poland,,Raw,Masters 1,100.85,84+,-195,195,212.5,212.5,97.5,105,107.5,107.5,185,195,197.5,197.5,517.5,SBD
