Place,Name,Sex,BirthDate,Age,Country,Equipment,Division,BodyweightKg,WeightClassKg,Squat1Kg,Squat2Kg,Squat3Kg,Best3SquatKg,Bench1Kg,Bench2Kg,Bench3Kg,Best3BenchKg,Deadlift1Kg,Deadlift2Kg,Deadlift3Kg,Best3DeadliftKg,TotalKg,Event
1,Florencia Bello,F,2005-04-14,18,Argentina,Raw,Teen 18-19,61.2,67.5,110,120,-125,120,67.5,75,-80,75,115,125,135,135,330,SBD
2,Melina Puelman,F,2007-08-25,16,Argentina,Raw,Teen 18-19,63.6,67.5,85,90,95,95,45,50,-55,50,105,112.5,120,120,265,SBD
1,Nahiara Navarro,F,2007-12-27,15,Argentina,Raw,Teen 18-19,69.4,75,-90,-100,100,100,30,40,-50,40,95,110,117.5,117.5,257.5,SBD
1,Aimara Daros,F,2003-10-24,20,Argentina,Raw,J20-23,84.8,90,135,145,152.5,152.5,65,67.5,72.5,72.5,175,185,195,195,420,SBD
1,Rocío Hernández,F,1983-07-04,40,Argentina,Raw,M40-44,53.2,56,85,-95,-100,85,-47.5,52.5,-55,52.5,110,120,130,130,267.5,SBD
1,Mery Ortiz,F,1980-09-21,43,Argentina,Raw,M40-44,80.4,82.5,85,92.5,100,100,45,-52.5,-52.5,45,100,115,125,125,270,SBD
1,Lilian Fernandez,F,1974-11-19,49,Argentina,Raw,M45-49,76.8,82.5,100,112.5,120,120,55,60,-62.5,60,120,127.5,130,130,310,SBD
1,Ana Maria Cardenas,F,1971-07-20,52,Argentina,Raw,M50-54,56.6,60,80,90,-100,90,45,55,-62.5,55,100,110,120,120,265,SBD
1,Nahir Bejarano,F,1996-03-15,27,Argentina,Raw,Open,56,56,-105,115,-130,115,50,-60,-60,50,110,117.5,-125,117.5,282.5,SBD
2,Luján Solis,F,1991-11-22,32,Argentina,Raw,Open,53.2,56,80,-90,92.5,92.5,42.5,47.5,-50,47.5,100,110,120,120,260,SBD
3,Anahi Fuentes,F,1993-03-14,30,Argentina,Raw,Open,54.3,56,-90,90,95,95,45,50,-55,50,110,115,-120,115,260,SBD
1,Belén Opazo,F,1991-05-01,32,Argentina,Raw,Open,65.6,67.5,125,132.5,140,140,87.5,92.5,-95,92.5,145,155,-165,155,387.5,SBD
2,Mayra Alvarez,F,1996-05-06,27,Argentina,Raw,Open,63.8,67.5,130,135,140,140,60,65,67.5,67.5,130,135,142.5,142.5,350,SBD
3,Lilen Areco,F,1999-06-28,24,Argentina,Raw,Open,62.2,67.5,115,122.5,127.5,127.5,60,62.5,-65,62.5,145,152.5,-160,152.5,342.5,SBD
4,Giselle Barros,F,1984-06-11,39,Argentina,Raw,Open,63.1,67.5,-75,-75,75,75,45,50,-55,50,100,110,120,120,245,SBD
1,Daniela Huenchullan,F,1993-07-20,30,Argentina,Raw,Open,68.2,75,125,-135,135,135,52.5,57.5,62.5,62.5,130,140,150,150,347.5,SBD
2,Violeta Parra,F,1995-02-06,28,Argentina,Raw,Open,71.6,75,85,95,105,105,47.5,52.5,-57.5,52.5,130,140,150,150,307.5,SBD
3,Milagros Rossi,F,1998-11-21,25,Argentina,Raw,Open,74.8,75,-90,-90,90,90,40,45,-50,45,125,130,135,135,270,SBD
4,Eda Cañiupan,F,1997-06-17,26,Argentina,Raw,Open,69.2,75,90,100,-110,100,40,45,-47.5,45,100,-110,110,110,255,SBD
5,Elibet Acuña,F,1988-10-19,35,Argentina,Raw,Open,71.3,75,75,-85,85,85,45,-50,-50,45,105,115,125,125,255,SBD
1,Andrea Pinilla,F,1997-09-02,26,Argentina,Raw,Open,77.5,82.5,60,65,-70,65,35,40,-45,40,100,105,-115,105,210,SBD
1,Soledad Nuñez,F,1984-02-19,39,Argentina,Raw,Open,89.3,90,110,115,125,125,47.5,-52.5,-52.5,47.5,120,135,150,150,322.5,SBD
1,Ninke Maldonado,F,1988-10-13,35,Argentina,Wraps,Open,57.7,60,110,115,125,125,50,55,-60,55,110,115,120,120,300,SBD
1,Amanda Becerra,F,1985-06-30,38,Argentina,Wraps,Open,67.5,67.5,125,-132.5,-140,125,70,75,77.5,77.5,130,140,155,155,357.5,SBD
2,Daniela Ledesma,F,1993-10-16,30,Argentina,Wraps,Open,64,67.5,110,117.5,122.5,122.5,50,52.5,-55,52.5,120,130,137.5,137.5,312.5,SBD
1,Jimena Reina,F,1986-01-10,37,Argentina,Wraps,Open,69.8,75,120,130,-140,130,45,-50,-50,45,120,-130,140,140,315,SBD
1,Gimena Marilef,F,1995-09-05,28,Argentina,Wraps,Open,103.4,90+,125,140,150,150,55,62.5,-70,62.5,145,160,-170,160,372.5,SBD
1,Brisa Bernales,F,2001-08-29,22,Argentina,Raw,J20-23,48,48,,,,,,,,,90,95,-100,95,95,D
1,Tamara Comas,F,1995-12-24,27,Argentina,Raw,Open,59.3,60,,,,,,,,,120,122.5,-125,122.5,122.5,D
1,Lilen Areco,F,1999-06-28,24,Argentina,Raw,Open,62.2,67.5,,,,,,,,,145,152.5,-160,152.5,152.5,D
1,Milagros Rossi,F,1998-11-21,25,Argentina,Raw,Open,74.8,75,,,,,,,,,125,130,135,135,135,D
1,Amir Becerra,M,2014-06-27,9,Argentina,Raw,Youth,51.8,52,30,37.5,42.5,42.5,22.5,25,-27.5,25,52.5,62.5,65,65,132.5,SBD
1,Bautista Haedo,M,2008-09-30,15,Argentina,Raw,Teen 18-19,59,60,100,110,117.5,117.5,60,-67.5,67.5,67.5,140,155,-165,155,340,SBD
2,Tomas Figueroa,M,2008-08-27,15,Argentina,Raw,Teen 18-19,59,60,90,100,-110,100,57.5,62.5,-67.5,62.5,130,-142.5,150,150,312.5,SBD
1,Pedro Lincopil,M,2006-11-15,17,Argentina,Raw,Teen 18-19,66.2,67.5,130,135,145,145,80,85,90,90,175,180,-190,180,415,SBD
1,Valentin Ulecia,M,2004-05-19,19,Argentina,Raw,Teen 18-19,72.3,75,140,150,155,155,75,-85,-90,75,180,200,215,215,445,SBD
1,Lucca Paolantonio,M,2004-04-10,19,Argentina,Raw,Teen 18-19,81.1,82.5,110,120,135,135,65,70,77.5,77.5,160,170,180,180,392.5,SBD
1,Bruno Diaz,M,2005-06-26,18,Argentina,Raw,Teen 18-19,96.8,100,190,210,-220,210,105,115,125,125,265,285,300,300,635,SBD
1,Damian Andrés,M,2000-09-28,23,Argentina,Raw,J20-23,98.6,100,165,172.5,182.5,182.5,87.5,95,-97.5,95,192.5,205,215,215,492.5,SBD
1,Héctor Varea,M,1983-08-01,40,Argentina,Raw,M40-44,109.2,110,175,-185,,175,100,-110,,100,145,155,175,175,450,SBD
1,Matías Landivar,M,1978-03-08,45,Argentina,Raw,M45-49,79.9,82.5,155,165,175,175,100,110,-115,110,180,190,205,205,490,SBD
2,Adrian Guevara,M,1978-06-29,45,Argentina,Raw,M45-49,80.4,82.5,140,150,-160,150,90,-95,-95,90,195,205,-212.5,205,445,SBD
1,Juan Díaz,M,1973-09-14,50,Argentina,Raw,M50-54,86,90,135,145,152.5,152.5,90,100,105,105,210,220,-230,220,477.5,SBD
1,Claudio Gomez,M,1967-05-18,56,Argentina,Raw,M55-59,82.4,82.5,135,137.5,140,140,85,-90,92.5,92.5,165,175,185,185,417.5,SBD
1,Rubén Opazo,M,1961-12-12,61,Argentina,Raw,M60-64,101.6,110,145,155,165,165,105,115,-120,115,185,195,205,205,485,SBD
1,Federico Ortiz,M,1991-05-15,32,Argentina,Raw,Open,66.5,67.5,172.5,180,-187.5,180,95,-105,-105,95,195,205,-215,205,480,SBD
1,Benjamín Sheffield,M,1996-01-16,27,Argentina,Raw,Open,70.9,75,140,165,170,170,-100,100,-110,100,180,200,-210,200,470,SBD
1,Gabriel Hermosilla,M,1992-01-07,31,Argentina,Raw,Open,77.1,82.5,160,172.5,180,180,100,105,110,110,235,250,260,260,550,SBD
2,Luciano Mangiarotti,M,1987-04-12,36,Argentina,Raw,Open,81,82.5,167.5,172.5,177.5,177.5,110,117.5,120,120,195,205,-210,205,502.5,SBD
3,Daniel González,M,1999-09-18,24,Argentina,Raw,Open,79.1,82.5,132.5,140,-150,140,87.5,95,-97.5,95,180,190,200,200,435,SBD
1,Martín Nion,M,1985-05-04,38,Argentina,Raw,Open,88.1,90,195,210,-220,210,115,120,-125,120,220,240,250,250,580,SBD
2,Gabriel Brizuela,M,1991-06-25,32,Argentina,Raw,Open,84.2,90,160,180,-195,180,110,115,-120,115,220,240,-260,240,535,SBD
1,Sebastián Santos,M,1996-05-19,27,Argentina,Raw,Open,98.6,100,230,240,250,250,155,162.5,170,170,270,285,-300,285,705,SBD
2,Carlos Mariñanco,M,2000-05-13,23,Argentina,Raw,Open,97.5,100,200,-220,-220,200,150,157.5,-167.5,157.5,220,-240,240,240,597.5,SBD
3,Nicolás Peralta,M,1991-09-11,32,Argentina,Raw,Open,96.1,100,165,175,190,190,95,-105,112.5,112.5,200,220,240,240,542.5,SBD
1,Damián Sánchez,M,1987-01-18,36,Argentina,Raw,Open,102,110,190,200,220,220,110,120,-130,120,270,-285,285,285,625,SBD
1,Leonel Marin,M,1993-07-12,30,Argentina,Raw,Open,123.4,125,200,210,220,220,127.5,132.5,-137.5,132.5,220,230,-240,230,582.5,SBD
2,Emmanuel Alvarez,M,1981-12-07,42,Argentina,Raw,Open,117.9,125,172.5,180,-192.5,180,92.5,100,-107.5,100,180,190,-200,190,470,SBD
1,Luciano Kissner,M,2006-12-14,16,Argentina,Wraps,Teen 18-19,58.7,60,100,110,120,120,65,70,-75,70,130,140,150,150,340,SBD
DQ,Kevin Kissner,M,2005-09-22,18,Argentina,Wraps,Teen 18-19,67.2,67.5,120,130,-145,130,,,,,,,,,,SBD
1,Gerónimo Ferrara,M,2007-12-06,16,Argentina,Wraps,Teen 18-19,72,75,165,175,180,180,95,-105,-105,95,200,210,215,215,490,SBD
2,Nicolás Moreno,M,2004-01-29,19,Argentina,Wraps,Teen 18-19,73.4,75,175,-185,-190,175,75,82.5,-87.5,82.5,162.5,172.5,185,185,442.5,SBD
3,Fermin Da Cruz,M,2005-04-26,18,Argentina,Wraps,Teen 18-19,72.4,75,132.5,145,155,155,100,-105,-105,100,160,175,-187.5,175,430,SBD
4,Martin Cacciabue,M,2006-12-26,16,Argentina,Wraps,Teen 18-19,71.3,75,105,115,120,120,60,70,77.5,77.5,145,160,170,170,367.5,SBD
1,Ignacio Tagarelli,M,2004-10-10,19,Argentina,Wraps,Teen 18-19,81.5,82.5,185,200,210,210,100,-110,-115,100,220,235,250,250,560,SBD
2,Axel Minor,M,2006-03-25,17,Argentina,Wraps,Teen 18-19,82.3,82.5,110,115,117.5,117.5,65,-70,70,70,145,152.5,162.5,162.5,350,SBD
1,Juan Inostroza,M,2006-02-07,17,Argentina,Wraps,Teen 18-19,84.4,90,160,175,190,190,95,105,-110,105,190,200,215,215,510,SBD
1,Tiago Arcos,M,2007-09-30,16,Argentina,Wraps,Teen 18-19,90.3,100,150,-165,-180,150,70,90,-100,90,165,180,200,200,440,SBD
1,Enzo Huenchupán,M,2001-01-15,22,Argentina,Wraps,J20-23,85.9,90,140,160,170,170,100,112.5,-117.5,112.5,200,215,230,230,512.5,SBD
2,Joaquín Romero,M,2003-06-24,20,Argentina,Wraps,J20-23,83.9,90,160,180,200,200,100,107.5,115,115,180,-200,-200,180,495,SBD
1,Gonzalo Valdebenito,M,2000-01-21,23,Argentina,Wraps,J20-23,134.5,140,230,245,255,255,110,120,-130,120,235,250,262.5,262.5,637.5,SBD
1,Jonatan Acosta,M,1983-04-22,40,Argentina,Wraps,M40-44,73.1,75,-155,160,175,175,100,110,-115,110,155,165,175,175,460,SBD
1,Walter Rivas,M,1979-06-02,44,Argentina,Wraps,M40-44,89.7,90,170,-180,-180,170,100,110,-125,110,140,150,160,160,440,SBD
1,Nicolás Morales,M,1991-08-02,32,Argentina,Wraps,Open,79.1,82.5,170,180,185,185,120,130,-132.5,130,210,225,232.5,232.5,547.5,SBD
2,Matias Garcia,M,1995-05-16,28,Argentina,Wraps,Open,77,82.5,170,-182.5,190,190,97.5,102.5,-105,102.5,190,202.5,-205,202.5,495,SBD
1,León Crespo,M,1989-03-22,34,Argentina,Wraps,Open,88.4,90,220,225,-230,225,-110,110,-112.5,110,207.5,215,217.5,217.5,552.5,SBD
2,Francisco Morales,M,2006-08-25,17,Argentina,Wraps,Open,84,90,160,170,180,180,90,100,-110,100,190,200,210,210,490,SBD
3,José Quijón,M,1986-02-25,37,Argentina,Wraps,Open,86.7,90,-130,135,140,140,80,-90,-90,80,125,135,145,145,365,SBD
DQ,Andrés Hugo,M,1979-12-26,43,Argentina,Wraps,Open,107.5,110,280,310,-330,310,120,,,120,,,,,,SBD
1,Javier Carrasco,M,1992-11-10,31,Argentina,Wraps,Open,119,125,220,240,245,245,110,-115,115,115,210,220,230,230,590,SBD
1,Mariano Painefil,M,1991-12-23,31,Argentina,Wraps,Open,133.4,140,-160,165,175,175,112.5,,,112.5,180,195,200,200,487.5,SBD
1,Manuel Flores,M,1985-01-25,38,Argentina,Wraps,Open,143,140+,-225,-225,225,225,-115,115,-117.5,115,220,235,-250,235,575,SBD
1,Roberto Poblete,M,1981-06-19,42,Argentina,Raw,M40-44,68.9,75,,,,,60,67.5,72.5,72.5,140,-157.5,157.5,157.5,230,BD
1,Enzo Otazo,M,2005-03-04,18,Argentina,Raw,Teen 18-19,89.4,90,,,,,100,-110,110,110,,,,,110,B
1,Sergio Morales,M,1962-05-01,61,Argentina,Raw,M60-64,109.3,110,,,,,150,160,162.5,162.5,,,,,162.5,B
1,Alexis Villalba,M,2000-01-20,23,Argentina,Raw,Open,78.6,82.5,,,,,100,110,-117.5,110,,,,,110,B
1,Martin Spitzer,M,2002-12-16,20,Argentina,Raw,Open,89.4,90,,,,,120,125,130,130,,,,,130,B
1,Cristian Artero,M,1993-03-16,30,Argentina,Raw,Open,94.2,100,,,,,127.5,135,140,140,,,,,140,B
1,Matías Mansilla,M,1997-03-06,26,Argentina,Raw,Open,100.1,110,,,,,135,145,152.5,152.5,,,,,152.5,B
1,Nicolás Morales,M,1991-08-02,32,Argentina,Raw,Open,79.1,82.5,,,,,120,130,-132.5,130,,,,,130,B
1,Mariano Painefil,M,1991-12-23,31,Argentina,Raw,Open,133.4,140,,,,,105,112.5,-117.5,112.5,,,,,112.5,B
1,Cristian Artero,M,1993-03-16,30,Argentina,Raw,Open,94.2,100,,,,,,,,,275,290,-300,290,290,D
1,Javier Carrasco,M,1992-11-10,31,Argentina,Raw,Open,119,125,,,,,,,,,230,,,230,230,D
1,Pedro Lincopil,M,2006-11-15,17,Argentina,Raw,Teen 18-19,66.2,67.5,,,,,,,,,175,180,-190,180,180,D
1,Gabriel Hermosilla,M,1992-01-07,31,Argentina,Raw,Open,77.1,82.5,,,,,,,,,235,250,260,260,260,D
1,Walter Rivas,M,1979-06-02,44,Argentina,Raw,M40-44,89.7,90,,,,,,,,,140,150,160,160,160,D
