Place,Name,Sex,BirthDate,Age,Country,State,Equipment,Division,BodyweightKg,WeightClassKg,Squat1Kg,Squat2Kg,Squat3Kg,Best3SquatKg,Bench1Kg,Bench2Kg,Bench3Kg,Best3BenchKg,Deadlift1Kg,Deadlift2Kg,Deadlift3Kg,Best3DeadliftKg,TotalKg,Event
1,Angie Schwan,F,1981-11-14,42,USA,SD,Sleeves,M40-44,81.2,82.5,102.5,117.5,-132.5,117.5,62.5,67.5,-75,67.5,140,145,155,155,340,SBD
1,Jen Veenstra,F,1977-10-24,46,USA,IA,Sleeves,M45-49,63.2,67.5,85,92.5,97.5,97.5,57.5,-60,-60,57.5,122.5,130,-137.5,130,285,SBD
1,Jen Veenstra,F,1977-10-24,46,USA,IA,Sleeves,Open,63.2,67.5,85,92.5,97.5,97.5,57.5,-60,-60,57.5,122.5,130,-137.5,130,285,SBD
2,Leah Anderson,F,1991-06-03,33,USA,SD,Sleeves,Open,67.1,67.5,97.5,102.5,110,110,55,60,62.5,62.5,100,107.5,112.5,112.5,285,SBD
1,Grace Schwan,F,2005-01-18,19,USA,SD,Sleeves,Open,74.3,75,97.5,102.5,110,110,62.5,67.5,72.5,72.5,127.5,140,142.5,142.5,325,SBD
2,Megan Johnson,F,1990-05-20,34,USA,SD,Sleeves,Open,70.8,75,37.5,42.5,47.5,47.5,-32.5,32.5,37.5,37.5,90,100,107.5,107.5,192.5,SBD
1,Christina Murphy,F,1986-11-21,37,USA,DC,Sleeves,Open,80.4,82.5,117.5,125,130,130,70,-77.5,77.5,77.5,147.5,155,160,160,367.5,SBD
2,Michelle Romans,F,1990-03-27,34,USA,ND,Sleeves,Open,82.3,82.5,100,107.5,117.5,117.5,57.5,65,-72.5,65,140,150,160,160,342.5,SBD
3,Miah Steinke,F,2001-05-07,23,USA,SD,Sleeves,Open,77.3,82.5,87.5,102.5,-107.5,102.5,62.5,67.5,70,70,120,127.5,-137.5,127.5,300,SBD
1,Gameilla Kopecky,F,2000-06-22,24,USA,SD,Sleeves,Open,87.6,90,127.5,132.5,140,140,60,65,67.5,67.5,142.5,152.5,157.5,157.5,365,SBD
2,Britini DeHaai,F,1992-09-25,31,USA,SD,Sleeves,Open,83.1,90,67.5,72.5,82.5,82.5,47.5,52.5,-57.5,52.5,122.5,127.5,137.5,137.5,272.5,SBD
DQ,Gabby Becker,F,1998-11-10,25,USA,SD,Sleeves,Open,99.6,100,107.5,112.5,-117.5,112.5,-60,-62.5,-62.5,,115,117.5,120,120,,SBD
1,Christina Murphy,F,1986-11-21,37,USA,DC,Sleeves,S35-39,80.4,82.5,117.5,125,130,130,70,-77.5,77.5,77.5,147.5,155,160,160,367.5,SBD
1,Jessica Neel,F,1989-02-23,35,USA,ND,Sleeves,S35-39,86.1,90,60,70,85,85,32.5,-42.5,47.5,47.5,92.5,102.5,115,115,247.5,SBD
2,Kayla Wells,F,1987-08-21,36,USA,SD,Sleeves,S35-39,86.1,90,67.5,72.5,-90,72.5,50,-57.5,-57.5,50,80,110,120,120,242.5,SBD
1,Grace Schwan,F,2005-01-18,19,USA,SD,Sleeves,T18-19,74.3,75,97.5,102.5,110,110,62.5,67.5,72.5,72.5,127.5,140,142.5,142.5,325,SBD
1,Emily Anderson,F,2006-07-08,18,USA,SD,Sleeves,T18-19,89.4,90,110,-115,120,120,50,52.5,-57.5,52.5,125,130,145,145,317.5,SBD
1,Melissa Olson,F,1979-05-30,45,USA,MT,Wraps,M45-49,91.2,100,70,85,92.5,92.5,-70,-70,70,70,82.5,90,97.5,97.5,260,SBD
1,Jessica Sesnie,F,1993-10-09,30,USA,NY,Single-ply,Open,79.3,82.5,120,-130,-130,120,70,77.5,-82.5,77.5,90,100,112.5,112.5,310,SBD
1,Tyler Hintz,F,1999-10-25,24,USA,SD,Sleeves,Open,70.5,75,,,,,60,62.5,65,65,130,137.5,145,145,210,BD
1,Jessica Neel,F,1989-02-23,35,USA,ND,Sleeves,S35-39,86.1,90,,,,,32.5,-42.5,47.5,47.5,92.5,102.5,115,115,162.5,BD
1,Calvin Beadle,M,2003-07-31,20,USA,SD,Sleeves,J20-23,83,90,155,165,177.5,177.5,117.5,-125,127.5,127.5,175,192.5,207.5,207.5,512.5,SBD
2,Gavin Pihlgren,M,2004-05-25,20,USA,ND,Sleeves,J20-23,85.5,90,160,172.5,182.5,182.5,127.5,137.5,145,145,142.5,162.5,172.5,172.5,500,SBD
1,Chris Hornick,M,1984-03-21,40,USA,SD,Sleeves,M40-44,88.4,90,185,195,210,210,105,112.5,-122.5,112.5,210,222.5,235,235,557.5,SBD
2,Jeff McDermott,M,1983-03-14,41,USA,FL,Sleeves,M40-44,88.4,90,165,175,182.5,182.5,127.5,137.5,145,145,205,220,-227.5,220,547.5,SBD
1,Steve Huk,M,1983-03-29,41,Canada,ON,Sleeves,M40-44,99,100,-152.5,152.5,-160,152.5,107.5,112.5,120,120,170,182.5,187.5,187.5,460,SBD
1,Brent Keller,M,1979-11-02,44,USA,ND,Sleeves,M40-44,109.5,110,207.5,217.5,227.5,227.5,135,142.5,145,145,235,-252.5,-252.5,235,607.5,SBD
1,Chris Damminger,M,1983-12-25,40,USA,NJ,Sleeves,M40-44,116.7,125,202.5,217.5,230,230,-120,132.5,-142.5,132.5,250,267.5,275,275,637.5,SBD
2,Nick Zimney,M,1981-01-20,43,USA,SD,Sleeves,M40-44,111.8,125,172.5,-182.5,187.5,187.5,177.5,-187.5,195,195,225,240,250,250,632.5,SBD
DQ,Andrew Garrison,M,1981-06-06,43,USA,CA,Sleeves,M40-44,121.9,125,190,200,207.5,207.5,-117.5,-117.5,-117.5,,210,227.5,230,230,,SBD
1,Larry Schuk,M,1977-03-15,,USA,SD,Sleeves,M45-49,93.5,100,227.5,237.5,247.5,247.5,137.5,,,137.5,240,260,-272.5,260,645,SBD
2,Dustin Marshall,M,1976-03-29,48,USA,SD,Sleeves,M45-49,98.4,100,150,162.5,-175,162.5,152.5,160,-167.5,160,215,220,-222.5,220,542.5,SBD
DQ,Chad Jones,M,1978-07-10,46,USA,AL,Sleeves,M45-49,138.8,140,180,-187.5,187.5,187.5,-130,-137.5,-142.5,,215,222.5,-230,222.5,,SBD
1,Nathan Moe,M,1974-03-03,50,USA,SD,Sleeves,M50-54,97.8,100,160,170,180,180,120,125,-130,125,182.5,192.5,202.5,202.5,507.5,SBD
1,David Koch,M,1970-10-22,53,USA,MN,Sleeves,M50-54,102.9,110,237.5,250,257.5,257.5,-160,160,-172.5,160,260,275,-282.5,275,692.5,SBD
DQ,Quinn Cunningham,M,1973-04-01,51,USA,CO,Sleeves,M50-54,106.5,110,155,-167.5,-167.5,155,-127.5,-132.5,-132.5,,150,152.5,162.5,162.5,,SBD
1,Scott Gates,M,1965-06-28,59,USA,SD,Sleeves,M55-59,90,90,175,182.5,187.5,187.5,145,157.5,-162.5,157.5,212.5,-220,-220,212.5,557.5,SBD
1,Matthias Cash,M,1998-12-13,25,USA,IN,Sleeves,Open,74.5,75,245,260,-272.5,260,150,160,167.5,167.5,260,280,-300,280,707.5,SBD
2,Andrew Michalak,M,1997-12-09,26,USA,MN,Sleeves,Open,73.9,75,152.5,160,-167.5,160,95,100,-105,100,195,210,220,220,480,SBD
1,Nathan Thomas,M,1991-12-09,32,USA,SD,Sleeves,Open,80.6,82.5,215,227.5,237.5,237.5,140,-145,145,145,270,287.5,-300,287.5,670,SBD
2,Kevin Rahill,M,1992-09-20,31,USA,OH,Sleeves,Open,81,82.5,185,195,205,205,115,120,125,125,217.5,227.5,-232.5,227.5,557.5,SBD
3,Caleb Lazure,M,2001-06-25,23,USA,NE,Sleeves,Open,78.7,82.5,167.5,177.5,-182.5,177.5,-125,130,-135,130,205,215,225,225,532.5,SBD
4,Marshall Miller,M,1985-01-24,39,USA,SD,Sleeves,Open,79.7,82.5,145,-150,-155,145,-100,102.5,107.5,107.5,180,190,-195,190,442.5,SBD
1,Greyson Phillips,M,1995-11-06,28,USA,SD,Sleeves,Open,88.8,90,232.5,252.5,265,265,155,170,180,180,240,260,272.5,272.5,717.5,SBD
2,Ryan Johnson,M,1993-01-26,,USA,SC,Sleeves,Open,86.8,90,225,237.5,242.5,242.5,147.5,157.5,,157.5,247.5,-262.5,-262.5,247.5,647.5,SBD
3,Jake Herber,M,1995-08-21,28,USA,NE,Sleeves,Open,87.9,90,-205,-210,210,210,140,-147.5,147.5,147.5,240,247.5,-255,247.5,605,SBD
4,Chris Hornick,M,1984-03-21,40,USA,SD,Sleeves,Open,88.4,90,185,195,210,210,105,112.5,-122.5,112.5,210,222.5,235,235,557.5,SBD
5,George Green,M,1996-12-08,27,USA,OH,Sleeves,Open,89,90,182.5,190,-200,190,120,125,-130,125,197.5,207.5,-217.5,207.5,522.5,SBD
1,Samuel Funderburk,M,1992-08-06,31,USA,OH,Sleeves,Open,98.9,100,257.5,272.5,-275,272.5,150,157.5,-167.5,157.5,257.5,270,-272.5,270,700,SBD
2,Nate Burlingame,M,1999-05-20,25,USA,IA,Sleeves,Open,98.4,100,250,260,-265,260,-170,177.5,182.5,182.5,240,250,-255,250,692.5,SBD
3,Larry Schuk,M,1977-03-15,,USA,SD,Sleeves,Open,93.5,100,227.5,237.5,247.5,247.5,137.5,,,137.5,240,260,-272.5,260,645,SBD
4,Zachary Houselog,M,1992-06-17,32,USA,SD,Sleeves,Open,96.8,100,210,217.5,-227.5,217.5,-135,-140,142.5,142.5,240,250,-265,250,610,SBD
5,Tommy DeFea,M,1989-03-06,35,USA,SD,Sleeves,Open,96.2,100,200,210,215,215,142.5,150,-155,150,205,215,-227.5,215,580,SBD
6,James Riley,M,1974-04-27,50,USA,NY,Sleeves,Open,90.4,100,140,145,152.5,152.5,85,87.5,-92.5,87.5,180,185,190,190,430,SBD
7,Matt Scepaniak,M,1992-01-20,32,USA,SD,Sleeves,Open,95,100,102.5,125,-142.5,125,102.5,125,137.5,137.5,102.5,142.5,165,165,427.5,SBD
1,Justin Lindner,M,1987-10-13,36,USA,SD,Sleeves,Open,106.3,110,192.5,205,215,215,177.5,187.5,-195,187.5,240,252.5,260,260,662.5,SBD
2,Paul Foss,M,1993-05-27,31,USA,SD,Sleeves,Open,107.4,110,200,-215,-215,200,142.5,150,-155,150,255,265,272.5,272.5,622.5,SBD
3,Brent Keller,M,1979-11-02,44,USA,ND,Sleeves,Open,109.5,110,207.5,217.5,227.5,227.5,135,142.5,145,145,235,-252.5,-252.5,235,607.5,SBD
4,Ryan Anderson,M,1987-11-19,36,USA,SD,Sleeves,Open,106.4,110,182.5,192.5,200,200,125,132.5,137.5,137.5,227.5,237.5,247.5,247.5,585,SBD
5,Taylor Otter Robe,M,1989-01-27,,USA,SD,Sleeves,Open,101.2,110,182.5,187.5,192.5,192.5,132.5,-137.5,137.5,137.5,227.5,-230,-230,227.5,557.5,SBD
1,Jeremy Bloemke,M,1985-06-17,39,USA,MN,Sleeves,Open,123.8,125,250,265,-272.5,265,-210,210,-220,210,265,272.5,280,280,755,SBD
2,Chris Damminger,M,1983-12-25,40,USA,NJ,Sleeves,Open,116.7,125,202.5,217.5,230,230,-120,132.5,-142.5,132.5,250,267.5,275,275,637.5,SBD
3,Simon Hayes,M,1994-03-16,30,USA,CO,Sleeves,Open,117,125,210,225,235,235,130,140,-145,140,215,235,-255,235,610,SBD
4,Garrett Clendening,M,2000-09-03,23,USA,SD,Sleeves,Open,114,125,160,175,192.5,192.5,100,105,110,110,205,230,-250,230,532.5,SBD
5,Brandon Lauer,M,2000-07-03,24,USA,SD,Sleeves,Open,116.6,125,185,192.5,200,200,105,112.5,120,120,185,197.5,210,210,530,SBD
6,Derek Degges,M,1987-01-31,37,USA,VA,Sleeves,Open,111.9,125,150,170,185,185,115,-120,120,120,185,200,,200,505,SBD
7,Ethan Traster,M,1994-07-30,29,USA,SD,Sleeves,Open,122.8,125,-170,-172.5,175,175,-125,127.5,132.5,132.5,165,172.5,182.5,182.5,490,SBD
1,John Roy,M,1988-05-17,36,USA,SD,Sleeves,Open,139.1,140,250,260,272.5,272.5,167.5,182.5,192.5,192.5,262.5,272.5,280,280,745,SBD
2,Alec Lee,M,1995-11-06,28,USA,SD,Sleeves,Open,130.1,140,185,200,215,215,135,150,-155,150,-240,255,277.5,277.5,642.5,SBD
3,Matthew Sundling,M,1999-07-07,25,USA,NE,Sleeves,Open,135.5,140,215,220,227.5,227.5,127.5,132.5,137.5,137.5,-257.5,257.5,-265,257.5,622.5,SBD
4,Tom Condon,M,1994-09-27,29,USA,SD,Sleeves,Open,139.3,140,185,195,205,205,120,125,130,130,185,195,205,205,540,SBD
5,Daniel Tarnasky,M,1997-03-25,27,USA,MN,Sleeves,Open,138,140,185,-192.5,192.5,192.5,-130,145,-150,145,145,160,172.5,172.5,510,SBD
1,Jeremy Norwood,M,1988-06-21,36,USA,IA,Sleeves,Open,142.3,140+,287.5,302.5,317.5,317.5,192.5,200,207.5,207.5,265,-280,280,280,805,SBD
2,Austin Barrett,M,1997-12-16,26,USA,SD,Sleeves,Open,146.7,140+,267.5,-270,-272.5,267.5,175,-180,-180,175,265,277.5,295,295,737.5,SBD
3,Jory Kunzman,M,1991-10-01,32,USA,SD,Sleeves,Open,157.5,140+,245,260,272.5,272.5,170,185,-195,185,215,237.5,262.5,262.5,720,SBD
1,Joey Mleczko,M,1984-12-13,39,Canada,ON,Sleeves,S35-39,73.7,75,130,135,147.5,147.5,67.5,72.5,-77.5,72.5,172.5,182.5,192.5,192.5,412.5,SBD
1,Jeremy Bloemke,M,1985-06-17,39,USA,MN,Sleeves,S35-39,123.8,125,250,265,-272.5,265,-210,210,-220,210,265,272.5,280,280,755,SBD
2,Aaron Fernandez,M,1985-07-18,39,USA,CA,Sleeves,S35-39,115.8,125,177.5,185,195,195,132.5,140,145,145,207.5,215,227.5,227.5,567.5,SBD
1,Luke Sampson,M,2009-03-31,15,USA,ND,Sleeves,T13-15,90.3,100,140,147.5,157.5,157.5,92.5,100,-105,100,142.5,152.5,160,160,417.5,SBD
1,Noah Lund,M,2004-11-17,19,USA,ND,Sleeves,T18-19,104.2,110,182.5,195,-200,195,-110,120,-125,120,202.5,215,227.5,227.5,542.5,SBD
1,Rhett Hudoba,M,2003-11-27,20,USA,MN,Wraps,J20-23,95.7,100,-210,210,220,220,140,147.5,-152.5,147.5,215,227.5,-235,227.5,595,SBD
1,Matt Olson,M,1981-06-01,43,USA,MT,Wraps,M40-44,76.2,82.5,125,135,147.5,147.5,110,117.5,-125,117.5,160,175,190,190,455,SBD
1,Tim Scantlebury,M,1970-08-04,53,Canada,NB,Wraps,M50-54,101.5,110,185,195,210,210,117.5,127.5,-132.5,127.5,200,210,220,220,557.5,SBD
1,Matt Olson,M,1981-06-01,43,USA,MT,Wraps,Open,76.2,82.5,125,135,147.5,147.5,110,117.5,-125,117.5,160,175,190,190,455,SBD
1,Bryce Wollmann,M,1997-02-27,27,USA,SD,Wraps,Open,170,140+,310,-332.5,332.5,332.5,172.5,-187.5,-187.5,172.5,310,-327.5,,310,815,SBD
1,Derek Paterson,M,1989-03-31,35,USA,SD,Single-ply,Open,99.8,100,162.5,172.5,-180,172.5,87.5,-95,95,95,177.5,190,200,200,467.5,SBD
1,Matthew Sesnie,M,1993-04-19,31,USA,NY,Single-ply,Open,109.2,110,-265,-265,265,265,175,182.5,-187.5,182.5,230,242.5,255,255,702.5,SBD
1,Ryan Erickson,M,1980-07-11,44,USA,IA,Sleeves,M40-44,114.6,125,,,,,110,122.5,127.5,127.5,160,172.5,192.5,192.5,320,BD
1,Matt Scepaniak,M,1992-01-20,32,USA,SD,Sleeves,Open,95,100,,,,,102.5,125,137.5,137.5,102.5,142.5,165,165,302.5,BD
1,William Neel,M,1988-08-02,35,USA,ND,Sleeves,S35-39,94.9,100,,,,,147.5,157.5,167.5,167.5,265,-277.5,285,285,452.5,BD
1,Matthew Rongen,M,1984-04-30,40,USA,ND,Sleeves,M40-44,124.9,125,,,,,175,-182.5,-182.5,175,,,,,175,B
1,Grant Broggi,M,1988-08-26,35,USA,SC,Sleeves,Open,106.7,110,,,,,150,157.5,-165,157.5,,,,,157.5,B
1,Matthew Rongen,M,1984-04-30,40,USA,ND,Sleeves,Open,124.9,125,,,,,175,-182.5,-182.5,175,,,,,175,B
1,Dillon Kotz,M,1990-04-18,34,USA,TX,Single-ply,Open,96.6,100,,,,,225,242.5,-250,242.5,,,,,242.5,B
1,Grant Broggi,M,1988-08-26,35,USA,SC,Sleeves,Open,106.7,110,,,,,,,,,210,220,235,235,235,D
1,Matthew Sundling,M,1999-07-07,25,USA,NE,Sleeves,Open,135.5,140,,,,,,,,,-257.5,257.5,-265,257.5,257.5,D
1,William Neel,M,1988-08-02,35,USA,ND,Sleeves,S35-39,94.9,100,,,,,,,,,265,-277.5,285,285,285,D
