Name,Team,Sex,BirthDate,Division,BodyweightKg,WeightClassKg,Squat1Kg,Squat2Kg,Squat3Kg,Squat4Kg,Best3SquatKg,Bench1Kg,Bench2Kg,Bench3Kg,Bench4Kg,Best3BenchKg,Deadlift1Kg,Deadlift2Kg,Deadlift3Kg,Deadlift4Kg,Best3DeadliftKg,TotalKg,Place,Event,Equipment
Sophie Estel,,F,1965-09-23,F-M3,69.5,70,120,125,130,,130,,,,,,,,,,,130,1,S,Raw
Thomas Denis,Chambon,M,2002-04-02,M-T1,59.1,60,105,112.5,117.5,,117.5,,,,,,,,,,,117.5,1,S,Raw
Jérôme Boucher,Eu,M,1976-07-19,M-M1,72.3,75,150,160,170,175,170,,,,,,,,,,,170,1,S,Raw
David Gaillat,Gournay,M,1970-12-10,M-M2,72.8,75,140,-145,-145,,140,,,,,,,,,,,140,1,S,Raw
Patrick Metayer,Saint-Aubin,M,1964-08-26,M-M3,75,75,135,145,148,150,148,,,,,,,,,,,148,1,S,Raw
Marc Vincent,Oissel,M,1959-09-02,M-M4,73.4,75,135,145,-152.5,,145,,,,,,,,,,,145,1,S,Raw
Maxime Hellec,Montbéliard,M,1994-05-16,M-JR,77.9,82.5,160,,,,160,,,,,,,,,,,160,1,S,Raw
Benjamin Cannessant,Saint-Aubin,M,1988-04-24,M-O,82.2,82.5,195,205.5,-210,,205.5,,,,,,,,,,,205.5,1,S,Raw
Régis Aubry,Tarbes,M,1972-02-22,M-M2,82,82.5,150,160,,,160,,,,,,,,,,,160,1,S,Raw
Cyrille Petain,,M,1973-01-22,M-M1,87.6,90,165,175,185,,185,,,,,,,,,,,185,1,S,Raw
Serge Beldjord,Pau,M,1964-06-07,M-M3,88.7,90,170,180,200,,200,,,,,,,,,,,200,1,S,Single-ply
Jonny Piotrowski,Oissel,M,1961-07-29,M-M4,86.8,90,150,160,170,,170,,,,,,,,,,,170,1,S,Raw
Manu Faber,Besançon,M,1978-07-07,M-O,96,100,-190,-190,,,,,,,,,,,,,,,DQ,S,Raw
Serge Bustreel,,M,1946-05-24,M-M7,95.7,100,180,197.5,200,,200,,,,,,,,,,,200,1,S,Raw
Patrick Ruch,Lisieux,M,1962-11-02,M-M3,130,145,200,212.5,-220,,212.5,,,,,,,,,,,212.5,1,S,Raw
Claire Roger,Evreux,F,1988-05-16,F-O,51.6,53,,,,,,,,,,,100,110,-115,,110,110,1,D,Raw
Séverine Boucher,Eu,F,1978-06-02,F-O,56.3,58.5,,,,,,,,,,,105,-115,-115,,105,105,1,D,Raw
Sophie Estel,,F,1965-09-23,F-M3,69.5,70,,,,,,,,,,,150,157.5,160,,160,160,1,D,Raw
Raphaël Graca,Trilport,M,1998-04-27,M-T3,73,75,,,,,,,,,,,172.5,185,190.5,200,190.5,190.5,1,D,Raw
Norman Camier,Gournay,M,1998-08-12,M-T3,74.5,75,,,,,,,,,,,-160,160,-165,,160,160,2,D,Raw
Alexandre Welter,Trilport,M,1993-11-04,M-JR,74.9,75,,,,,,,,,,,-195,195,207.5,,207.5,207.5,1,D,Raw
Alexandre Gosselin,Oissel,M,1994-06-18,M-JR,70.9,75,,,,,,,,,,,195,,,,195,195,3,D,Raw
Romain Gilles,Oissel,M,1996-07-19,M-JR,71.3,75,,,,,,,,,,,200,205,-210,,205,205,2,D,Raw
Jérôme Boucher,Eu,M,1976-07-19,M-M1,72.3,75,,,,,,,,,,,190,200,205,,205,205,1,D,Raw
Marc Vincent,Oissel,M,1959-09-02,M-M4,73.4,75,,,,,,,,,,,175,185,195,,195,195,1,D,Raw
Daniel Delaporte,Maromme,M,1948-05-21,M-M6,74.3,75,,,,,,,,,,,155,170,180,-193,180,180,1,D,Raw
Thomas Denis,Chambon,M,2002-04-02,M-T1,59.1,60,,,,,,,,,,,130,141,-145,,141,141,1,D,Raw
Charles Maheust,Lisieux,M,2000-02-22,M-T2,55.8,56,,,,,,,,,,,160,162.5,-165,,162.5,162.5,1,D,Raw
Cédric Dumontier,Eu,M,1997-11-15,M-T3,60,60,,,,,,,,,,,165,170,175,-180,175,175,1,D,Raw
Vincenzo Tidona,,M,1930-08-15,M-M10,60.9,67.5,,,,,,,,,,,112.5,117.5,125,130,125,125,1,D,Single-ply
Mathieu Planquois,Oissel,M,1994-01-01,M-JR,78,82.5,,,,,,,,,,,200,-210,210,,210,210,1,D,Raw
Maxime Hellec,Montbéliard,M,1994-05-16,M-JR,77.9,82.5,,,,,,,,,,,190,,,,190,190,2,D,Raw
Morgan Evano,Evreux,M,1992-10-14,M-O,81.6,82.5,,,,,,,,,,,205,217.5,230,,230,230,2,D,Raw
Alexandre Serrano,Chambon,M,1978-12-08,M-O,79,82.5,,,,,,,,,,,200,220,-227.5,,220,220,3,D,Raw
Romuald Huelin,Montbéliard,M,1988-10-12,M-O,80.9,82.5,,,,,,,,,,,215,225,230,,230,230,1,D,Raw
Régis Aubry,Tarbes,M,1972-02-22,M-M2,82,82.5,,,,,,,,,,,190,210,220,,220,220,1,D,Raw
Jean-Claude Peter,,M,1951-02-12,M-M6,81.7,82.5,,,,,,,,,,,175,182.5,185,,185,185,1,D,Raw
François Chazelle,Chambon,M,1938-04-01,M-M8,82.3,82.5,,,,,,,,,,,-160,-180,,,,,DQ,D,Single-ply
Valentin Pons,Gournay,M,2000-05-13,M-T2,88.5,90,,,,,,,,,,,185,195,200,,200,200,1,D,Raw
Mohamed Zerouali,Besançon,M,1999-03-20,M-T3,,90,,,,,,,,,,,,,,,,,DQ,D,Raw
Grigor Avakyan,Evreux,M,1988-12-23,M-O,88.8,90,,,,,,,,,,,205,217.5,225,,225,225,1,D,Raw
Cyrille Petain,,M,1973-01-22,M-M1,87.6,90,,,,,,,,,,,220,240,250,,250,250,1,D,Raw
Jonny Piotrowski,Oissel,M,1961-07-29,M-M4,86.8,90,,,,,,,,,,,180,190,-200,,190,190,1,D,Raw
Manu Faber,Besançon,M,1978-07-07,M-O,,100,,,,,,,,,,,,,,,,,DQ,D,Raw
Mathieu Lambert,Pau,M,1978-03-14,M-O,98.6,100,,,,,,,,,,,-250,250,-267.5,,250,250,2,D,Raw
Francis Durier,Gournay,M,1986-04-18,M-O,91.7,100,,,,,,,,,,,250,260,267.5,,267.5,267.5,1,D,Raw
Serge Bustreel,,M,1946-05-24,M-M7,95.7,100,,,,,,,,,,,215,225.5,230,,230,230,1,D,Raw
Sullivan Porquet,Eu,M,1976-02-14,M-M1,119,125,,,,,,,,,,,240,260,280,-290,280,280,1,D,Raw
Patrick Ruch,Lisieux,M,1962-11-02,M-M3,130,145,,,,,,,,,,,252.5,267.5,275,281,275,275,1,D,Raw
Rose Lozano,Tarbes,F,1961-03-09,F-M4,55,55.5,90,-100,,,90,50,52.5,55,,55,100,115,120,130,120,265,1,SBD,Raw
Marie-France Baron,Santes,F,1951-06-29,F-M6,57.5,58.5,72.5,80,85,,85,47.5,52.5,55,,55,120,132.5,140,,140,280,1,SBD,Raw
Véronique Bourdon,Maromme,F,1957-11-20,F-M4,62.6,63,85,90,100,,100,65,70,-72.5,,70,125,135,142.5,,142.5,312.5,1,SBD,Raw
Aurore Compagnon,Trilport,F,1996-12-27,F-JR,65.3,70,107.5,-110.5,110.5,112.5,110.5,-40,40,-47.5,,40,115,125,132.5,,132.5,283,1,SBD,Raw
Charles Maheust,Lisieux,M,2000-02-22,M-T2,55.8,56,95,100,105,,105,70,75,-80,,75,140,150,-160,,150,330,1,SBD,Raw
Thomas Quelet,Trilport,M,1999-10-28,M-T2,64.8,67.5,125,132.5,140,-142.5,140,72.5,77.5,-82.5,,77.5,150,160,165,,165,382.5,1,SBD,Raw
Didier Gros,Besançon,M,1961-08-08,M-M4,67.5,67.5,117.5,125,-130,,125,92.5,97.5,100,,100,150,162.5,165,,165,390,1,SBD,Raw
Romain Gilles,Oissel,M,1996-07-19,M-JR,71.3,75,130,135,-140,,135,90,95,-100,,95,185,,,,185,415,3,SBD,Raw
Alexandre Gosselin,Oissel,M,1994-06-18,M-JR,70.9,75,157.5,-162.5,162.5,,162.5,120,125,-128,,125,180,190,196,-200,196,483.5,1,SBD,Raw
Alexandre Welter,Trilport,M,1993-11-04,M-JR,74.9,75,160,165,170,,170,97.5,102.5,-105,,102.5,180,190,200,,200,472.5,2,SBD,Raw
Rémi Tavernier,,M,1996-05-04,M-JR,79.4,82.5,150,-160,160,163,160,120,125,130,,130,190,205,215,,215,505,1,SBD,Raw
Maxime Hellec,Montbéliard,M,1994-05-16,M-JR,77.9,82.5,160,-165,-165,,160,125,-130,-130,,125,190,195,,,195,480,3,SBD,Raw
Mathieu Planquois,Oissel,M,1994-01-01,M-JR,78,82.5,140,150,155,-163,155,115,120,-125,,120,200,210,-220,,210,485,2,SBD,Raw
Nicolas Fanni,Evreux,M,1990-02-11,M-O,73.6,75,150,160,162.5,,162.5,120,125,127.5,,127.5,190,205,207.5,,207.5,497.5,2,SBD,Raw
Maxime Anjot,Lisieux,M,1987-02-26,M-O,72.7,75,135,145,150,,150,115,120,-122.5,,120,175,190,200,,200,470,3,SBD,Raw
David Soares,Trilport,M,1992-11-03,M-O,73.1,75,150,160,170,,170,115,120,-122.5,,120,185,195,207.5,,207.5,497.5,1,SBD,Raw
Christophe Cherel,Besançon,M,1967-05-06,M-M2,73.7,75,175,-185,-185,,175,-105,-110,110,,110,200,215,225,,225,510,1,SBD,Single-ply
Pascal Costa,Vitry,M,1967-01-04,M-M3,74.6,75,150,-157.5,157.5,,157.5,-162.5,-162.5,-162.5,,,,,,,,,DQ,SBD,Single-ply
Patrick Metayer,Saint-Aubin,M,1964-08-26,M-M3,75,75,135,145,148,,148,100,105,107.5,,107.5,192.5,202.5,207.5,-213.5,207.5,463,1,SBD,Raw
Sekou Harris,Besançon,M,1990-01-10,M-O,,82.5,,,,,,,,,,,,,,,,,DQ,SBD,Raw
Romuald Huelin,Montbéliard,M,1988-10-12,M-O,80.9,82.5,150,155,-157.5,,155,125,130,-135,,130,200,215,225,,225,510,2,SBD,Raw
Benjamin Cannessant,Saint-Aubin,M,1988-04-24,M-O,82.2,82.5,195,-205,205,,205,135,140,142.5,,142.5,215,225,230,,230,577.5,1,SBD,Raw
Régis Aubry,Tarbes,M,1972-02-22,M-M2,82,82.5,150,165,,,165,120,125,-130,,125,190,200,,,200,490,1,SBD,Raw
David Perroud,,M,1969-02-23,M-M2,81.7,82.5,145,152.5,-157.5,,152.5,105,110,-112.5,,110,195,-202.5,-202.5,,195,457.5,2,SBD,Raw
Pascal Mauhourat,Tarbes,M,1958-03-04,M-M4,81.8,82.5,,,,,,,,,,,,,,,,,DQ,SBD,Raw
Laurent Bourdelois,Evreux,M,1960-12-19,M-M4,81,82.5,112.5,120,125,,125,100,107.5,112.5,,112.5,132.5,142.5,152.5,,152.5,390,1,SBD,Raw
Mohamed Zerouali,Besançon,M,1999-03-20,M-T3,89.8,90,155,-170,-170,,155,-110,-120,-120,,,,,,,,,DQ,SBD,Raw
Anthony Jandau,Cappelle,M,1997-12-28,M-T3,89.9,90,135,-140,-140,,135,120,127.5,130,-132.5,130,187.5,-202.5,-202.5,,187.5,452.5,2,SBD,Raw
Kévin Canard,Trilport,M,1998-07-04,M-T3,87.5,90,160,-165,167.5,,167.5,112.5,120,125,,125,182.5,190,200,,200,492.5,1,SBD,Raw
Rémi Denecker,Cappelle,M,1986-09-04,M-O,86.8,90,177.5,-182.5,,,177.5,140,147.5,152.5,,152.5,247.5,260,-262.5,,260,590,1,SBD,Raw
Cyrille Petain,,M,1973-01-22,M-M1,87.6,90,165,175,180,,180,110,120,-125,,120,220,230,,,230,530,2,SBD,Raw
Marius Togueo,Evreux,M,1973-03-07,M-M1,87.9,90,210,220,-230,,220,140,-155,-155,,140,240,250,260,,260,620,1,SBD,Raw
Patrick Valfrey,Besançon,M,1965-02-23,M-M3,89.7,90,185,195,,,195,117.5,125,,,125,212.5,,,,212.5,532.5,1,SBD,Single-ply
Rémi Cortot,Paray,M,1954-07-23,M-M5,86.4,90,150,160,165,,165,100,110,-115,,110,175,190,200,,200,475,1,SBD,Raw
Patrick Valfrey,Besançon,M,1965-02-23,M-M3,89.7,90,195,217.5,,,217.5,145,,,,145,220,237.5,,,237.5,600,1,SBD,Raw
Paul François Leca,Pau,M,1987-10-12,M-O,,100,,,,,,,,,,,,,,,,,DQ,SBD,Raw
Patrice Baumel,Paray,M,1975-10-21,M-M1,97.8,100,190,202.5,215,,215,125,132.5,140,,140,220,232.5,245,,245,600,1,SBD,Raw
François Kalic,Trilport,M,1965-06-12,M-M3,97.7,100,190,200,207.5,215,207.5,145,152.5,157.5,,157.5,190,205,222.5,,222.5,587.5,1,SBD,Raw
Serge Bustreel,,M,1946-05-24,M-M7,95.7,100,180,187.5,-190,,187.5,112.5,115,120,,120,215,225,233,,233,540.5,1,SBD,Raw
Mathieu Addouche,Tarbes,M,1997-03-21,M-JR,107.8,110,230,240,250,,250,165,175,180,,180,260,270,-277.5,,270,700,1,SBD,Raw
Gilles Hubert,Bonnelles,M,1965-06-04,M-M3,104.1,110,180,192.5,197.5,,197.5,130,135,-137.5,,135,220,232.5,-242.5,,232.5,565,1,SBD,Raw
Joël Godon,Maromme,M,1957-02-06,M-M5,108.9,110,190,200,210,,210,140,150,-158,,150,240,250,-265.5,,250,610,1,SBD,Single-ply
Nicole Debail,Lisieux,F,1961-01-14,F-M4,43.5,44,,,,,,50,55,-58,,55,,,,,,55,1,B,Raw
Corinne Larée,Evreux,F,1967-08-26,F-M2,54.3,55.5,,,,,,52.5,57.5,-60,,57.5,,,,,,57.5,1,B,Raw
Fatiha Chettibi,Billy Montigny,F,1990-06-05,F-O,56.1,58.5,,,,,,70,75,-80,,75,,,,,,75,1,B,Raw
Sophie Hebert,Déville,F,1989-08-21,F-O,58.2,58.5,,,,,,62.5,67.5,-70,,67.5,,,,,,67.5,2,B,Raw
Véronique Bourdon,Maromme,F,1957-11-20,F-M4,62.8,63,,,,,,65,67.5,-70,,67.5,,,,,,67.5,1,B,Raw
Colette Corno,Gournay,F,1942-11-29,F-M7,66.5,70,,,,,,-50,50,55,-57.5,55,,,,,,55,1,B,Raw
Marie-Christine Larée,Evreux,F,1968-12-25,F-M2,85.7,90,,,,,,62.5,67.5,70,71.5,70,,,,,,70,1,B,Raw
Lucas Rouland,Trilport,M,1996-02-20,M-JR,60,60,,,,,,105.5,110,112.5,117.5,112.5,,,,,,112.5,1,B,Raw
Sébastien Britó,,M,1986-03-23,M-O,59.5,60,,,,,,102.5,107.5,112.5,,112.5,,,,,,112.5,1,B,Raw
Jean-Michel Moreiro,Vitry,M,1953-04-13,M-M5,,67.5,,,,,,,,,,,,,,,,,DQ,B,Raw
Christian Faidherbe,Billy Montigny,M,1983-08-17,M-O,66.8,67.5,,,,,,125,-132.5,132.5,,132.5,,,,,,132.5,1,B,Raw
Rémi Duchenne,Gournay,M,1992-09-19,M-O,66.5,67.5,,,,,,110,-115,115,,115,,,,,,115,2,B,Raw
Daniel Vallée,Lisieux,M,1967-06-29,M-M2,66.9,67.5,,,,,,100,102.5,107.5,,107.5,,,,,,107.5,1,B,Raw
Dominique Loquet,Caudebec,M,1962-09-15,M-M3,66.1,67.5,,,,,,95,100,-102.5,,100,,,,,,100,2,B,Raw
Frédéric Saunois,Hery,M,1965-05-15,M-M3,66.4,67.5,,,,,,127.5,134,,,134,,,,,,134,1,B,Raw
Alexandre Gosselin,Oissel,M,1994-06-18,M-JR,70.5,75,,,,,,110,120,-127.5,,120,,,,,,120,1,B,Raw
Ismaël Diack,Oissel,M,1986-11-13,M-O,,75,,,,,,,,,,,,,,,,,DQ,B,Raw
Eric Ribeiro,Soissons,M,1990-05-27,M-O,72.3,75,,,,,,145,-150,150,,150,,,,,,150,1,B,Raw
Brice Domenge,Tarbes,M,1987-04-11,M-O,72.8,75,,,,,,-135,135,-137.5,,135,,,,,,135,3,B,Raw
Mathieu Coudriaud,Vitry,M,1986-08-26,M-O,75,75,,,,,,135,140,-147.5,,140,,,,,,140,2,B,Raw
Cyrille Cusumano,Caudebec,M,1970-12-06,M-M2,74.6,75,,,,,,105,112.5,-120,,112.5,,,,,,112.5,1,B,Raw
Eric Buron,Déville,M,1962-11-28,M-M3,73.8,75,,,,,,-117.5,117.5,-120,,117.5,,,,,,117.5,2,B,Raw
Patrick Metayer,Saint-Aubin,M,1964-08-26,M-M3,74.9,75,,,,,,100,-107.5,,,100,,,,,,100,3,B,Raw
Pascal Costa,Vitry,M,1967-01-04,M-M3,74.5,75,,,,,,117.5,120,-122.5,,120,,,,,,120,1,B,Raw
Pascal Gourdin,Nouzonville,M,1961-06-06,M-M4,74.4,75,,,,,,100,-110,-117.5,,100,,,,,,100,3,B,Raw
Victor Schipani,Nouzonville,M,1961-05-08,M-M4,73.9,75,,,,,,120,125,130.5,,130.5,,,,,,130.5,1,B,Raw
Pascal Bizon,Oissel,M,1958-04-10,M-M4,74.2,75,,,,,,110,115,-117.5,,115,,,,,,115,2,B,Raw
Didier Debail,Lisieux,M,1956-08-24,M-M5,68.5,75,,,,,,97.5,102.5,107.5,,107.5,,,,,,107.5,1,B,Raw
Daniel Delaporte,Maromme,M,1948-05-21,M-M6,74.7,75,,,,,,95,-100,100,106.5,100,,,,,,100,1,B,Raw
Maxime Hellec,Montbéliard,M,1994-05-16,M-JR,,82.5,,,,,,,,,,,,,,,,,DQ,B,Raw
Wilfried Couchy,Evreux,M,1979-12-21,M-O,81.9,82.5,,,,,,152.5,162.5,165,168.5,165,,,,,,165,1,B,Raw
Rémi Babielle,,M,1992-11-25,M-O,79.2,82.5,,,,,,145,150,-160,,150,,,,,,150,3,B,Raw
Jean-Marcel Maire,Ornans,M,1990-05-22,M-O,80.6,82.5,,,,,,152.5,157.5,-162.5,,157.5,,,,,,157.5,2,B,Raw
Benjamin Cannessant,Saint-Aubin,M,1988-04-24,M-O,81.7,82.5,,,,,,132.5,140,142.5,,142.5,,,,,,142.5,4,B,Raw
Alexandre Sohm,Soissons,M,1990-03-21,M-O,80.4,82.5,,,,,,-140,-140,-140,,,,,,,,,DQ,B,Raw
Régis Aubry,Tarbes,M,1972-02-22,M-M2,82.2,82.5,,,,,,120,127.5,-130,,127.5,,,,,,127.5,1,B,Raw
Claude Patout,Billy Montigny,M,1962-04-19,M-M3,78.5,82.5,,,,,,150,155,-160,,155,,,,,,155,1,B,Raw
Joaquim DaSilva,,M,1964-07-19,M-M3,81.6,82.5,,,,,,140,-145,145,,145,,,,,,145,3,B,Raw
Laurent Taupe,,M,1964-06-15,M-M3,82,82.5,,,,,,140,145,150,,150,,,,,,150,2,B,Raw
Laurent Bourdelois,Evreux,M,1960-12-19,M-M4,81.4,82.5,,,,,,102.5,110,-115,,110,,,,,,110,2,B,Raw
Michel Soranzo,Bonnelles,M,1958-03-21,M-M4,81.7,82.5,,,,,,120,-122.5,,,120,,,,,,120,1,B,Raw
Alain Schall,Caudebec,M,1950-11-05,M-M6,79.5,82.5,,,,,,95,100,-105,,100,,,,,,100,1,B,Raw
Jérôme Prevot,Caudebec,M,1974-06-19,M-M1,88.4,90,,,,,,145,-152.5,,,145,,,,,,145,1,B,Raw
Steeve Wattebled,Caudebec,M,1972-01-06,M-M2,84.1,90,,,,,,142.5,-152.5,,,142.5,,,,,,142.5,1,B,Raw
Philippe Roussel,Billy Montigny,M,1962-04-19,M-M3,88.4,90,,,,,,135,-140,-140,,135,,,,,,135,1,B,Raw
Thierry Mathieu,Oissel,M,1961-03-21,M-M4,84.2,90,,,,,,110,120,-130,,120,,,,,,120,1,B,Raw
Fabrice Marchet,,M,1961-08-11,M-M4,89.2,90,,,,,,110,-112.5,-112.5,,110,,,,,,110,2,B,Raw
Didier Henrion,Evreux,M,1956-12-23,M-M5,88.6,90,,,,,,100,105,110,,110,,,,,,110,2,B,Raw
Patrick Simonin,Besançon,M,1956-07-21,M-M5,87.1,90,,,,,,120,127.5,135,,135,,,,,,135,1,B,Raw
Marcel Lenormand,Caudebec,M,1946-04-03,M-M7,85.9,90,,,,,,105,-110,-113,,105,,,,,,105,1,B,Raw
Geoffrey Beldjord,Pau,M,1994-03-15,M-JR,,90,,,,,,,,,,,,,,,,,DQ,B,Raw
Gauthier Kieken,,M,1995-05-18,M-JR,87.3,90,,,,,,130,-137.5,-137.5,,130,,,,,,130,1,B,Raw
Xavier Craffe,Gournay,M,1981-01-27,M-O,88.7,90,,,,,,150,155,160,,160,,,,,,160,1,B,Raw
Edouard Estorez,Caudebec,M,1980-08-23,M-O,89.1,90,,,,,,140,150,-160,,150,,,,,,150,2,B,Raw
Mathieu Lambert,Pau,M,1978-03-14,M-O,98.9,100,,,,,,150,-157.5,-157.5,,150,,,,,,150,1,B,Raw
Pascal LeBlanc,Billy Montigny,M,1963-03-14,M-M3,98.6,100,,,,,,132.5,135,-140,,135,,,,,,135,1,B,Raw
Régis Rousseau,Soissons,M,1965-06-06,M-M3,98.7,100,,,,,,125,132.5,-137.5,,132.5,,,,,,132.5,2,B,Raw
Philippe Belloncle,Maromme,M,1960-04-22,M-M4,98.6,100,,,,,,140,145,-152.5,,145,,,,,,145,1,B,Raw
Pierre Vallais,Caudebec,M,1947-05-14,M-M6,98.2,100,,,,,,120,130,132.5,,132.5,,,,,,132.5,1,B,Raw
David Dufour,Cappelle,M,1973-10-19,M-M1,107.2,110,,,,,,172.5,180,-182,,180,,,,,,180,1,B,Raw
Kamorudeen Animashaun,Maromme,M,1970-11-07,M-M2,107.6,110,,,,,,180,190,-200,,190,,,,,,190,1,B,Raw
Jean-Paul Delapierre,Maromme,M,1949-03-07,M-M6,106.6,110,,,,,,117.5,122.5,-127.5,,122.5,,,,,,122.5,1,B,Raw
Sonny Callewaert,Billy Montigny,M,1980-09-15,M-O,121.8,125,,,,,,150,155,160,,160,,,,,,160,3,B,Raw
Anthony Mahieux,Cappelle,M,1990-04-03,M-O,125,125,,,,,,170,-175,-175,,170,,,,,,170,2,B,Raw
Cédric Colange,Maromme,M,1982-11-16,M-O,114,125,,,,,,170,175,-177.5,,175,,,,,,175,1,B,Raw
David Hernandez #1,,M,1981-07-07,M-O,133.8,145,,,,,,170,185,200,,200,,,,,,200,1,B,Raw
Marie-Line Demare,,F,1963-09-06,F-M3,59.5,63,,,,,,62.5,67.5,-70,,67.5,,,,,,67.5,1,B,Single-ply
Jean-Michel Moreiro,Vitry,M,1953-04-13,M-M5,,67.5,,,,,,,,,,,,,,,,,DQ,B,Single-ply
Frédéric Saunois,Hery,M,1965-05-15,M-M3,66.4,67.5,,,,,,140,-145,-145,,140,,,,,,140,1,B,Single-ply
Mathieu Coudriaud,Vitry,M,1986-08-26,M-O,75,75,,,,,,155,165,-175,,165,,,,,,165,1,B,Single-ply
Pascal Costa,Vitry,M,1967-01-04,M-M3,74.5,75,,,,,,-160,-160,-160,,,,,,,,,DQ,B,Single-ply
Pascal Gourdin,Nouzonville,M,1961-06-06,M-M4,74.4,75,,,,,,120,130,135,-140,135,,,,,,135,1,B,Single-ply
Patrick Tellier,Bonnelles,M,1955-06-25,M-M5,74.4,75,,,,,,107.5,-115.5,-115.5,,107.5,,,,,,107.5,1,B,Single-ply
Michel Soranzo,Bonnelles,M,1958-03-21,M-M4,81.7,82.5,,,,,,130,135,142.5,,142.5,,,,,,142.5,1,B,Single-ply
Patrick Phelippe,Bonnelles,M,1952-05-22,M-M5,81.8,82.5,,,,,,117.5,122.5,-125,,122.5,,,,,,122.5,1,B,Single-ply
Fabrice Marchet,,M,1961-08-11,M-M4,89.2,90,,,,,,120,-125,-125,,120,,,,,,120,1,B,Single-ply
Jacky Bussiere,,M,1952-07-11,M-M5,100.5,110,,,,,,-162.5,-180,-182.5,,,,,,,,,DQ,B,Single-ply
Ouahem Boudjadja,,M,1972-03-17,M-M2,117.5,125,,,,,,190,205,-212.5,,205,,,,,,205,1,B,Single-ply
