Division,WeightClassKg,Place,Name,Team,BodyweightKg,Best3SquatKg,Best3BenchKg,Best3DeadliftKg,TotalKg,Equipment,Event,Sex
Div 2,51.71,1,Jose Sanchez,Gilmer,51.07,188.24,106.59,176.9,471.74,Single-ply,SBD,M
Div 2,51.71,2,Joey Longoria,Pearsall,50.98,158.76,90.72,170.1,419.57,Single-ply,SBD,M
Div 2,51.71,3,Nikko Fraire,Gainesville,51.44,158.76,92.99,167.83,419.57,Single-ply,SBD,M
Div 2,51.71,4,Jaden Lopez,Port Isabel,51.62,167.83,79.38,165.56,412.77,Single-ply,SBD,M
Div 2,51.71,5,Renier Reyes,Decatur,51.62,142.88,95.25,161.03,399.16,Single-ply,SBD,M
Div 2,51.71,6,Jared Paredez,Big Spring,50.98,145.15,74.84,170.1,390.09,Single-ply,SBD,M
Div 2,51.71,7,Felix Espinoza,Crandall,50.71,151.95,90.72,142.88,385.55,Single-ply,SBD,M
Div 2,51.71,8,Noah Hernandez,Lake Worth,50.71,151.95,81.65,149.69,383.29,Single-ply,SBD,M
Div 2,51.71,9,Colt Baranowski,Smithville,50.98,151.95,72.57,156.49,381.02,Single-ply,SBD,M
Div 2,51.71,10,Jaydan Flemons,Jasper,50.53,149.69,72.57,149.69,371.95,Single-ply,SBD,M
Div 2,51.71,11,Sammy Hernandez,Perryton,51.35,138.35,70.31,145.15,353.8,Single-ply,SBD,M
Div 2,51.71,12,Roberto Ortiz,Alvarado,50.62,149.69,65.77,133.81,349.27,Single-ply,SBD,M
Div 2,51.71,13,Spencer Bech,Bridge City,50.8,113.4,61.23,117.93,292.57,Single-ply,SBD,M
Div 2,55.79,1,Bryan Quinteros Jr,Lamesa,55.07,183.7,102.06,190.51,476.27,Single-ply,SBD,M
Div 2,55.79,2,Jesus Berrientos,Brownsboro,54.79,179.17,113.4,176.9,469.47,Single-ply,SBD,M
Div 2,55.79,3,Lukthaddeus Collins,Jasper,54.25,181.44,90.72,188.24,460.4,Single-ply,SBD,M
Div 2,55.79,4,David Hernandez #12,Port Isabel,55.16,181.44,86.18,190.51,458.13,Single-ply,SBD,M
Div 2,55.79,5,Jose Hernandez #13,Corpus Christi West Oso,55.79,179.17,92.99,183.7,455.86,Single-ply,SBD,M
Div 2,55.79,6,Lane Anthony,Nevada Community,55.34,195.04,79.38,176.9,451.32,Single-ply,SBD,M
Div 2,55.79,7,Jake Potter,Bridge City,55.52,172.37,90.72,176.9,439.98,Single-ply,SBD,M
Div 2,55.79,8,Xavier Edwards,Texarkana Liberty-Eylau,53.98,181.44,106.59,149.69,437.72,Single-ply,SBD,M
Div 2,55.79,9,Landry Hoskins,Sanger,55.7,181.44,92.99,163.29,437.72,Single-ply,SBD,M
Div 2,55.79,10,Preston Fox,Lampasas,55.52,149.69,106.59,158.76,415.04,Single-ply,SBD,M
Div 2,55.79,11,Tucker Klein,Fredericksburg,55.79,124.74,95.25,158.76,378.75,Single-ply,SBD,M
Div 2,55.79,12,Bryan Ordaz,Dumas,55.61,140.61,86.18,142.88,369.68,Single-ply,SBD,M
Div 2,55.79,DQ,Carter McFadden,Anna,53.98,,,,,Single-ply,SBD,M
Div 2,59.87,1,Marcus Capetillo,Raymondville,59.06,226.8,122.47,197.31,546.58,Single-ply,SBD,M
Div 2,59.87,2,Marlete Joyner,Kennedale,59.6,204.12,113.4,195.04,512.56,Single-ply,SBD,M
Div 2,59.87,3,Miguel Arroyo,San Angelo Lake View,58.97,190.51,111.13,199.58,501.22,Single-ply,SBD,M
Div 2,59.87,4,Brandon Horst,Sanger,58.79,201.85,102.06,185.97,489.88,Single-ply,SBD,M
Div 2,59.87,5,Weston Tinsley,Lumberton,59.06,199.58,102.06,183.7,485.34,Single-ply,SBD,M
Div 2,59.87,6,Payton Melchor,Liberty Hill,59.6,183.7,104.33,197.31,485.34,Single-ply,SBD,M
Div 2,59.87,7,Richie Garza,West Columbia,58.33,172.37,106.59,192.78,471.74,Single-ply,SBD,M
Div 2,59.87,8,Zaahid Abdullah,Waxahachie Life,58.97,170.1,102.06,183.7,455.86,Single-ply,SBD,M
Div 2,59.87,9,Ryan Burns,Sealy,58.24,167.83,90.72,185.97,444.52,Single-ply,SBD,M
Div 2,59.87,10,Joshua Lopez,Big Spring,58.51,154.22,90.72,199.58,444.52,Single-ply,SBD,M
Div 2,59.87,11,Aaron Goodwin,Mabank,57.42,158.76,106.59,158.76,424.11,Single-ply,SBD,M
Div 2,59.87,DQ,Ethan Bass,Ingleside,57.15,,,,,Single-ply,SBD,M
Div 2,67.13,1,Josue Becerril,Perryton,66.22,229.06,136.08,235.87,601.01,Single-ply,SBD,M
Div 2,67.13,2,Felix Del Rio,Robstown,66.77,244.94,127.01,206.38,578.33,Single-ply,SBD,M
Div 2,67.13,3,Cameron Hynson,Kennedale,66.41,206.38,131.54,233.6,571.53,Single-ply,SBD,M
Div 2,67.13,4,Sergio Watkins,China Spring,64.14,235.87,131.54,201.85,569.26,Single-ply,SBD,M
Div 2,67.13,5,Chris Velasquez,Geronimo Navarro,65.32,231.33,133.81,197.31,562.45,Single-ply,SBD,M
Div 2,67.13,6,Daniel Jeronimo,Hidalgo Early College,67.04,208.65,129.27,215.46,553.38,Single-ply,SBD,M
Div 2,67.13,7,Ricardo Alvarez,Alvarado,66.59,226.8,115.67,206.38,548.85,Single-ply,SBD,M
Div 2,67.13,8,Isaac Rodriguez,Rio Hondo,66.04,208.65,127.01,210.92,546.58,Single-ply,SBD,M
Div 2,67.13,9,Austin Helton,Caddo Mills,67.13,208.65,122.47,213.19,544.31,Single-ply,SBD,M
Div 2,67.13,10,Brandon Sigala,Levelland,66.13,197.31,115.67,217.72,530.7,Single-ply,SBD,M
Div 2,67.13,11,Garrett Davis,Quinlan Ford,66.5,213.19,122.47,195.04,530.7,Single-ply,SBD,M
Div 2,67.13,12,Orlando Moreno,Bay City,64.95,215.46,113.4,192.78,521.63,Single-ply,SBD,M
Div 2,67.13,DQ,Mike Acevedo,Anna,64.05,,,,,Single-ply,SBD,M
Div 2,67.13,DQ,Juan Carapia,Shepherd,65.14,208.65,,,,Single-ply,SBD,M
Div 2,74.84,1,Orlando Gutierrez,Crystal City,68.58,281.23,117.93,222.26,621.42,Single-ply,SBD,M
Div 2,74.84,2,Harley Sanders,Brownsboro,71.85,240.4,161.03,199.58,601.01,Single-ply,SBD,M
Div 2,74.84,3,Marcos Molina,Brownsboro,72.94,247.21,147.42,204.12,598.74,Single-ply,SBD,M
Div 2,74.84,4,Martin Brock,Argyle,73.75,238.14,131.54,224.53,594.21,Single-ply,SBD,M
Div 2,74.84,5,Hugh Shelton,Taylor,72.21,222.26,131.54,235.87,589.67,Single-ply,SBD,M
Div 2,74.84,6,Matthew Cano,Perryton,73.66,219.99,133.81,224.53,578.33,Single-ply,SBD,M
Div 2,74.84,7,Ryan Orona,Pecos,74.12,201.85,140.61,226.8,569.26,Single-ply,SBD,M
Div 2,74.84,8,Jonathan Pesina,Bay City,73.48,226.8,131.54,208.65,566.99,Single-ply,SBD,M
Div 2,74.84,9,Cason Chandler,Jasper,74.66,215.46,136.08,215.46,566.99,Single-ply,SBD,M
Div 2,74.84,10,Jack Jerome,Lampasas,71.03,222.26,142.88,199.58,564.72,Single-ply,SBD,M
Div 2,74.84,11,Finlee Rudicile,Farmersville,73.66,219.99,138.35,206.38,564.72,Single-ply,SBD,M
Div 2,74.84,12,Jaxon Mabile,Ingleside,70.58,229.06,108.86,204.12,542.04,Single-ply,SBD,M
Div 2,82.1,1,Bobby Posey,Brownsboro,80.01,283.5,176.9,235.87,696.26,Single-ply,SBD,M
Div 2,82.1,2,Gustavo Gallardo,Sinton,81.01,281.23,149.69,258.55,689.46,Single-ply,SBD,M
Div 2,82.1,3,William Goines,Gainesville,80.92,283.5,149.69,215.46,648.64,Single-ply,SBD,M
Div 2,82.1,4,Lupe Calamaco,Sinton,80.38,244.94,145.15,247.21,637.3,Single-ply,SBD,M
Div 2,82.1,5,Davin Gates,Dumas,81.56,238.14,149.69,240.4,628.23,Single-ply,SBD,M
Div 2,82.1,6,Jj Burns,Snyder,80.74,263.08,115.67,240.4,619.15,Single-ply,SBD,M
Div 2,82.1,7,Blaine Waggoner,Hamshire-Fannett,81.92,233.6,140.61,219.99,594.21,Single-ply,SBD,M
Div 2,82.1,8,Carson Ford,Lorena,79.92,215.46,140.61,226.8,582.87,Single-ply,SBD,M
Div 2,82.1,9,Amyri Cox,Anna,79.65,222.26,131.54,226.8,580.6,Single-ply,SBD,M
Div 2,82.1,10,Byron Johnson #1,Rusk,81.92,217.72,133.81,222.26,573.79,Single-ply,SBD,M
Div 2,82.1,11,Tanner Stacy,Needville,82.1,215.46,151.95,206.38,573.79,Single-ply,SBD,M
Div 2,82.1,DQ,Christian Yannis,Taylor,82.01,240.4,136.08,,,Single-ply,SBD,M
Div 2,82.1,DQ,Dayton Ball,Cuero,77.47,,,,,Single-ply,SBD,M
Div 2,89.81,1,Daniel González,Kingsville King,88,319.78,179.17,276.69,775.64,Single-ply,SBD,M
Div 2,89.81,2,Ronald Hargrove,Needville,88.63,283.5,170.1,269.89,723.48,Single-ply,SBD,M
Div 2,89.81,3,Leroy Bolden,Farmersville,86.73,299.37,170.1,231.33,700.8,Single-ply,SBD,M
Div 2,89.81,4,Connor Cook,Salado,88.9,281.23,163.29,240.4,684.92,Single-ply,SBD,M
Div 2,89.81,5,Ethan Coleman,Midland Greenwood,87.36,265.35,170.1,244.94,680.39,Single-ply,SBD,M
Div 2,89.81,6,JaShaughn Hatcher,Fairfield,88.18,249.48,138.35,276.69,664.51,Single-ply,SBD,M
Div 2,89.81,7,Seth Ruff,Ingleside,86.45,260.82,140.61,254.01,655.44,Single-ply,SBD,M
Div 2,89.81,8,Vaughn Bufkin,Longview Spring Hill,88.63,247.21,151.95,251.74,650.91,Single-ply,SBD,M
Div 2,89.81,9,Bryan Harwell,Waxahachie Life,88.81,249.48,136.08,258.55,644.1,Single-ply,SBD,M
Div 2,89.81,10,Ivan Naranjo,Robstown,87.09,256.28,167.83,217.72,641.83,Single-ply,SBD,M
Div 2,89.81,11,Austin Dickson,Anna,88.18,260.82,158.76,217.72,637.3,Single-ply,SBD,M
Div 2,89.81,12,Erik Fisk,Godley,89.36,272.16,145.15,213.19,630.49,Single-ply,SBD,M
Div 2,89.81,DQ,Armando Aguilar,Caddo Mills,87.63,244.94,136.08,,,Single-ply,SBD,M
Div 2,89.81,DQ,Kole Matula,Needville,85.55,249.48,,,,Single-ply,SBD,M
Div 2,89.81,DQ,Robert Herndon,Perryton,89.36,297.1,174.63,,,Single-ply,SBD,M
Div 2,99.79,1,Ian Alvidrez,Seminole,98.7,317.51,183.7,299.37,800.59,Single-ply,SBD,M
Div 2,99.79,2,Gilbert Arriaga,Kingsville King,99.16,292.57,183.7,288.03,764.3,Single-ply,SBD,M
Div 2,99.79,3,AJ Castaneda,Bellville,94.26,294.84,183.7,249.48,728.02,Single-ply,SBD,M
Div 2,99.79,4,Corban Rodriguez,Madisonville,97.61,299.37,163.29,254.01,716.68,Single-ply,SBD,M
Div 2,99.79,5,Yovanni Juarez,Gainesville,92.44,281.23,197.31,226.8,705.34,Single-ply,SBD,M
Div 2,99.79,6,Dylan Earhart,Hidalgo Early College,98.07,290.3,158.76,254.01,703.07,Single-ply,SBD,M
Div 2,99.79,7,Justin Flores,Rio Hondo,98.25,281.23,190.51,231.33,703.07,Single-ply,SBD,M
Div 2,99.79,8,Hayden Pipkin,Monahans,95.44,254.01,170.1,238.14,662.24,Single-ply,SBD,M
Div 2,99.79,9,Jonah Maston,Mineral Wells,99.79,260.82,156.49,244.94,662.24,Single-ply,SBD,M
Div 2,99.79,10,Brady Byrd,Sweeny,98.16,260.82,136.08,231.33,628.23,Single-ply,SBD,M
Div 2,99.79,11,Malik Holmes,La Marque,95.53,222.26,142.88,240.4,605.55,Single-ply,SBD,M
Div 2,99.79,DQ,Logan Blake,Waxahachie Life,98.43,283.5,183.7,,,Single-ply,SBD,M
Div 2,99.79,DQ,Sammy Segura,Giddings,96.52,254.01,158.76,,,Single-ply,SBD,M
Div 2,109.77,1,Khristion Little,Tyler Chapel Hill,103.42,326.59,165.56,278.96,771.11,Single-ply,SBD,M
Div 2,109.77,2,Jack Fontenot,Bridge City,107.23,340.19,188.24,242.67,771.11,Single-ply,SBD,M
Div 2,109.77,3,Roger Craig,Burnet,108.86,272.16,190.51,269.89,732.55,Single-ply,SBD,M
Div 2,109.77,4,Justin Castereno,Sweetwater,108.95,285.76,183.7,263.08,732.55,Single-ply,SBD,M
Div 2,109.77,5,Ismael Gonzalez,Kingsville King,108.32,301.64,176.9,238.14,716.68,Single-ply,SBD,M
Div 2,109.77,6,Jared Esparza,Gonzales,103.33,244.94,165.56,276.69,687.19,Single-ply,SBD,M
Div 2,109.77,7,Cameron Hanna,Kennedale,101.88,290.3,138.35,251.74,680.39,Single-ply,SBD,M
Div 2,109.77,8,Jacob McCain,Caddo Mills,107.68,254.01,158.76,244.94,657.71,Single-ply,SBD,M
Div 2,109.77,9,Ubaldo Tarango,Perryton,109.41,260.82,156.49,233.6,650.91,Single-ply,SBD,M
Div 2,109.77,10,Zac Hudgins,Burnet,107.59,249.48,158.76,235.87,644.1,Single-ply,SBD,M
Div 2,109.77,11,Mason Holzer,Sanger,101.88,242.67,138.35,231.33,612.35,Single-ply,SBD,M
Div 2,109.77,DQ,Neyfis Castellanos,Port Isabel,104.05,306.17,,,,Single-ply,SBD,M
Div 2,109.77,DQ,Marquell Hale,Silsbee,103.33,,,,,Single-ply,SBD,M
Div 2,124.74,1,Kobe Fahntrapp,Snyder,122.83,340.19,181.44,267.62,789.25,Single-ply,SBD,M
Div 2,124.74,2,Justin Montgomery,Liberty Hill,122.65,306.17,210.92,258.55,775.64,Single-ply,SBD,M
Div 2,124.74,3,Yordi Hernandez,Perryton,123.01,319.78,167.83,269.89,757.5,Single-ply,SBD,M
Div 2,124.74,4,Jimmy Orozco,Brownsboro,120.38,306.17,208.65,240.4,755.23,Single-ply,SBD,M
Div 2,124.74,5,Jim Hitchcock,Gatesville,122.56,306.17,174.63,272.16,752.96,Single-ply,SBD,M
Div 2,124.74,6,Garrett Hayes,Athens,121.74,272.16,174.63,294.84,741.62,Single-ply,SBD,M
Div 2,124.74,7,Josh Almond,Comal Canyon Lake,121.11,290.3,206.38,231.33,728.02,Single-ply,SBD,M
Div 2,124.74,8,Julian Casias,Decatur,124.28,306.17,176.9,226.8,709.87,Single-ply,SBD,M
Div 2,124.74,9,Jeremiah Stanley,Iowa Park,123.83,260.82,215.46,213.19,689.46,Single-ply,SBD,M
Div 2,124.74,10,Darby Jones,West Orange-Stark,119.84,256.28,156.49,249.48,662.24,Single-ply,SBD,M
Div 2,124.74,DQ,Kyle Weber,Splendora,122.56,,,,,Single-ply,SBD,M
Div 2,124.74,DQ,Gabriel Caram,Brownsville St. Joseph Academy,124.28,,,,,Single-ply,SBD,M
Div 2,124.74+,1,Matt Kelly,Caddo Mills,136.89,353.8,199.58,272.16,825.54,Single-ply,SBD,M
Div 2,124.74+,2,Tytus Williams,Borger,138.07,308.44,185.97,263.08,757.5,Single-ply,SBD,M
Div 2,124.74+,3,Sergio Hernandez,Geronimo Navarro,155.76,281.23,208.65,254.01,743.89,Single-ply,SBD,M
Div 2,124.74+,4,Eddie Zuniga,Waxahachie Life,137.71,306.17,181.44,233.6,721.21,Single-ply,SBD,M
Div 2,124.74+,5,Marcus Alexander,Sunnyvale,141.52,294.84,147.42,272.16,714.41,Single-ply,SBD,M
Div 2,124.74+,6,Will Atwood,Orange Grove,158.03,274.42,181.44,249.48,705.34,Single-ply,SBD,M
Div 2,124.74+,7,Nate Caballero,Fort Worth Western Hills,131.45,276.69,163.29,249.48,689.46,Single-ply,SBD,M
Div 2,124.74+,8,Hayden Shaw,Glen Rose,131.54,299.37,149.69,238.14,687.19,Single-ply,SBD,M
Div 2,124.74+,9,Kyle Strimiska,Gatesville,130.73,272.16,190.51,222.26,684.92,Single-ply,SBD,M
Div 2,124.74+,10,Shunmarkus Adams,Jasper,142.97,249.48,163.29,244.94,657.71,Single-ply,SBD,M
Div 2,124.74+,11,Blake Boenisch,Needville,132.9,260.82,129.27,242.67,632.76,Single-ply,SBD,M
Div 2,124.74+,DQ,Reece Azam,Andrews,134.44,285.76,174.63,,,Single-ply,SBD,M
