Place,Name,Sex,Age,Equipment,Division,BodyweightKg,WeightClassKg,Squat1Kg,Squat2Kg,Squat3Kg,Best3SquatKg,Bench1Kg,Bench2Kg,Bench3Kg,Bench4Kg,Best3BenchKg,Deadlift1Kg,Deadlift2Kg,Deadlift3Kg,Deadlift4Kg,Best3DeadliftKg,TotalKg,Event,BirthDate
1,Emily Kro,F,23,Raw,J20-23,62.65,67.5,95,97.5,100,100,50,52.5,-55,,52.5,120,125,130,,130,282.5,SBD,
2,Anjuni Dassanayake,F,23,Raw,J20-23,67.45,67.5,90,97.5,-105,97.5,50,55,-62.5,,55,105,112.5,120,,120,272.5,SBD,
1,Talitha Alexander,F,22,Wraps,J20-23,73.35,75,122.5,130,140,140,55,65,-72.5,,65,127.5,140,-147.5,,140,345,SBD,
1,Michelle Woods,F,20,Raw,J20-23,78.95,82.5,95,110,-120,110,50,57.5,-62.5,,57.5,100,110,-120,,110,277.5,SBD,
1,Bec Crombie,F,40,Wraps,M40-49,59.8,60,125,135,140,140,65,67.5,70.5,-72.5,70.5,125,135,140,,140,350.5,SBD,
1,Ann Teng,F,47,Raw,M40-49,68.8,75,100,-110,110,110,40,-42.5,-45,,40,120,130,135,,135,285,SBD,
1,Melissa Maxey,F,45,Wraps,M40-49,81.7,82.5,185,200.5,205,205,90,95.5,-100,,95.5,185,-200,-200,,185,485.5,SBD,
1,Gillian Fraser,F,64,Raw,M60-69,66.6,67.5,65,75,80,80,47.5,-50,50,,50,90,100,105,,105,235,SBD,
1,Deborah Peterson,F,61,Wraps,M60-69,73.66,75,75,82.5,90,90,60,65,70,,70,120,130,140,,140,300,SBD,
1,Verity Kalika,F,28,Wraps,Open,54.35,56,110,-115,115,115,47.5,50,-52.5,,50,125,135,140,,140,305,SBD,
2,Katrina Mudie,F,36,Raw,Open,55.45,56,85,87.5,95,95,52.5,-55,-55,,52.5,115,117.5,120,,120,267.5,SBD,
1,Jaimie Cohen,F,25,Wraps,Open,58.7,60,100,115,125,125,45,50,55,,55,100,115,120,,120,300,SBD,
2,Eliza Scherr,F,31,Raw,Open,59.95,60,87.5,95,100,100,47.5,-52.5,-52.5,,47.5,127.5,135,145,,145,292.5,SBD,
1,Chantelle Gauci,F,24,Wraps,Open,66.75,67.5,165,-175,175,175,70,72.5,-75,,72.5,192.5,202.5,-205,,202.5,450,SBD,
2,Ines Naylor,F,24,Wraps,Open,65.45,67.5,125,130,-135,130,-65,67.5,-70,,67.5,115,125,-135,,125,322.5,SBD,
3,Christina Iakovidis,F,38,Raw,Open,67.15,67.5,75,85,90,90,40,42.5,-45,,42.5,90,100,110,,110,242.5,SBD,
4,Bianca Rivera,F,24,Wraps,Open,62.6,67.5,75,85,-95,85,37.5,-42.5,45,,45,90,100,-110,,100,230,SBD,
1,Stacey Grana,F,30,Wraps,Open,74.9,75,155,165,175,175,75,82.5,-87.5,,82.5,175,190,200,,200,457.5,SBD,
2,Sarah Butler #2,F,34,Wraps,Open,72.55,75,130,142.5,150,150,70,75,80,,80,140,-155,-160,,140,370,SBD,
3,Kristy McCarthy,F,32,Wraps,Open,74.8,75,105,117.5,122.5,122.5,60,67.5,-72.5,,67.5,122.5,132.5,140,,140,330,SBD,
4,Kirsten Chisholm,F,32,Wraps,Open,74.05,75,105,115,120,120,50,55,,,55,125,135,140,,140,315,SBD,
5,Olivia Dellios,F,26,Raw,Open,69.15,75,60,65,-70,65,50,55,-57.5,,55,100,107.5,-115,,107.5,227.5,SBD,
6,Shiane McCurdy,F,30,Raw,Open,73.35,75,52.5,62.5,65,65,37.5,-40,-40,,37.5,90,97.5,-105,,97.5,200,SBD,
1,Jess Winchcomb,F,32,Raw,Open,81.65,82.5,120,127.5,135,135,-60,62.5,67.5,,67.5,152.5,160,165,,165,367.5,SBD,
1,Jessica Nugent,F,30,Wraps,Open,89.35,90,-205,205,,205,87.5,92.5,-95,,92.5,185,200,-210,,200,497.5,SBD,
2,Elle Theodorakopoulos,F,28,Wraps,Open,85.55,90,115,125,132.5,132.5,47.5,50,-52.5,,50,125,135,-140,,135,317.5,SBD,
1,Alyshianna Paletua,F,31,Raw,Open,154.15,90+,150,170,180,180,97.5,105,-110,,105,195,215,-225,,215,500,SBD,
2,Marakesh Toleafoa,F,33,Wraps,Open,100.8,90+,165,185,200,200,62.5,67.5,-72.5,,67.5,155,170,182.5,,182.5,450,SBD,
3,Meagan Love,F,36,Wraps,Open,103.55,90+,155,167.5,180,180,60,67.5,-72.5,,67.5,167.5,180,190,,190,437.5,SBD,
4,Isabella Hynes D'Aquino,F,24,Raw,Open,106.35,90+,135,142.5,152.5,152.5,70,77.5,82.5,,82.5,-160,170,-182.5,,170,405,SBD,
5,Alexandra Murray,F,25,Wraps,Open,113.95,90+,150,167.5,-175,167.5,62.5,67.5,-72.5,,67.5,130,142.5,-150,,142.5,377.5,SBD,
6,Angelika Dellios,F,31,Raw,Open,107.25,90+,85,90,95,95,45,-50,50,,50,125,-130,-130,,125,270,SBD,
1,Emily Thistlethwaite,F,18,Raw,S17-19,58.45,60,60,62.5,65,65,30,32.5,-35,,32.5,85,87.5,-90,,87.5,185,SBD,
1,Monique Scoble,F,17,Raw,S17-19,64.1,67.5,90,95,97.5,97.5,60,65,67.5,,67.5,105,110,112.5,,112.5,277.5,SBD,
2,Catalina Uceda,F,18,Raw,S17-19,62.5,67.5,60,70,-80,70,42.5,47.5,50,,50,90,100,-110,,100,220,SBD,
1,Summer Mosley,F,19,Wraps,S17-19,78.4,82.5,145,155,165,165,40,-47.5,-47.5,,40,135,145,-155,,145,350,SBD,
2,Maddison Jade Vaughan,F,17,Raw,S17-19,78,82.5,55,70,-80,70,35,42.5,-47.5,,42.5,95,105,110,,110,222.5,SBD,
1,Sinead Martin,F,28,Multi-ply,Open,60.95,67.5,125,132.5,140,140,-62.5,65,-70.5,,65,130,140,150,,150,355,SBD,
1,Yvonne Odell,F,43,Multi-ply,Open,77.1,82.5,92.5,102.5,107.5,107.5,50,55,-57.5,,55,122.5,132.5,137.5,,137.5,300,SBD,
1,Janelle Crouch,F,41,Raw,M40-49,129.15,90+,,,,,60,62.5,-67.5,,62.5,185,195,-197.5,,195,257.5,BD,
2,Michaela Albert,F,43,Raw,M40-49,109.7,90+,,,,,60,62.5,-65,,62.5,140,142.5,145,,145,207.5,BD,
3,Melissa McShane-Murphy,F,41,Raw,M40-49,116.45,90+,,,,,55,60,65,,65,120,130,140,,140,205,BD,
1,Lina Abdullah,F,56,Raw,M50-59,64.1,67.5,,,,,30,32.5,35,,35,85,90,95,100,95,130,BD,
1,Peta Biggin,F,52,Raw,M50-59,84.65,90,,,,,67.5,70,-72.5,,70,110,115,120,,120,190,BD,
1,Linda Jane Stewart,F,63,Raw,M60-69,64.7,67.5,,,,,45,48,-50,,48,90,95.5,100,105,100,148,BD,
1,Karen Davies,F,62,Raw,M60-69,81.6,82.5,,,,,37.5,40,,,40,90,92.5,95,,95,135,BD,
1,Esther Wang,F,26,Raw,Open,55.45,56,,,,,47.5,-50,-50,,47.5,120,130,135,,135,182.5,BD,
1,Alanah Brand,F,32,Raw,Open,73.45,75,,,,,50,55,57.5,,57.5,160,170,180.5,,180.5,238,BD,
1,Natasha Grimble,F,26,Raw,Open,78.6,82.5,,,,,45,50,-52.5,,50,130,140,-145,,140,190,BD,
2,Snow Sulman,F,27,Raw,Open,77.5,82.5,,,,,35,37.5,40,,40,80,87.5,92.5,,92.5,132.5,BD,
1,Stephanie Pearson,F,30,Raw,Open,115.9,90+,,,,,60,62.5,65,,65,140,145,150,,150,215,BD,
1,Peej Voudiotis,F,19,Raw,S17-19,58.5,60,,,,,42.5,-45,45,-47.5,45,112.5,122.5,-127.5,,122.5,167.5,BD,
1,Chloe Meyer,F,17,Raw,S17-19,78.2,82.5,,,,,35,37.5,-40,,37.5,85,92.5,-100,,92.5,130,BD,
1,Melissa McShane-Murphy,F,41,Raw,M40-49,116.45,90+,,,,,55,57.5,62.5,,62.5,,,,,,62.5,B,
1,Liz McCormack,F,39,Raw,Open,58.9,60,,,,,62.5,67.5,72.5,,72.5,,,,,,72.5,B,
1,Naomi Kolski,F,34,Raw,Open,74.1,75,,,,,60,-62.5,-62.5,,60,,,,,,60,B,
1,Kyna Leong,F,36,Raw,Open,59.9,60,,,,,,,,,,145,155,-165,,155,155,D,
1,Virginia Cowley,F,39,Raw,Open,83.15,90,,,,,,,,,,115,125,132.5,,132.5,132.5,D,
NS,Timothy Ivaschenko,M,21,Wraps,J20-23,,,,,,,,,,,,,,,,,,SBD,
1,Jezaem Mills,M,23,Raw,J20-23,89,90,150,155,-160,155,117.5,-125,-125,,117.5,170,177.5,185,,185,457.5,SBD,
1,Cody Wright,M,22,Wraps,J20-23,97.2,100,230,245,,245,110,120,-135,,120,240,255,275,,275,640,SBD,
1,James Clewer,M,20,Wraps,J20-23,128.1,140,195,215,225,225,112.5,-122.5,122.5,,122.5,240,-265,-280,,240,587.5,SBD,
1,Andrew Mauff,M,49,Wraps,M40-49,98.9,100,215,-235,235,235,155,170,-183,,170,220,-240,-240,,220,625,SBD,
1,Michael Puopolo,M,43,Wraps,M40-49,104.05,110,230,255,275.5,275.5,130,145,-155,,145,215,235,-250,,235,655.5,SBD,
1,Andrew Sharp #1,M,43,Wraps,M40-49,124.05,125,132.5,145,155,155,90,97.5,-102.5,,97.5,165,182.5,190,,190,442.5,SBD,
DQ,Ben Crombie,M,46,Wraps,M40-49,123.5,125,265,285,-292.5,285,165,-175,-175,,165,,,,,,,SBD,
1,Jamie Stewart,M,37,Wraps,Open,88.1,90,215,-230,-230,215,-100,100,-105,,100,210,-220,-220,,210,525,SBD,
2,Jack Thomas King,M,26,Raw,Open,88.85,90,165,170,175,175,117.5,-125,-125,,117.5,175,180,185,,185,477.5,SBD,
1,Lyle Davis,M,28,Wraps,Open,99.6,100,290,310,325,325,177.5,185,-190,,185,290,315,-327.5,,315,825,SBD,
2,Matthew Lynch #1,M,26,Wraps,Open,97.7,100,265,275,285,285,167.5,172.5,-175,,172.5,285,295,-305,,295,752.5,SBD,
3,Stephen Ryan,M,38,Wraps,Open,95.8,100,250,275,-290,275,150,155,160,,160,270,290,-295,,290,725,SBD,
4,Jack Hawker,M,29,Wraps,Open,99.25,100,250,265,275,275,150,170,-175,,170,250,270,275,,275,720,SBD,
5,Terrence McColl,M,35,Wraps,Open,98.45,100,175,187.5,195,195,127.5,132.5,-135,,132.5,220,235,250,,250,577.5,SBD,
6,Timothy Sharp #1,M,29,Wraps,Open,97.2,100,160,175,-185,175,80,-90,-90,,80,175,190,200,,200,455,SBD,
1,Gavin Ratcliffe,M,33,Wraps,Open,107.15,110,265,285,300,300,185,192.5,200,,200,270,285,300,,300,800,SBD,
2,Cole Pepperell,M,34,Wraps,Open,106.15,110,260,280,300,300,150,165,,,165,260,280,-300,,280,745,SBD,
3,John Coradine,M,24,Wraps,Open,109.95,110,265,300,,300,135,145,152.5,,152.5,-235,245,247.5,,247.5,700,SBD,
4,Benjamin Dolan,M,24,Wraps,Open,105.75,110,210,227.5,240,240,142.5,150,155,,155,250,265,280,,280,675,SBD,
5,Peter Brook #1,M,28,Wraps,Open,108.05,110,230,245,255,255,132.5,137.5,-142.5,,137.5,260,280,-300,,280,672.5,SBD,
6,Byron Bourne,M,37,Wraps,Open,108,110,212.5,220,230,230,127.5,135,140,,140,235,250,260,,260,630,SBD,
1,Lewis Dowling,M,30,Wraps,Open,120.95,125,365,400,,400,200,207.5,-212.5,,207.5,287.5,305,-320,,305,912.5,SBD,
2,Dylan Brooks,M,28,Raw,Open,120.95,125,205,215,227.5,227.5,135,140,145,,145,270,285,295,,295,667.5,SBD,
3,Taylen Mills,M,26,Raw,Open,122.35,125,205,215,222.5,222.5,160,167.5,172.5,,172.5,245,252.5,260,,260,655,SBD,
4,Jay Fancourt,M,29,Wraps,Open,121.86,125,215,222.5,240,240,112.5,120,-125,,120,235,242.5,250,,250,610,SBD,
5,Paul Mannagh,M,39,Wraps,Open,110.1,125,132.5,145,155,155,90,-97.5,-97.5,,90,190,210,-225,,210,455,SBD,
1,Rhys Evans,M,29,Wraps,Open,128.4,140,260,280,300,300,170,190,202.5,,202.5,-280,300,325,,325,827.5,SBD,
2,Jo Cocker,M,33,Wraps,Open,125.15,140,-175,175,200,200,120,135,-150,,135,225,240,260,,260,595,SBD,
1,Marcus Hough,M,35,Wraps,Open,181.65,140+,205,-230,230,230,102.5,-112.5,-120,,102.5,-195,205,220,,220,552.5,SBD,
1,John William Mahlo,M,17,Raw,S17-19,67.5,67.5,155,170,185,185,110,120,-125,,120,200,215,-225,,215,520,SBD,
2,Blake Kostevski,M,19,Wraps,S17-19,67.1,67.5,127.5,137.5,-145,137.5,85,90,-95,,90,172.5,180,-187.5,,180,407.5,SBD,
1,Ryan Baldacchino,M,31,Single-ply,Open,126.2,140,215,235,250.5,250.5,115,122.5,130,,130,240,-265,,,240,620.5,SBD,
1,Brendan Upton,M,31,Multi-ply,Open,96.15,100,280,300,310,310,180,190,-195,,190,280,-300,-300,,280,780,SBD,
2,Brady May,M,30,Multi-ply,Open,93.6,100,200,220,235,235,120,132.5,-137.5,,132.5,205,225,242.5,,242.5,610,SBD,
1,Chris Mallett,M,38,Raw,Open,120.7,125,,,,,190,200,-210.5,,200,270,-290,290,,290,490,BD,
1,Gavin Warland,M,36,Raw,Open,137.6,140,,,,,145,160,170,,170,260,280,-300,,280,450,BD,
1,Kelley Clifford,M,14,Raw,T14-16,84.15,90,,,,,80,85.5,90,92.5,90,170,-175,-175,,170,260,BD,
1,Dave Cutroni,M,29,Raw,Open,94.05,100,,,,,100,107.5,-110,,107.5,,,,,,107.5,B,
1,Lindsay Pennington,M,38,Raw,Open,96.8,100,,,,,,,,,,230,242.5,250,,250,250,D,
1,Brennen Hall,M,30,Raw,Open,119.95,125,,,,,,,,,,275,290,300,,300,300,D,
