Name,BirthDate,BirthYear,Division,BodyweightKg,WeightClassKg,Team,Sex,Equipment,Event,Best3SquatKg,Best3BenchKg,Best3DeadliftKg,TotalKg,Place
Sthefany Rivero Villarroel,1996-01-26,1996,Junior,78.6,84,GMH,F,Raw,SBD,160,75,165,400,1
Guillermo Arturo Briones Basoalto,1992-05-08,1992,Open,73.1,74,PM,M,Raw,SBD,202.5,105,270,577.5,1
Hugo Ignacio Vega Jil,1992-12-15,1992,Open,83,83,SBC,M,Raw,SBD,227.5,125,270,622.5,1
Cristopher Vega Belmar,1986-06-05,1986,Open,103.4,105,GMH,M,Raw,SBD,245,180,275,700,1
Pablo Roberto Perez Anderson,1998-08-26,1998,Junior,72.8,74,LT,M,Raw,SBD,185,125,255,565,1
Miguel Matías Guzman Droguett,1996-06-17,1996,Junior,81.7,83,GMH,M,Raw,SBD,205,152.5,250,607.5,1
Luis Nicolás Luarte Rodríguez,1992-04-03,1992,Open,92,93,SBC,M,Raw,SBD,220,150,280,650,1
Francisco Javier Rachel Valenzuela,1994-07-20,1994,Open,65,66,PM,M,Raw,SBD,187.5,95,236,518.5,1
Bernardo Joaquín Ibañez Pawahton,1997-05-03,1997,Junior,89.4,93,GMH,M,Raw,SBD,210,150,270,630,1
Wilfer Antonio Bolivar Zambrano,1991-12-16,1991,Open,74,74,LT,M,Raw,SBD,180,135,245,560,2
Tomás Gonzalez Saavedra,2002-03-13,2002,Subjunior,72.8,74,PC,M,Raw,SBD,205,107.5,240,552.5,1
Constanza Javiera Escobar Arcos,1993-05-14,1993,Open,59.9,63,SBC,F,Raw,SBD,125,55,155,335,2
Astrid Carolina Kroff Rosentreter,1983-10-23,1983,Open,61.5,63,PM,F,Raw,SBD,117.5,60,160,337.5,1
Bryan Lester Sagredo Briones,1993-06-16,1993,Open,72.2,74,SBC,M,Raw,SBD,192.5,125,222.5,540,3
Gabriel Vergara Gutiérrez,1994-06-30,1994,Open,71.6,74,SBC,M,Raw,SBD,197.5,120,210,527.5,4
Antonio Esteban Pineda Álvarez-Santullano,1990-07-30,1990,Open,101.7,105,PM,M,Raw,SBD,230,160,260,650,2
Milenka Torres Ramos,1996-12-30,1996,Junior,62.5,63,PC,F,Raw,SBD,120,55,155,330,1
Cynthia Noemi Quiroz Cisterna,1992-05-04,1992,Open,61.8,63,GMH,F,Raw,SBD,112.5,72.5,142.5,327.5,3
Gunther Felipe Ávila Marín,1984-03-09,1984,Open,117.6,120,GMH,M,Raw,SBD,242.5,165,290,697.5,1
Nicolás Andrés Rojas Grandón,1993-03-31,1993,Open,80.6,83,PM,M,Raw,SBD,195,130,230,555,2
Gabriel Valdés Lopez,1996-01-19,1996,Junior,72.1,74,SBC,M,Raw,SBD,182.5,122.5,200,505,2
Felipe Rieutord Lira,2001-06-16,2001,Subjunior,74,74,RM,M,Raw,SBD,165,107.5,240,512.5,2
Moisés Contreras,1969-03-08,1969,Master 2,101.6,105,PM,M,Raw,SBD,235,130,250,615,1
Maximiano Eduardo Valdés Quezada,1992-12-05,1992,Open,77.6,83,PM,M,Raw,SBD,187.5,120,215,522.5,3
Ignacio Bordones Capdevilla,1995-09-12,1995,Open,91.6,93,PC,M,Raw,SBD,210,125,240,575,2
Francisco Villarroel Machuca,1995-09-06,1995,Open,73.45,74,SBC,M,Raw,SBD,170,105,215,490,5
Valentina Marin Puelles,1993-07-30,1993,Open,44.7,47,SBC,F,Raw,SBD,90,47.5,115,252.5,1
Rodrigo Alberto Meléndez Paredes,1991-12-03,1991,Open,89.5,93,PM,M,Raw,SBD,205,125,215,545,3
Nicolás Figueroa,2001-02-05,2001,Subjunior,102.7,105,SBC,M,Raw,SBD,230,107.5,250,587.5,1
Felipe Ignacio Basoalto Villalobos,1996-07-03,1996,Junior,73.3,74,PM,M,Raw,SBD,155,117.5,207.5,480,3
Jorge Enzo Velozo Echeverría,2000-10-26,2000,Junior,72.3,74,SBC,M,Raw,SBD,170,95,210,475,4
Luis Felipe Cotera Rojas,1991-01-08,1991,Open,91,93,PM,M,Raw,SBD,210,115,220,545,4
Daniel González,1991-09-29,1991,Open,88.1,93,GMH,M,Raw,SBD,175,120,230,525,5
Alejandro Andrés Cruz Cruz,1990-12-29,1990,Open,73.25,74,GMH,M,Raw,SBD,155,107.5,205,467.5,6
Fabio Espejo Jimenez,1997-12-26,1997,Junior,63.8,66,PC,M,Raw,SBD,155,90,180,425,1
Francisco Andrés Peña Hermosilla,1992-11-05,1992,Open,81.7,83,SBC,M,Raw,SBD,175,120,205,500,4
Valentin Endo,,,Open,58.9,59,GMH,M,Raw,SBD,145,85,170,400,1
Felipe Andrés Gonzalez Hernández,,,Junior,90.8,93,GMH,M,Raw,SBD,185,115,227.5,527.5,2
Javier Ignacio Ventura Lovera,1995-11-12,1995,Junior,72.3,74,PM,M,Raw,SBD,145,105,200,450,5
Gonzalo Moises Ceballos Pimentel,1992-09-23,1992,Open,91.6,93,NW,M,Raw,SBD,175,130,215,520,6
José Ignacio Fernández Aedo,1999-08-08,1999,Junior,89.3,93,NW,M,Raw,SBD,177.5,102.5,227.5,507.5,3
Dayani Michelle Garcés Pérez,1990-04-02,1990,Open,55.4,57,GMH,F,Raw,SBD,92.5,50,110,252.5,1
Javiera Alejandra Parra Bustamante,1997-02-16,1997,Junior,58.4,63,PM,F,Raw,SBD,90,52.5,115,257.5,2
Pablo Esteban Zapata Díaz,1992-10-10,1992,Open,103.5,105,GMH,M,Raw,SBD,190,90,240,520,3
Andrea Constanza Manriquez Saavedra,1989-05-14,1989,Open,69.8,72,PM,F,Raw,SBD,100,45,110,255,1
Carlos Francisco Paredes Ceballos,1996-06-25,1996,Junior,70.9,74,GMH,M,Raw,SBD,140,80,170,390,6
Emilio Clemente Ignacio Gálvez Ramos,2001-09-25,2001,Subjunior,78.1,83,PM,M,Raw,SBD,140,90,180,410,1
Alejandra Lizette Ayala Lepe,1984-09-06,1984,Open,56.3,57,SBC,F,Raw,SBD,70,60,80,210,2
Angel Nibaldo Miranda Parra,1982-03-25,1982,Open,90,93,GMH,M,Raw,B,,155,,155,1
Claudia Paola Rojas Toro,1991-07-07,1991,Open,68.3,72,PM,F,Raw,B,,57.5,,57.5,1
Cristóbal Mena Aballay,1986-01-14,1986,Open,66,66,RM,M,Raw,B,,118,,118,1
Damas Ridore,,,Open,122.6,120+,GMH,M,Raw,B,,160,,160,1
Daniela Sandoval Ramírez,1989-04-27,1989,Open,55.8,57,PC,F,Raw,SBD,,50,110,,DQ
Ignacio Sebastian Cabrera García,1998-09-28,1998,Junior,80.2,83,SBC,M,Raw,B,,120,,120,1
Isamar Ogaz,,,Junior,56.3,57,GMH,F,Raw,B,,55,,55,1
Marco Antonio Reyes González,1983-04-06,1983,Open,148.3,120+,GMH,M,Raw,SBD,,165,,,DQ
David Eduardo Oyanadel Leiva,1991-12-29,1991,Open,99.5,105,PM,M,Raw,SBD,205,,250,,DQ
Paulina Contreras Cuevas,1990-08-15,1990,Open,62.9,63,PC,F,Raw,SBD,,62.5,155,,DQ
Gustavo Alberto Peralta Vargas,,,Open,97.3,105,GMH,M,Raw,SBD,145,,,,DQ
Nikolas Javier Muñoz Díaz,1994-05-15,1994,Open,77.3,83,SBC,M,Raw,SBD,175,,,,DQ
Pablo Ignacio Cortez Yañez,1998-01-11,1998,Junior,69.6,74,LT,M,Raw,SBD,190,,190,,DQ
Sebastian Camilo Troncozo Gonzalez,1990-03-30,1990,Open,73.3,74,PM,M,Raw,SBD,,97.5,,,DQ
