Place,Name,Sex,BirthDate,Age,Country,Equipment,Division,BodyweightKg,WeightClassKg,Deadlift1Kg,Deadlift2Kg,Deadlift3Kg,Deadlift4Kg,Best3DeadliftKg,TotalKg,Event
1,Cheryl Hendry,F,1983-01-25,41,Scotland,Raw,F-M1,47.2,48,105,-115,-115,,105,105,D
1,Maureen Cooper,F,1972-07-01,52,Scotland,Raw,F-M3,59.6,60,120,131,140,,140,140,D
1,Annjanette Saunders,F,1969-12-01,54,England,Raw,F-M3,66.95,67.5,175,185,,,185,185,D
1,Debs Olesen,F,1966-03-05,58,Scotland,Raw,F-M4,74.15,75,132.5,146,-155,,146,146,D
1,Amanda Brougham-Pickard,F,1968-06-05,56,Scotland,Raw,F-M4,122.5,110+,170,-200,-200,,170,170,D
1,Mhairi Shaw,F,1962-12-12,61,Scotland,Raw,F-M5,59.55,60,121,125,-128,,125,125,D
1,Becky Middleton,F,1994-01-23,30,Scotland,Raw,F-O,55.8,56,-120,125,132.5,,132.5,132.5,D
1,Rachael Law,F,1994-08-04,30,Scotland,Raw,F-O,59.2,60,120,140,-150,,140,140,D
1,Liz Shaw,F,1997-08-04,27,Scotland,Raw,F-O,66.3,67.5,125,130,-135,,130,130,D
1,Diane Gaughan,F,1989-11-20,34,Scotland,Raw,F-O,74.9,75,165,175,186,190,186,186,D
2,Immie Williamson,F,,28,Scotland,Raw,F-O,70.4,75,130,135,145,,145,145,D
1,Anna Macrae,F,2000-02-15,24,Scotland,Raw,F-O,81.7,82.5,135,140,147.5,,147.5,147.5,D
2,Amanda Robertson,F,1986-11-14,37,Scotland,Raw,F-O,81.2,82.5,105,110,117.5,,117.5,117.5,D
G,Landri Peden,F,1985-07-30,39,,Raw,F-O,82,82.5,175,227.5,245,,245,245,D
1,Samantha Cunningham,F,1994-03-31,30,Scotland,Raw,F-O,91.65,100,190,200,210,215,210,210,D
1,Nadine Webb,F,1996-06-15,28,Scotland,Raw,F-O,104.2,110,120,130,140,,140,140,D
2,Caitlin Davidson,F,1998-07-05,26,Scotland,Raw,F-O,101.4,110,-120,120,127.5,,127.5,127.5,D
1,Tyler Smith #4,M,2002-09-18,21,Scotland,Raw,M-J,79.9,82.5,190,202.5,215,,215,215,D
1,Scott Pollock,M,1981-04-05,43,Scotland,Raw,M-M1,88.25,90,300,-310,-310,,300,300,D
1,Martyn Keenan,M,1983-11-05,40,Scotland,Raw,M-M1,99.55,100,240,260,272.5,,272.5,272.5,D
2,Mark Collins #4,M,,40,Scotland,Raw,M-M1,95.6,100,230,242.5,-247.5,,242.5,242.5,D
1,Mark Gibson,M,1969-09-21,54,Scotland,Raw,M-M3,88.6,90,210,-240,240,-250,240,240,D
2,James Ingram,M,1973-06-04,51,Scotland,Raw,M-M3,90,90,220,232.5,240,,240,240,D
1,Andrew Flavell,M,1966-11-12,57,Scotland,Raw,M-M4,116.4,125,240,265,-277.5,,265,265,D
1,Douglas Wallace,M,1960-10-07,63,Scotland,Raw,M-M5,66.95,67.5,180,-206,,,180,180,D
1,Thomas Long,M,1989-06-15,35,Scotland,Raw,M-O,82.4,82.5,205,212.5,220,,220,220,D
2,Christopher McIntosh,M,1986-08-03,38,Scotland,Raw,M-O,82.5,82.5,220,-230,-230,,220,220,D
3,Christopher Woodward-Clarke,M,1990-06-24,34,Scotland,Raw,M-O,79.44,82.5,190,202.5,-207.5,,202.5,202.5,D
1,Scott Taylor,M,1991-01-02,33,Scotland,Raw,M-O,87.55,90,270,285,-300,,285,285,D
1,Robbie Stewart,M,1986-09-07,38,Scotland,Raw,M-O,97.7,100,-305,305,320,,320,320,D
2,Paul Sayers,M,1992-08-27,32,Scotland,Raw,M-O,96.8,100,250,262.5,-265,,262.5,262.5,D
3,Charles McGinley,M,1993-03-14,31,Scotland,Raw,M-O,99.5,100,207.5,-215,220,,220,220,D
1,Connor McKechnie,M,1998-11-27,25,Scotland,Raw,M-O,109.58,110,325,-340,-345,,325,325,D
2,Lewis Dyer,M,1996-08-31,28,Scotland,Raw,M-O,109.95,110,280,320,-330,,320,320,D
3,Scott Graham #4,M,1998-08-24,26,Scotland,Raw,M-O,106.2,110,280,300,,,300,300,D
1,Cameron New,M,1995-06-26,29,Scotland,Raw,M-O,112.85,125,320,341,,,341,341,D
2,Sam Taha,M,1996-07-17,28,Scotland,Raw,M-O,119.65,125,240,260,272.5,,272.5,272.5,D
1,Liam Goldie,M,1997-05-01,27,Scotland,Raw,M-O,127.2,140,300,315,320,,320,320,D
2,Fraser Love,M,1986-08-26,38,Scotland,Raw,M-O,135.35,140,265,-285,285,,285,285,D
G,Logan Stewart,M,2012-01-15,12,Scotland,Raw,M-O,55.75,56,95,105,-115,,105,105,D
