Division,WeightClassKg,Place,Name,Team,BodyweightKg,Best3SquatKg,Best3BenchKg,Best3DeadliftKg,TotalKg,Equipment,Event,Sex,BirthDate
Boys,51.71,1,Raymundo Ruiz,Rocksprings,50.35,111.13,63.5,111.13,285.76,Single-ply,SBD,M,
Boys,51.71,2,Robert Saldana,Eldorado,47.17,88.45,54.43,124.74,267.62,Single-ply,SBD,M,
Boys,55.79,1,Pablo Giovani,San Angelo Lake View,54.43,113.4,61.23,115.67,290.3,Single-ply,SBD,M,
Boys,55.79,2,Xaden Badillo,Ozona,53.52,99.79,56.7,115.67,272.16,Single-ply,SBD,M,
Boys,59.87,1,Johnny Jamison,Snyder,59.42,170.1,90.72,161.03,421.84,Single-ply,SBD,M,
Boys,59.87,2,Aidan Villanueva #1,Sonora,58.51,149.69,74.84,163.29,387.82,Single-ply,SBD,M,
Boys,59.87,3,Juan Ruiz,Sonora,58.97,142.88,81.65,158.76,383.29,Single-ply,SBD,M,
Boys,59.87,4,Julian Dominguez,Ozona,59.42,133.81,72.57,158.76,365.14,Single-ply,SBD,M,
Boys,59.87,5,Ismael Segura,Eldorado,59.87,117.93,86.18,127.01,331.12,Single-ply,SBD,M,
Boys,59.87,6,Jonathan McGee,Eldorado,58.06,102.06,52.16,136.08,290.3,Single-ply,SBD,M,
Boys,59.87,7,Austin Wood,San Angelo Lake View,59.42,86.18,49.9,92.99,229.06,Single-ply,SBD,M,
Boys,59.87,DQ,Ariel Salazar,Sonora,57.15,124.74,54.43,,,Single-ply,SBD,M,
Boys,67.13,1,Jose Dominguez,Ozona,65.77,181.44,102.06,190.51,474,Single-ply,SBD,M,
Boys,67.13,2,Duarte Vasquez,Sonora,60.15,151.95,81.65,154.22,387.82,Single-ply,SBD,M,
Boys,67.13,3,Santiago Hernandez,Eldorado,62.6,154.22,72.57,158.76,385.55,Single-ply,SBD,M,
Boys,67.13,4,Tucker Shanklin,Rocksprings,63.5,142.88,83.91,124.74,351.53,Single-ply,SBD,M,
Boys,67.13,5,Damian Martinez,Sonora,61.69,127.01,63.5,145.15,335.66,Single-ply,SBD,M,
Boys,67.13,DQ,Bailey Jowers,San Angelo Central,66.68,115.67,,,,Single-ply,SBD,M,
Boys,74.84,1,Jack Oliveira,Mertzon Irion County,74.66,170.1,102.06,181.44,453.59,Single-ply,SBD,M,
Boys,74.84,2,Adrian Mata,Rocksprings,67.81,174.63,83.91,170.1,428.64,Single-ply,SBD,M,
Boys,74.84,3,Ezekiel Davila,San Angelo Lake View,71.67,163.29,83.91,170.1,417.3,Single-ply,SBD,M,
Boys,74.84,4,Adam Sanchez,Sonora,67.59,154.22,90.72,158.76,403.7,Single-ply,SBD,M,
Boys,74.84,5,Alyn Salazar,San Angelo Lake View,69.4,147.42,83.91,151.95,383.29,Single-ply,SBD,M,
Boys,74.84,6,Jake Parks-Franco,Rocksprings,72.57,142.88,92.99,145.15,381.02,Single-ply,SBD,M,
Boys,74.84,7,Aaron Noriega,Sonora,72.57,154.22,77.11,145.15,376.48,Single-ply,SBD,M,
Boys,74.84,8,Tap Shanklin,Rocksprings,67.59,124.74,70.31,136.08,331.12,Single-ply,SBD,M,
Boys,74.84,9,Mike Martinez,Ozona,72.57,102.06,70.31,102.06,274.42,Single-ply,SBD,M,
Boys,74.84,DQ,Braden St Clair,Snyder,69.85,,,,,Single-ply,SBD,M,
Boys,74.84,DQ,Jonathan Lozano,Sonora,68.04,154.22,,,,Single-ply,SBD,M,
Boys,82.1,1,Aiden Fuentes,Ozona,81.65,233.6,122.47,208.65,564.72,Single-ply,SBD,M,
Boys,82.1,2,Carter Christensen,San Angelo Lake View,81.65,183.7,145.15,195.04,523.9,Single-ply,SBD,M,
Boys,82.1,3,Frankie Villanueva,Eldorado,80.29,199.58,95.25,213.19,508.02,Single-ply,SBD,M,
Boys,82.1,4,Enrique Calzada,Mertzon Irion County,79.2,167.83,86.18,163.29,417.3,Single-ply,SBD,M,
Boys,82.1,5,Gage Piwetz,Mertzon Irion County,75.75,158.76,79.38,158.76,396.89,Single-ply,SBD,M,
Boys,82.1,6,Nick Wright #3,Iraan,76.2,124.74,81.65,147.42,353.8,Single-ply,SBD,M,
Boys,82.1,7,Garrett Porter,Eldorado,75.3,127.01,81.65,136.08,344.73,Single-ply,SBD,M,
Boys,82.1,8,Abraham Gonzalez,Iraan,81.65,124.74,79.38,133.81,337.93,Single-ply,SBD,M,
Boys,82.1,9,Joshua Gomez,Rocksprings,82.1,74.84,56.7,115.67,247.21,Single-ply,SBD,M,
Boys,89.81,1,Austin Barrera,Rocksprings,89.36,244.94,117.93,217.72,580.6,Single-ply,SBD,M,
Boys,89.81,2,Austin Damian,Ozona,87.09,206.38,129.27,197.31,532.97,Single-ply,SBD,M,
Boys,89.81,3,Catarino Hernandez,Sonora,85.73,181.44,92.99,188.24,462.66,Single-ply,SBD,M,
Boys,89.81,4,Roberto Rivas,Rocksprings,89.36,188.24,74.84,183.7,446.79,Single-ply,SBD,M,
Boys,89.81,5,Kyle Sanders,Rocksprings,83.01,165.56,79.38,165.56,410.5,Single-ply,SBD,M,
Boys,89.81,6,Isaac Cordova,San Angelo Lake View,89.36,154.22,95.25,161.03,410.5,Single-ply,SBD,M,
Boys,89.81,7,Zach Luna,Eldorado,85.28,133.81,99.79,136.08,369.68,Single-ply,SBD,M,
Boys,89.81,DQ,Bryson Duncan,Snyder,89.36,235.87,,,,Single-ply,SBD,M,
Boys,99.79,1,Reyes Silva,Snyder,98.88,317.51,145.15,226.8,689.46,Single-ply,SBD,M,
Boys,99.79,2,Logan Sanders,San Angelo Lake View,98.88,226.8,147.42,244.94,619.15,Single-ply,SBD,M,
Boys,99.79,3,Xander Richardson,Snyder,92.99,219.99,124.74,210.92,555.65,Single-ply,SBD,M,
Boys,99.79,4,Brealand Rodriguez,Rocksprings,91.17,170.1,83.91,199.58,453.59,Single-ply,SBD,M,
Boys,99.79,5,Javier Hernandez,Iraan,92.99,188.24,81.65,179.17,449.06,Single-ply,SBD,M,
Boys,99.79,6,Ricardo Sanchez,San Angelo Lake View,96.16,158.76,92.99,176.9,428.64,Single-ply,SBD,M,
Boys,99.79,7,Alex Alcantar,San Angelo Lake View,94.8,136.08,92.99,161.03,390.09,Single-ply,SBD,M,
Boys,99.79,DQ,Cesar Garcia #4,Eldorado,90.72,174.63,,,,Single-ply,SBD,M,
Boys,99.79,DQ,Jon Parks,Mertzon Irion County,92.53,,,,,Single-ply,SBD,M,
Boys,99.79,DQ,Israel Lopez,San Angelo Central,90.08,,,,,Single-ply,SBD,M,
Boys,99.79,DQ,Nick Samaripa,San Angelo Central,90.08,,,,,Single-ply,SBD,M,
Boys,109.77,1,Jacob Palacio,Rocksprings,106.59,172.37,115.67,183.7,471.74,Single-ply,SBD,M,
Boys,109.77,2,Jon-Mychael Kirkland,Rocksprings,107.05,158.76,90.72,183.7,433.18,Single-ply,SBD,M,
Boys,109.77,3,Damon Bounds,Rocksprings,106.14,142.88,74.84,147.42,365.14,Single-ply,SBD,M,
Boys,109.77,4,John Cepeda,San Angelo Lake View,108.86,127.01,81.65,117.93,326.59,Single-ply,SBD,M,
Boys,124.74,1,Juan Ortiz,San Angelo Lake View,121.11,197.31,140.61,201.85,539.77,Single-ply,SBD,M,
Boys,124.74,2,Cody High,San Angelo Lake View,122.92,210.92,113.4,213.19,537.51,Single-ply,SBD,M,
Boys,124.74,3,Kevin Townsend,San Angelo Lake View,124.28,181.44,115.67,199.58,496.68,Single-ply,SBD,M,
Boys,124.74,4,Marcos Villalobos,Sonora,111.58,181.44,86.18,199.58,467.2,Single-ply,SBD,M,
Boys,124.74+,1,Emiliano Hernandez,Eldorado,142.43,249.48,190.51,292.57,732.55,Single-ply,SBD,M,
Boys,124.74+,2,Dorien Enriquez,Rocksprings,144.24,272.16,136.08,231.33,639.57,Single-ply,SBD,M,
Boys,124.74+,3,Keano Perez,Ozona,139.25,249.48,149.69,213.19,612.35,Single-ply,SBD,M,
Boys,124.74+,4,Ethan Sanchez #1,San Angelo Lake View,143.34,208.65,165.56,208.65,582.87,Single-ply,SBD,M,
Boys,124.74+,5,Justin Barton,San Angelo Central,136.98,226.8,104.33,204.12,535.24,Single-ply,SBD,M,
Boys,124.74+,6,Antonio Ronquillo,San Angelo Lake View,146.96,170.1,136.08,147.42,453.59,Single-ply,SBD,M,
Boys,124.74+,7,Rafael Sifuentes,Rocksprings,138.35,149.69,83.91,149.69,383.29,Single-ply,SBD,M,
Boys,,NS,Matthew Muncey,San Angelo Central,,,,,,Single-ply,SBD,M,
Boys,,NS,Stephen Franco,Rocksprings,,,,,,Single-ply,SBD,M,
Boys,,NS,Benito Alaniz,Snyder,,,,,,Single-ply,SBD,M,
Boys,,NS,Dylan Rodriguez,Snyder,,,,,,Single-ply,SBD,M,
Boys,,NS,Lane Smith,Ozona,,,,,,Single-ply,SBD,M,
Boys,,NS,Seth Parker,Eldorado,,,,,,Single-ply,SBD,M,
