Division,WeightClassKg,Place,Name,Team,BodyweightKg,Best3SquatKg,Best3BenchKg,Best3DeadliftKg,TotalKg,Equipment,Event,Sex
Boys,55.79,1,David Garcia #5,Pharr Valley View,51.89,154.22,95.25,188.24,437.72,Single-ply,SBD,M
Boys,55.79,2,Albert de la Rosa,San Benito,51.85,136.08,95.25,167.83,399.16,Single-ply,SBD,M
Boys,51.71,3,Jesus Jimenez,Brownsville Lopez,50.89,74.84,65.77,113.4,254.01,Single-ply,SBD,M
Boys,51.71,4,Rigo Medina,Donna,47.45,83.91,52.16,77.11,213.19,Single-ply,SBD,M
Boys,59.87,1,Raul Mota,San Benito,55.97,158.76,113.4,185.97,458.13,Single-ply,SBD,M
Boys,55.79,2,Eleazar Duenes,Edcouch-Elsa,55.79,147.42,88.45,172.37,408.23,Single-ply,SBD,M
Boys,55.79,3,Edgar Hernandez,Brownsville Rivera,55.43,138.35,74.84,142.88,356.07,Single-ply,SBD,M
Boys,55.79,4,Jorge Tinajero,Brownsville Porter,53.61,106.59,49.9,111.13,267.62,Single-ply,SBD,M
Boys,55.79,DQ,Ralph Zapata,Rio Hondo,55.07,151.95,,,,Single-ply,SBD,M
Boys,59.87,1,Ben Guajardo,Mission Sharyland,58.69,149.69,90.72,161.03,401.43,Single-ply,SBD,M
Boys,67.13,2,Randy Medillin,San Benito,59.92,149.69,88.45,158.76,396.89,Single-ply,SBD,M
Boys,59.87,3,Kaleb Espinoza,Donna,59.24,142.88,83.91,145.15,371.95,Single-ply,SBD,M
Boys,59.87,4,Adrian Torres,La Feria,58.33,133.81,72.57,136.08,342.46,Single-ply,SBD,M
Boys,59.87,5,Arturo Galindo,Brownsville Hanna,56.88,102.06,77.11,142.88,322.05,Single-ply,SBD,M
Boys,59.87,DQ,Francisco Zeferino,Brownsville Rivera,59.87,,,,,Single-ply,SBD,M
Boys,59.87,DQ,Marco Sanchez,Mission Sharyland,59.69,136.08,,,,Single-ply,SBD,M
Boys,67.13,DQ,Julian Vasquez,San Benito,59.96,,,,,Single-ply,SBD,M
Boys,67.13,1,Alan Alfaro,Rio Hondo,66.5,183.7,99.79,195.04,478.54,Single-ply,SBD,M
Boys,67.13,2,Toby Torres,San Benito,66.77,165.56,106.59,201.85,474,Single-ply,SBD,M
Boys,67.13,3,Victor Acosta,Pharr Valley View,64.77,165.56,108.86,181.44,455.86,Single-ply,SBD,M
Boys,67.13,4,Anthony Noyola,San Benito,66.13,154.22,108.86,158.76,421.84,Single-ply,SBD,M
Boys,67.13,5,Aaron Anguiano,Pharr Valley View,66.77,145.15,88.45,172.37,405.97,Single-ply,SBD,M
Boys,67.13,6,Chris Morales,Edcouch-Elsa,65.95,138.35,90.72,174.63,403.7,Single-ply,SBD,M
Boys,67.13,7,Julian Flores,Rio Hondo,65.68,138.35,108.86,149.69,396.89,Single-ply,SBD,M
Boys,67.13,8,Daniel Rueda,Brownsville Rivera,65.32,145.15,102.06,142.88,390.09,Single-ply,SBD,M
Boys,67.13,9,Juan Castillo,Brownsville Lopez,65.05,133.81,99.79,138.35,371.95,Single-ply,SBD,M
Boys,67.13,10,Mike Tamez,Donna,61.05,129.27,77.11,163.29,369.68,Single-ply,SBD,M
Boys,67.13,11,Hugo Salas,Brownsville Lopez,63.87,129.27,86.18,138.35,353.8,Single-ply,SBD,M
Boys,67.13,12,Rafael Ledesma,Brownsville Porter,65.05,113.4,81.65,131.54,326.59,Single-ply,SBD,M
Boys,67.13,13,Yayo Segura,Brownsville Pace,65.23,122.47,72.57,124.74,319.78,Single-ply,SBD,M
Boys,67.13,14,Michael Vento,La Feria,61.05,113.4,70.31,129.27,312.98,Single-ply,SBD,M
Boys,67.13,15,Ronnie Longoria,Mission Sharyland,63.14,115.67,61.23,136.08,312.98,Single-ply,SBD,M
Boys,67.13,16,Bradley Salinas,Brownsville Porter,63.05,104.33,61.23,129.27,294.84,Single-ply,SBD,M
Boys,67.13,17,Rogelio Pullido,Brownsville Lopez,65.23,102.06,68.04,115.67,285.76,Single-ply,SBD,M
Boys,67.13,18,JJ Camacho,Brownsville Pace,60.69,102.06,68.04,90.72,260.82,Single-ply,SBD,M
Boys,67.13,DQ,Albert Vasquez,La Feria,65.23,129.27,,,,Single-ply,SBD,M
Boys,82.1,1,Miguel Mariscal,Edcouch-Elsa,75.02,229.06,140.61,251.74,621.42,Single-ply,SBD,M
Boys,82.1,2,Bucky Barrera,Edcouch-Elsa,75.02,224.53,138.35,181.44,544.31,Single-ply,SBD,M
Boys,74.84,3,Richard Martinez,Brownsville Hanna,74.66,167.83,129.27,161.03,458.13,Single-ply,SBD,M
Boys,74.84,4,Eliseo Garsoria,Los Fresnos,72.17,163.29,92.99,192.78,449.06,Single-ply,SBD,M
Boys,74.84,5,Guadalupe Camacho,Brownsville Lopez,72.67,154.22,102.06,190.51,446.79,Single-ply,SBD,M
Boys,74.84,6,Steven Ambriz,Brownsville Hanna,74.39,174.63,106.59,165.56,446.79,Single-ply,SBD,M
Boys,74.84,7,Gilbert Guajardo,Pharr Valley View,72.67,165.56,97.52,174.63,437.72,Single-ply,SBD,M
Boys,74.84,8,John Marty,Donna,73.48,158.76,90.72,181.44,430.91,Single-ply,SBD,M
Boys,74.84,9,Roel Benitez,Rio Hondo,71.67,145.15,108.86,158.76,412.77,Single-ply,SBD,M
Boys,74.84,10,John Allen Bowen,Brownsville Rivera,73.84,136.08,124.74,147.42,408.23,Single-ply,SBD,M
Boys,74.84,11,Juan Zamora,Brownsville Porter,73.03,136.08,83.91,179.17,399.16,Single-ply,SBD,M
Boys,74.84,12,Christopher Olivarez,La Feria,69.94,136.08,72.57,145.15,353.8,Single-ply,SBD,M
Boys,74.84,13,Luciano Ramos,Brownsville Porter,69.76,117.93,81.65,149.69,349.27,Single-ply,SBD,M
Boys,74.84,DQ,Angel Loera,Brownsville Rivera,72.3,142.88,,,,Single-ply,SBD,M
Boys,74.84,DQ,Angel Hernandez #6,Pharr Valley View,70.67,,,,,Single-ply,SBD,M
Boys,82.1,DQ,Ivan Rodriguez,Pharr Valley View,75.02,,,,,Single-ply,SBD,M
Boys,74.84,DQ,Luis Rodriguez #11,Brownsville Veterans Memorial,73.94,161.03,,,,Single-ply,SBD,M
Boys,82.1,1,Ben Navarez,Edcouch-Elsa,82.1,256.28,165.56,276.69,698.53,Single-ply,SBD,M
Boys,82.1,2,Roger Tapia,Brownsville Veterans Memorial,81.74,201.85,138.35,204.12,544.31,Single-ply,SBD,M
Boys,82.1,3,Diego Garcia #9,Edcouch-Elsa,79.56,215.46,122.47,197.31,535.24,Single-ply,SBD,M
Boys,82.1,4,Javi Cruz,Los Fresnos,80.38,197.31,111.13,219.99,528.44,Single-ply,SBD,M
Boys,82.1,5,Miguel Herrera,Donna,80.56,204.12,129.27,192.78,526.17,Single-ply,SBD,M
Boys,82.1,6,Steven Mercado,Mission Sharyland,80.38,224.53,124.74,142.88,492.15,Single-ply,SBD,M
Boys,82.1,7,Trey Saldana,San Benito,80.38,158.76,108.86,183.7,451.32,Single-ply,SBD,M
Boys,82.1,8,Joey Guzman,Rio Hondo,77.66,147.42,102.06,195.04,444.52,Single-ply,SBD,M
Boys,89.81,9,Daniel Garza,Brownsville Pace,82.28,142.88,124.74,142.88,410.5,Single-ply,SBD,M
Boys,82.1,10,Pablo Garza,Brownsville Pace,81.1,113.4,95.25,165.56,374.21,Single-ply,SBD,M
Boys,82.1,11,David Cantu,Mission Sharyland,78.93,124.74,79.38,133.81,337.93,Single-ply,SBD,M
Boys,82.1,12,Mauri Aguilar,Brownsville Pace,77.47,113.4,79.38,124.74,317.51,Single-ply,SBD,M
Boys,82.1,13,Alex Chairez,Brownsville Veterans Memorial,81.1,129.27,106.59,170.1,405.97,Single-ply,SBD,M
Boys,82.1,DQ,Robert Gonzales,Mission Sharyland,77.02,,,,,Single-ply,SBD,M
Boys,82.1,DQ,Sergio Contreras,La Feria,80.83,170.1,,,,Single-ply,SBD,M
Boys,82.1,DQ,Freddy de la Garza,Brownsville Hanna,78.38,172.37,,,,Single-ply,SBD,M
Boys,82.1,DQ,Christopher Gadoy,Brownsville Rivera,76.66,208.65,,,,Single-ply,SBD,M
Boys,89.81,1,Robert Trevino,Edcouch-Elsa,87.18,260.82,145.15,249.48,655.44,Single-ply,SBD,M
Boys,89.81,2,Arnulfo Marin,Pharr Valley View,88.54,256.28,145.15,238.14,639.57,Single-ply,SBD,M
Boys,89.81,3,JJ Barrientes,Brownsville Hanna,85.18,192.78,124.74,204.12,521.63,Single-ply,SBD,M
Boys,89.81,4,Angel Espinoza,Brownsville Rivera,86.82,192.78,124.74,204.12,521.63,Single-ply,SBD,M
Boys,99.79,5,Jonah Cepeda,Los Fresnos,89.99,188.24,117.93,201.85,508.02,Single-ply,SBD,M
Boys,89.81,6,Steven Dorado,Rio Hondo,85.91,183.7,142.88,176.9,503.49,Single-ply,SBD,M
Boys,89.81,7,Tristan Echavarria,Donna,88.9,181.44,108.86,190.51,480.81,Single-ply,SBD,M
Boys,89.81,8,Eddie Garcia,Brownsville Hanna,88.72,183.7,115.67,174.63,474,Single-ply,SBD,M
Boys,89.81,9,Antonio Ruiz,Brownsville Porter,88.63,174.63,104.33,183.7,462.66,Single-ply,SBD,M
Boys,89.81,10,Travis Grienier,Brownsville Hanna,86.36,156.49,111.13,170.1,437.72,Single-ply,SBD,M
Boys,89.81,10,Isaiah Heredia,Rio Hondo,85.09,156.49,111.13,188.24,455.86,Single-ply,SBD,M
Boys,89.81,11,Frank Alvarado,Brownsville Porter,83.73,156.49,77.11,199.58,433.18,Single-ply,SBD,M
Boys,89.81,12,Abram Ramirez,Rio Hondo,82.37,156.49,97.52,158.76,412.77,Single-ply,SBD,M
Boys,99.79,14,Jonathan Azanon,Brownsville Rivera,89.9,142.88,102.06,129.27,374.21,Single-ply,SBD,M
Boys,89.81,DQ,Ramon Sauceda,La Feria,88.27,226.8,145.15,,,Single-ply,SBD,M
Boys,99.79,1,Angel Mercado,Donna,97.89,219.99,117.93,231.33,569.26,Single-ply,SBD,M
Boys,99.79,2,Aaron Zapata,Los Fresnos,98.16,219.99,122.47,204.12,546.58,Single-ply,SBD,M
Boys,99.79,3,Edgar Ortegon,Brownsville Lopez,94.08,215.46,120.2,190.51,526.17,Single-ply,SBD,M
Boys,99.79,4,Erick Vazquez,Brownsville Veterans Memorial,95.25,206.38,102.06,192.78,501.22,Single-ply,SBD,M
Boys,99.79,5,Pedro Gonzalez,Brownsville Veterans Memorial,95.89,183.7,113.4,201.85,498.95,Single-ply,SBD,M
Boys,99.79,6,Lalo Buenrostro,San Benito,97.39,188.24,111.13,195.04,494.42,Single-ply,SBD,M
Boys,99.79,7,Jmmy Cantu,Brownsville Veterans Memorial,91.99,170.1,124.74,192.78,487.61,Single-ply,SBD,M
Boys,99.79,8,Mark Garcia,Brownsville Porter,97.16,195.04,102.06,181.44,478.54,Single-ply,SBD,M
Boys,99.79,9,Rick Sauceda,Brownsville Lopez,90.45,142.88,124.74,176.9,444.52,Single-ply,SBD,M
Boys,99.79,11,Joey Torres,Brownsville Lopez,91.99,163.29,102.06,142.88,408.23,Single-ply,SBD,M
Boys,99.79,12,Felipe Ledezma,Brownsville Hanna,93.53,145.15,92.99,149.69,387.82,Single-ply,SBD,M
Boys,99.79,13,Librado Lozano,Brownsville Porter,93.8,154.22,72.57,158.76,385.55,Single-ply,SBD,M
Boys,99.79,14,Javier Elizondo,Mission Sharyland,93.8,102.06,92.99,172.37,367.41,Single-ply,SBD,M
Boys,99.79,15,Jonathan Ojeda,Brownsville Pace,93.89,74.84,65.77,113.4,254.01,Single-ply,SBD,M
Boys,99.79,DQ,Israel Torres,La Feria,99.16,179.17,,,,Single-ply,SBD,M
Boys,99.79,DQ,Marco Garcia,Rio Hondo,90.45,74.84,,,,Single-ply,SBD,M
Boys,109.77,1,Jacob Alaniz,Brownsville Veterans Memorial,100.97,244.94,142.88,249.48,637.3,Single-ply,SBD,M
Boys,109.77,2,Steven Rodriguez,San Benito,102.87,206.38,140.61,233.6,580.6,Single-ply,SBD,M
Boys,109.77,3,Marco Gutierrez,La Feria,107.41,219.99,129.27,192.78,542.04,Single-ply,SBD,M
Boys,109.77,4,Caleb Robertson,Rio Hondo,108.41,226.8,106.59,195.04,528.44,Single-ply,SBD,M
Boys,109.77,5,Luis Martinez #17,San Benito,104.69,170.1,147.42,183.7,501.22,Single-ply,SBD,M
Boys,109.77,6,Brian Lawrence,Brownsville Veterans Memorial,103.15,183.7,117.93,183.7,485.34,Single-ply,SBD,M
Boys,109.77,7,Jonathan Grimaldo,Donna,104.42,163.29,102.06,199.58,464.93,Single-ply,SBD,M
Boys,109.77,8,Andrew Salazar,Pharr Valley View,109.5,181.44,124.74,154.22,460.4,Single-ply,SBD,M
Boys,109.77,9,Jose Encina,Brownsville Hanna,109.41,167.83,115.67,172.37,455.86,Single-ply,SBD,M
Boys,109.77,10,Matthew Trinidad,Brownsville Hanna,109.32,183.7,124.74,124.74,433.18,Single-ply,SBD,M
Boys,124.74,11,Justin Slovak,Brownsville Rivera,109.95,142.88,111.13,149.69,403.7,Single-ply,SBD,M
Boys,109.77,12,Daniel González,Brownsville Pace,103.51,142.88,79.38,136.08,358.34,Single-ply,SBD,M
Boys,109.77,DQ,Guadalupe Nava,Brownsville Rivera,107.77,210.92,113.4,,,Single-ply,SBD,M
Boys,124.74,1,Alex Briseno,Brownsville Rivera,119.57,276.69,192.78,240.4,709.87,Single-ply,SBD,M
Boys,124.74,2,Keith Mora,Mission Sharyland,119.75,281.23,154.22,235.87,671.32,Single-ply,SBD,M
Boys,124.74,3,Josh Mohanadas,Mission Sharyland,113.4,224.53,154.22,226.8,605.55,Single-ply,SBD,M
Boys,124.74,4,Jesse Guzman,Brownsville Veterans Memorial,114.67,229.06,129.27,199.58,557.92,Single-ply,SBD,M
Boys,124.74,5,Ruben Cisneros,Donna,119.75,204.12,124.74,217.72,546.58,Single-ply,SBD,M
Boys,124.74,6,Mguel Quintana,Edcouch-Elsa,114.85,204.12,136.08,195.04,535.24,Single-ply,SBD,M
Boys,124.74,7,Christo De La Cruz,Brownsville Pace,120.75,215.46,102.06,190.51,508.02,Single-ply,SBD,M
Boys,124.74,8,Josh Perez,Donna,118.3,163.29,106.59,181.44,451.32,Single-ply,SBD,M
Boys,124.74,9,Josh Castillo,Brownsville Pace,113.76,161.03,129.27,158.76,449.06,Single-ply,SBD,M
Boys,124.74,10,Lus Castillo,Brownsville Pace,111.77,158.76,83.91,174.63,417.3,Single-ply,SBD,M
Boys,124.74,DQ,Juan Torres #4,Donna,112.04,163.29,,,,Single-ply,SBD,M
Boys,124.74,DQ,Gabriel Rodriguez,Edcouch-Elsa,119.75,,,,,Single-ply,SBD,M
Boys,124.74,DQ,Julio Contreras,Edcouch-Elsa,116.94,219.99,,,,Single-ply,SBD,M
Boys,124.74+,DQ,Kevin Garcia,Brownsville Porter,124.83,183.7,,,,Single-ply,SBD,M
Boys,124.74+,1,Jose Limon,Los Fresnos,148.69,317.51,158.76,274.42,750.7,Single-ply,SBD,M
Boys,124.74+,2,Pedro Salto,Edcouch-Elsa,143.79,249.48,163.29,206.38,619.15,Single-ply,SBD,M
Boys,124.74+,3,Mando Castillo,Brownsville Lopez,131.45,224.53,127.01,224.53,576.06,Single-ply,SBD,M
Boys,124.74+,4,Mario DeLeon,La Feria,138.8,222.26,129.27,204.12,555.65,Single-ply,SBD,M
Boys,124.74+,5,Cristian Sanchez,San Benito,143.88,199.58,156.49,183.7,539.77,Single-ply,SBD,M
Boys,124.74+,6,Gage Rivas,Brownsville Veterans Memorial,134.54,217.72,142.88,172.37,532.97,Single-ply,SBD,M
Boys,124.74+,7,Victor Rodríguez #9,Brownsville Pace,125.92,158.76,83.91,140.61,383.29,Single-ply,SBD,M
Boys,124.74+,8,Milton Botti,Brownsville Porter,136.8,161.03,79.38,136.08,376.48,Single-ply,SBD,M
Boys,124.74+,DQ,John Reyes #2,Rio Hondo,141.07,278.96,170.1,,,Single-ply,SBD,M
