Place,Name,Sex,Equipment,Division,BodyweightKg,WeightClassKg,Squat1Kg,Squat2Kg,Squat3Kg,Best3SquatKg,Bench1Kg,Bench2Kg,Bench3Kg,Best3BenchKg,Deadlift1Kg,Deadlift2Kg,Deadlift3Kg,Best3DeadliftKg,TotalKg,Event,State,Country,BirthDate
1,Peta Goodwin,F,Raw,FR-O,51.5,52,122.5,127.5,-132.5,127.5,75,80,-82.5,80,140,150,155,155,362.5,SBD,YNE,England,
2,Mia Wannop,F,Raw,FR-O,50.9,52,115,-120,-120,115,52.5,55,-57.5,55,125,135,-142.5,135,305,SBD,NM,England,
1,Ruth Grigg,F,Raw,FR-O,55.4,57,135,142.5,150,150,90,95,100,100,135,142.5,150,150,400,SBD,YNE,England,
2,Connie Raitt,F,Raw,FR-O,56.7,57,125,130,135,135,77.5,80,82.5,82.5,150,160,170,170,387.5,SBD,SM,England,
3,Cat Shamel,F,Raw,FR-O,56.6,57,127.5,-135,-135,127.5,77.5,-80,-80,77.5,142.5,-150,-150,142.5,347.5,SBD,WM,England,
4,Natalie Jeal,F,Raw,FR-O,56.2,57,140,-150,-150,140,55,57.5,-60,57.5,132.5,140,145,145,342.5,SBD,NW,England,
5,Hana Stephen,F,Raw,FR-O,55.4,57,102.5,110,115,115,65,70,75,75,135,145,-150,145,335,SBD,YNE,England,
6,Molly Walker,F,Raw,FR-O,55.8,57,105,112.5,117.5,117.5,55,60,65,65,120,130,137.5,137.5,320,SBD,EM,England,
7,Jessica Davies,F,Raw,FR-O,56.8,57,107.5,-112.5,-112.5,107.5,60,62.5,65,65,137.5,142.5,147.5,147.5,320,SBD,NM,England,
1,Grace Allinson,F,Raw,FR-O,62,63,140,145,147.5,147.5,87.5,-92.5,-92.5,87.5,172.5,187.5,195,195,430,SBD,YNE,England,
2,Dominique Cox,F,Raw,FR-O,62.1,63,130,135,140,140,67.5,70,72.5,72.5,190,207.5,212.5,212.5,425,SBD,SE,England,
3,Anne Burns,F,Raw,FR-O,62.2,63,142.5,-150,152.5,152.5,85,90,92.5,92.5,145,155,160,160,405,SBD,YNE,England,
4,Lauren Keenan,F,Raw,FR-O,60.2,63,135,140,-145,140,62.5,65,-67.5,65,137.5,142.5,-145,142.5,347.5,SBD,NW,England,
5,Sophie Fowler,F,Raw,FR-O,61.8,63,122.5,127.5,130,130,55,60,62.5,62.5,135,145,152.5,152.5,345,SBD,NM,England,
6,Diana Huynh,F,Raw,FR-O,61.8,63,127.5,-135,-135,127.5,65,70,72.5,72.5,120,130,137.5,137.5,337.5,SBD,GL,England,
1,Grace Stilgoe,F,Raw,FR-O,63.7,69,162.5,170,175,175,87.5,92.5,95,95,170,180,-187.5,180,450,SBD,GL,England,
2,Domiziana Turcatti,F,Raw,FR-O,66.5,69,152.5,157.5,160,160,-82.5,82.5,87.5,87.5,180,190,195,195,442.5,SBD,GL,England,
3,Helena Humphries,F,Raw,FR-O,64.8,69,140,145,150,150,77.5,80,-82.5,80,175,185,-195,185,415,SBD,NW,England,
4,Tamara Whittaker,F,Raw,FR-O,66.1,69,135,-142.5,142.5,142.5,75,77.5,80,80,180,190,-200,190,412.5,SBD,NM,England,
5,Charlotte West,F,Raw,FR-O,66.1,69,132.5,140,147.5,147.5,85,90,92.5,92.5,147.5,160,170,170,410,SBD,NM,England,
6,Beata Petenyi,F,Raw,FR-O,65.3,69,137.5,145,-150,145,85,87.5,90,90,160,170,-182.5,170,405,SBD,NW,England,
7,Vicky Catterall,F,Raw,FR-O,68.2,69,140,147.5,152.5,152.5,72.5,77.5,82.5,82.5,145,157.5,165,165,400,SBD,YNE,England,
8,Ali Whitwell,F,Raw,FR-O,68.1,69,132.5,142.5,-147.5,142.5,57.5,62.5,65,65,160,170,180,180,387.5,SBD,GL,England,
9,Luisa Vargas,F,Raw,FR-O,66.3,69,122.5,132.5,137.5,137.5,67.5,72.5,-75,72.5,162.5,172.5,-177.5,172.5,382.5,SBD,GL,England,
1,Bettina Hanlon,F,Raw,FR-O,71.7,76,175,185,190,190,107.5,-112.5,112.5,112.5,187.5,200,207.5,207.5,510,SBD,NW,England,
2,Naomi James,F,Raw,FR-O,74.9,76,-167.5,167.5,-180,167.5,85,90,92.5,92.5,197.5,210,215,215,475,SBD,GL,England,
3,Diamand Franklin,F,Raw,FR-O,75,76,-147.5,147.5,157.5,157.5,90,95,-97.5,95,182.5,190,-195,190,442.5,SBD,EM,England,
4,Michelle Chendamudima,F,Raw,FR-O,74.9,76,147.5,155,160,160,67.5,75,77.5,77.5,200,-215,-215,200,437.5,SBD,SW,England,
5,Genevieve Collins,F,Raw,FR-O,73.9,76,145,155,160,160,85,87.5,-90,87.5,172.5,182.5,-185,182.5,430,SBD,NW,England,
6,Charlotte DeVal,F,Raw,FR-O,74.4,76,150,157.5,162.5,162.5,82.5,87.5,-90,87.5,162.5,170,175,175,425,SBD,GL,England,
7,Beth Thomas #3,F,Raw,FR-O,74.7,76,147.5,-152.5,152.5,152.5,85,90,-92.5,90,160,170,-175,170,412.5,SBD,WM,England,
8,Zoe Acquah,F,Raw,FR-O,74.8,76,140,147.5,152.5,152.5,65,67.5,70,70,160,167.5,172.5,172.5,395,SBD,GL,England,
9,Rebecca Thomas-Sives,F,Raw,FR-O,73.8,76,127.5,135,140,140,70,-77.5,77.5,77.5,-155,160,172.5,172.5,390,SBD,YNE,England,
1,Leanne Richards,F,Raw,FR-O,82.2,84,165,172.5,180,180,92.5,97.5,-100,97.5,177.5,190,-195,190,467.5,SBD,NW,England,
2,Abigail Marshall,F,Raw,FR-O,82.6,84,150,162.5,170,170,85,87.5,-90,87.5,175,185,-190,185,442.5,SBD,NW,England,
3,Kerry Wood,F,Raw,FR-O,82.9,84,152.5,162.5,170,170,85,90,92.5,92.5,165,177.5,-185,177.5,440,SBD,NM,England,
4,Grace Burns-Murphy,F,Raw,FR-O,76.6,84,152.5,162.5,170,170,77.5,82.5,-85,82.5,160,172.5,180,180,432.5,SBD,NW,England,
5,Katherine Gathercole,F,Raw,FR-O,79.4,84,140,150,-155,150,72.5,77.5,-80,77.5,177.5,192.5,202.5,202.5,430,SBD,NM,England,
1,Aquinn Onuoha,F,Raw,FR-O,107,84+,215,225,232.5,232.5,90,97.5,105,105,237.5,251.5,-263.5,251.5,589,SBD,EM,England,
2,Hollie Tobun,F,Raw,FR-O,90.2,84+,-192.5,192.5,202.5,202.5,107.5,112.5,117.5,117.5,185,195,205,205,525,SBD,YNE,England,
3,Natasha Brooks,F,Raw,FR-O,86.3,84+,175,185,190,190,85,90,92.5,92.5,185,200,210,210,492.5,SBD,EM,England,
1,Ellie Steel,F,Single-ply,F-O,56.6,57,200,210,218,218,-140,140,-151,140,165,-172.5,-175,165,523,SBD,SM,England,
1,Katie Higgins,F,Single-ply,F-O,68.4,69,185,-195,-195,185,105,-110,110,110,150,160,,160,455,SBD,EM,England,
1,Holly Bryans,F,Single-ply,F-O,71.5,76,220,230,240,240,150,157.5,165,165,190,200,205,205,610,SBD,NM,England,
1,Christie Civetta,F,Single-ply,F-O,83.7,84,230,-245.5,245.5,245.5,135,142.5,150.5,150.5,190,205,-212.5,205,601,SBD,SM,England,
2,Emily Shergold,F,Single-ply,F-O,81.7,84,-200,200,-205,200,115,122.5,127.5,127.5,152.5,165,-172.5,165,492.5,SBD,SM,England,
1,Rachel Steedman,F,Single-ply,F-O,74.4,76,,,,,152.5,155.5,-158,155.5,,,,,155.5,B,YNE,England,
1,Kate Sweatman,F,Single-ply,F-O,134.4,84+,,,,,190,205,-215,205,,,,,205,B,SM,England,
1,Mike Baloro,M,Raw,MR-O,58.4,59,165,175,-180,175,85,95,-105,95,200,210,217.5,217.5,487.5,SBD,GL,England,
1,Phenyo Botlhoko,M,Raw,MR-O,65.6,66,185,200,210,210,115,-120,122.5,122.5,235,252.5,255,255,587.5,SBD,NW,England,
2,Aftab Uddin,M,Raw,MR-O,65.9,66,207.5,220,-230,220,120,127.5,-132.5,127.5,225,240,-252.5,240,587.5,SBD,GL,England,
1,Oliver Perkins,M,Raw,MR-O,72.9,74,195,210,225,225,132.5,140,145,145,260,280,-290,280,650,SBD,SE,England,
2,Justin Iturregui Luu,M,Raw,MR-O,73.9,74,225,235,-240,235,150,-160,-162.5,150,240,257.5,-270,257.5,642.5,SBD,GL,England,
3,Alexander Espin,M,Raw,MR-O,73.6,74,215,-225,-227.5,215,130,140,-142.5,140,260,280,-297.5,280,635,SBD,GL,England,
4,Daniel Mills #1,M,Raw,MR-O,73.5,74,215,-222.5,222.5,222.5,147.5,155,160,160,220,232.5,240,240,622.5,SBD,NM,England,
5,Simon Zhu #1,M,Raw,MR-O,73.7,74,210,222.5,-230,222.5,137.5,147.5,150,150,225,245,-252.5,245,617.5,SBD,GL,England,
6,Joel Wakeham,M,Raw,MR-O,73.3,74,197.5,210,220,220,132.5,140,142.5,142.5,222.5,235,245,245,607.5,SBD,NW,England,
7,Richard Huynh,M,Raw,MR-O,73,74,212.5,222.5,-230,222.5,117.5,122.5,127.5,127.5,232.5,245,252.5,252.5,602.5,SBD,NW,England,
8,Joshua Chan #1,M,Raw,MR-O,73.6,74,202.5,217.5,-225,217.5,130,137.5,-142.5,137.5,220,235,245,245,600,SBD,GL,England,
9,Tom Beech,M,Raw,MR-O,73.8,74,195,205,212.5,212.5,102.5,107.5,112.5,112.5,245,260,270,270,595,SBD,EM,England,
10,Simon Howarth,M,Raw,MR-O,73.1,74,197.5,-212.5,-212.5,197.5,127.5,-132.5,-132.5,127.5,222.5,235,250,250,575,SBD,YNE,England,
11,Ismaiel Abrahams,M,Raw,MR-O,72.8,74,192.5,212.5,217.5,217.5,107.5,115,120,120,212.5,-225,225,225,562.5,SBD,NW,England,
12,KiHo Lee,M,Raw,MR-O,73.8,74,165,170,175,175,-162.5,162.5,-165,162.5,175,180,-185,180,517.5,SBD,NW,England,
1,Jayesh Utchanah,M,Raw,MR-O,80.7,83,222.5,237.5,250,250,127.5,135,140,140,260,277.5,290,290,680,SBD,NM,England,
2,Jamie Ruffle,M,Raw,MR-O,81.6,83,222.5,-237.5,245,245,140,150,155,155,250,267.5,280,280,680,SBD,SW,England,
3,Christopher Teague,M,Raw,MR-O,82.9,83,247.5,-255,-255,247.5,170,175,182.5,182.5,230,250,-270,250,680,SBD,WM,England,
4,Harry Sugden,M,Raw,MR-O,81.3,83,245,260,-275,260,137.5,150,-155,150,260,-280,-300,260,670,SBD,YNE,England,
5,Max Marshall,M,Raw,MR-O,80.1,83,235,245,-247.5,245,140,145,-147.5,145,260,270,-277.5,270,660,SBD,SE,England,
6,Richard Henry,M,Raw,MR-O,78.7,83,220,232.5,235,235,125,132.5,-142.5,132.5,255,272.5,-285,272.5,640,SBD,GL,England,
7,Craig Strong,M,Raw,MR-O,81.9,83,202.5,212.5,215,215,140,145,150,150,240,260,265,265,630,SBD,GL,England,
8,Akime Pinder,M,Raw,MR-O,80.8,83,220,-222.5,227.5,227.5,137.5,145,-150,145,220,240,-250,240,612.5,SBD,NW,England,
9,Adam Cornes,M,Raw,MR-O,80.5,83,190,-192.5,207.5,207.5,142.5,150,155,155,210,222.5,230,230,592.5,SBD,NW,England,
10,Colin Chu,M,Raw,MR-O,82.4,83,197.5,207.5,215,215,125,132.5,135,135,230,242.5,-250,242.5,592.5,SBD,GL,England,
11,Ben Nicholls,M,Raw,MR-O,82.1,83,210,220,-230,220,92.5,97.5,102.5,102.5,230,-245,-245,230,552.5,SBD,NW,England,
1,William Pickering #1,M,Raw,MR-O,92.6,93,265,285,295,295,175,182.5,-187.5,182.5,315,335,350,350,827.5,SBD,GL,England,
2,Harrison Sparks,M,Raw,MR-O,92.5,93,255,270,280,280,192.5,202.5,-207.5,202.5,260,280,290,290,772.5,SBD,NM,England,
3,Owen Marron,M,Raw,MR-O,90.9,93,-250,260,-270,260,157.5,165,172.5,172.5,275,295,315,315,747.5,SBD,YNE,England,
4,Tobias Rogers,M,Raw,MR-O,91.5,93,235,252.5,262.5,262.5,145,155,162.5,162.5,265,290,305,305,730,SBD,WM,England,
5,Demi Fatona,M,Raw,MR-O,86.6,93,242.5,260,270,270,162.5,170,175,175,262.5,282.5,-295,282.5,727.5,SBD,SE,England,
6,Andrew McEllistrim,M,Raw,MR-O,91.6,93,240,255,-270,255,150,155,-157.5,155,290,-300,302.5,302.5,712.5,SBD,SM,England,
7,Jack Hobson,M,Raw,MR-O,91.9,93,245,257.5,-265,257.5,147.5,155,-160,155,250,-265,265,265,677.5,SBD,YNE,England,
8,Chris Ward #1,M,Raw,MR-O,91.3,93,242.5,252.5,-260,252.5,150,157.5,162.5,162.5,260,-270,-270,260,675,SBD,NW,England,
9,Josh Inman,M,Raw,MR-O,87.8,93,235,-250,250,250,145,152.5,160,160,242.5,260,-270,260,670,SBD,NM,England,
10,James Henegan,M,Raw,MR-O,92.3,93,222.5,240,-245,240,162.5,170,175,175,232.5,247.5,-265,247.5,662.5,SBD,EM,England,
11,Stephen Dixon,M,Raw,MR-O,88.5,93,215,230,237.5,237.5,137.5,145,147.5,147.5,-260,-272.5,272.5,272.5,657.5,SBD,NW,England,
12,Josh Browne,M,Raw,MR-O,89.3,93,225,237.5,-250,237.5,132.5,140,145,145,237.5,247.5,260,260,642.5,SBD,EM,England,
13,Luke Wyles,M,Raw,MR-O,92,93,220,230,235,235,125,130,135,135,255,272.5,-287.5,272.5,642.5,SBD,SM,England,
14,Jonathan Klein,M,Raw,MR-O,86.9,93,205,220,232.5,232.5,142.5,147.5,152.5,152.5,230,247.5,255,255,640,SBD,GL,England,
15,Dylan Hall #4,M,Raw,MR-O,89,93,200,217.5,230,230,125,132.5,135,135,245,267.5,275,275,640,SBD,,Wales,
16,Ethan Laithwaite,M,Raw,MR-O,91.9,93,220,237.5,250,250,130,137.5,145,145,-205,220,232.5,232.5,627.5,SBD,NW,England,
17,Evan Warlow,M,Raw,MR-O,91,93,215,230,-240,230,120,127.5,135,135,235,255,-265,255,620,SBD,WM,England,
18,Rashed Rahman,M,Raw,MR-O,92,93,227.5,-240,-245,227.5,137.5,-142.5,-142.5,137.5,222.5,-232.5,-232.5,222.5,587.5,SBD,SE,England,
1,Christian Ayandokun,M,Raw,MR-O,98.5,105,285,302.5,315,315,195,205,210,210,315,340,-355,340,865,SBD,EM,England,
2,Ben Pape,M,Raw,MR-O,104.6,105,310,322.5,-325,322.5,182.5,190,-192.5,190,322.5,347.5,-365,347.5,860,SBD,EM,England,
3,Jaden Osemwegie,M,Raw,MR-O,99.5,105,272.5,295,310,310,165,-175,182.5,182.5,275,297.5,312.5,312.5,805,SBD,EM,England,
4,James Laidlaw,M,Raw,MR-O,104.5,105,260,275,285,285,160,167.5,175,175,310,332.5,-347.5,332.5,792.5,SBD,,Scotland,
5,Noah Miles,M,Raw,MR-O,103.9,105,265,285,295,295,160,167.5,170,170,275,295,310,310,775,SBD,NM,England,
6,Mahin Zafar,M,Raw,MR-O,104.7,105,270,290,305,305,160,165,170,170,277.5,297.5,-317.5,297.5,772.5,SBD,NM,England,
7,Stephanos Karidis,M,Raw,MR-O,103.9,105,262.5,285,-300,285,157.5,165,167.5,167.5,287.5,310,-325,310,762.5,SBD,SE,England,
8,Joe Moore #1,M,Raw,MR-O,104.7,105,245,265,-280,265,165,172.5,175,175,285,300,307.5,307.5,747.5,SBD,GL,England,
9,Brandon Burnett-Uzoka,M,Raw,MR-O,99.8,105,222.5,242.5,255,255,132.5,142.5,150,150,282.5,305,325,325,730,SBD,GL,England,
10,Joseph Eaton,M,Raw,MR-O,100.1,105,250,267.5,277.5,277.5,150,157.5,162.5,162.5,260,280,290,290,730,SBD,GL,England,
11,Owen Leggett,M,Raw,MR-O,101.2,105,255,-265,265,265,157.5,165,170,170,270,285,-300,285,720,SBD,NM,England,
12,Rhys Limbert,M,Raw,MR-O,102.1,105,255,-265,265,265,170,177.5,-182.5,177.5,260,272.5,-285,272.5,715,SBD,,Scotland,
13,Chris Street #1,M,Raw,MR-O,103.6,105,262.5,272.5,275,275,172.5,180,-182.5,180,245,257.5,-267.5,257.5,712.5,SBD,SM,England,
14,Jack I'Anson,M,Raw,MR-O,96.9,105,270,-285,-285,270,140,147.5,152.5,152.5,260,280,-295,280,702.5,SBD,YNE,England,
15,Max Benford,M,Raw,MR-O,100.6,105,227.5,240,250,250,172.5,180,185,185,240,255,265,265,700,SBD,NW,England,
16,Jack Kay,M,Raw,MR-O,101.8,105,242.5,-252.5,-257.5,242.5,165,170,175,175,242.5,260,272.5,272.5,690,SBD,NW,England,
17,Bryce Thornhill,M,Raw,MR-O,99,105,222.5,237.5,250,250,157.5,165,-167.5,165,230,250,-265,250,665,SBD,EM,England,
18,Anthony McLaughlin,M,Raw,MR-O,104,105,200,215,225,225,125,132.5,140,140,242.5,265,280,280,645,SBD,YNE,England,
19,Charlie Cambridge,M,Raw,MR-O,94.7,105,190,205,-215,205,140,145,-147.5,145,245,262.5,275,275,625,SBD,EM,England,
1,Abdul Majeed Sulayman,M,Raw,MR-O,111.3,120,310,332.5,-345,332.5,200,-210,210,210,340,365,375,375,917.5,SBD,YNE,England,
2,Curtis McLaren,M,Raw,MR-O,117.1,120,300,312.5,320,320,172.5,182.5,190,190,315,-327.5,337.5,337.5,847.5,SBD,NW,England,
3,Marvelous James,M,Raw,MR-O,113.2,120,270,285,295,295,175,-182.5,182.5,182.5,300,325,337.5,337.5,815,SBD,GL,England,
DQ,Eden Scantlebury-Watson,M,Single-ply,M-G,72.4,74,-200,-205,-212.5,,107.5,-112.5,-112.5,107.5,160,167.5,-172.5,167.5,,SBD,NW,England,
DQ,Tom Senior,M,Single-ply,M-G,72.6,74,245,252.5,,252.5,-145,-152.5,-152.5,,202.5,217.5,-222.5,217.5,,SBD,NW,England,
G,Gregory Pearson,M,Single-ply,M-G,79.9,83,292.5,310,320,320,220,-235,-235,220,275,295,300,300,840,SBD,YNE,England,
DQ,Oskar Wencel,M,Single-ply,M-G,89.7,93,260,-267.5,,260,,,,,,,,,,SBD,WM,England,
1,David Campos #1,M,Single-ply,M-O,91.1,93,280,295,305,305,200,-210,-210,200,270,285,-295,285,790,SBD,,France,
2,Thomas Morgan #1,M,Single-ply,M-O,91,93,260,275,-280,275,-205,205,-215,205,220,240,260,260,740,SBD,,Wales,
DQ,Mathew Hallett,M,Single-ply,M-O,92.1,93,322.5,337.5,-347.5,337.5,-260,-260,-260,,215,-225,-225,215,,SBD,SM,England,
DQ,Angus Gardner,M,Single-ply,M-O,92.4,93,262.5,277.5,290,290,-195,-195,-195,,220,235,240,240,,SBD,SE,England,
1,Jack Johnson #1,M,Single-ply,M-O,104.1,105,330,350,362.5,362.5,240,-250.5,-250.5,240,320,340,347.5,347.5,950,SBD,SM,England,
2,Thomas Shaw,M,Single-ply,M-O,97,105,265,285,300,300,-190,190,205,205,235,255,-262.5,255,760,SBD,NM,England,
1,Ray Bowring,M,Single-ply,M-O,152.6,120+,430,455,-475.5,455,305,-323,-323,305,335,355,367.5,367.5,1127.5,SBD,SM,England,
1,Joseph Shaw,M,Single-ply,M-O,110.8,120,,,,,255,-270,-275,255,,,,,255,B,SM,England,
