Division,WeightClassKg,Place,Name,Team,BodyweightKg,Best3SquatKg,Best3BenchKg,Best3DeadliftKg,TotalKg,Equipment,Event,Sex,BirthDate
Boys,51.71,1,Kobe McGee,Junction,51.44,151.95,81.65,142.88,376.48,Unlimited,SBD,M,
Boys,51.71,2,Caden Reynoso,Big Spring,51.17,106.59,56.7,127.01,290.3,Unlimited,SBD,M,
Boys,51.71,3,Owen Stanek,Christoval,47.99,99.79,58.97,83.91,242.67,Unlimited,SBD,M,
Boys,51.71,DQ,Tylon Hooper,Junction,50.89,,,,,Unlimited,SBD,M,
Boys,55.79,1,Talon Cavazos,Big Spring,55.79,154.22,99.79,188.24,442.25,Unlimited,SBD,M,
Boys,55.79,2,Jorge Leija,Sonora,54.98,165.56,92.99,158.76,417.3,Unlimited,SBD,M,
Boys,55.79,3,Josiah Cavazos,Big Spring,55.52,158.76,97.52,158.76,415.04,Unlimited,SBD,M,
Boys,55.79,4,Konner Linebarger,San Angelo Grape Creek,52.44,142.88,68.04,142.88,353.8,Unlimited,SBD,M,
Boys,55.79,5,Mikee Pelzel,Miles,54.7,120.2,77.11,129.27,326.59,Unlimited,SBD,M,
Boys,55.79,6,Calixto Valencia,Junction,52.07,120.2,70.31,129.27,319.78,Unlimited,SBD,M,
Boys,55.79,7,Ethan Yeager,Eldorado,55.7,117.93,52.16,142.88,312.98,Unlimited,SBD,M,
Boys,55.79,8,Zane Barker,Junction,55.61,117.93,65.77,113.4,297.1,Unlimited,SBD,M,
Boys,55.79,9,Gavin Talbert,San Angelo Grape Creek,55.07,106.59,61.23,120.2,288.03,Unlimited,SBD,M,
Boys,55.79,DQ,Colton Benge,Christoval,55.52,106.59,74.84,,,Unlimited,SBD,M,
Boys,55.79,DQ,Michael Ramirez,Big Spring,55.7,115.67,,,,Unlimited,SBD,M,
Boys,59.87,1,Ethan Crouch,Miles,58.51,172.37,113.4,185.97,471.74,Unlimited,SBD,M,
Boys,59.87,2,Zane Durham,San Angelo Grape Creek,59.15,158.76,77.11,165.56,401.43,Unlimited,SBD,M,
Boys,59.87,3,Sheldon Book,Miles,59.78,124.74,86.18,129.27,340.19,Unlimited,SBD,M,
Boys,59.87,4,Efrain Ruiz,Junction,59.24,117.93,72.57,145.15,335.66,Unlimited,SBD,M,
Boys,59.87,5,Andrew Arredondo,San Angelo TLC Academy,59.78,111.13,79.38,136.08,326.59,Unlimited,SBD,M,
Boys,59.87,6,Rogelio Ruiz,Sonora,59.33,102.06,68.04,115.67,285.76,Unlimited,SBD,M,
Boys,59.87,7,Bryce Bunnell,San Angelo TLC Academy,59.69,97.52,54.43,111.13,263.08,Unlimited,SBD,M,
Boys,59.87,8,Breylnn Powell,Mertzon Irion County,58.97,81.65,65.77,74.84,222.26,Unlimited,SBD,M,
Boys,59.87,DQ,Trevin Meade,Miles,59.69,,,,,Unlimited,SBD,M,
Boys,67.13,1,Budah Schkade,San Angelo Grape Creek,66.59,215.46,138.35,235.87,589.67,Unlimited,SBD,M,
Boys,67.13,2,Jasi Galindo,Eldorado,65.32,210.92,136.08,176.9,523.9,Unlimited,SBD,M,
Boys,67.13,3,Austin Medina,Miles,67.04,197.31,129.27,185.97,512.56,Unlimited,SBD,M,
Boys,67.13,4,Marcos Paredez,Big Spring,65.14,172.37,102.06,201.85,476.27,Unlimited,SBD,M,
Boys,67.13,5,Gavin Covarrubiaz,Sonora,63.5,156.49,92.99,161.03,410.5,Unlimited,SBD,M,
Boys,67.13,6,Drew Valbuena,Big Spring,62.69,127.01,83.91,140.61,351.53,Unlimited,SBD,M,
Boys,67.13,7,Aiden Torres,McCamey,66.77,131.54,72.57,120.2,324.32,Unlimited,SBD,M,
Boys,67.13,8,Emry Funk,San Angelo TLC Academy,64.41,113.4,63.5,106.59,283.5,Unlimited,SBD,M,
Boys,74.84,1,Revin Gavino,Abilene Wylie,71.76,260.82,165.56,222.26,648.64,Unlimited,SBD,M,
Boys,74.84,2,Miguel Vargas,Imperial Buena Vista,71.21,204.12,111.13,192.78,508.02,Unlimited,SBD,M,
Boys,74.84,3,Jaxon Yeager,Eldorado,74.84,165.56,111.13,199.58,476.27,Unlimited,SBD,M,
Boys,74.84,4,Keagan Walz,Miles,68.76,174.63,92.99,183.7,451.32,Unlimited,SBD,M,
Boys,74.84,5,Gavin Gonzales,Junction,68.86,147.42,90.72,170.1,408.23,Unlimited,SBD,M,
Boys,74.84,6,Kyle Olivan,Mertzon Irion County,74.57,136.08,83.91,147.42,367.41,Unlimited,SBD,M,
Boys,74.84,7,Samuel Hagen,San Angelo TLC Academy,74.39,124.74,74.84,136.08,335.66,Unlimited,SBD,M,
Boys,74.84,8,Colton Lynch,McCamey,68.58,104.33,70.31,104.33,278.96,Unlimited,SBD,M,
Boys,74.84,9,Peyton Edger,San Angelo TLC Academy,71.4,77.11,54.43,90.72,222.26,Unlimited,SBD,M,
Boys,74.84,DQ,Gavin Jordahl,San Angelo Grape Creek,73.03,197.31,,,,Unlimited,SBD,M,
Boys,74.84,DQ,Manny Torres,Miles,69.58,,,,,Unlimited,SBD,M,
Boys,82.1,1,Isaac Silva,San Angelo Grape Creek,81.92,226.8,129.27,229.06,585.13,Unlimited,SBD,M,
Boys,82.1,2,Nathan Wood,Junction,79.92,208.65,127.01,208.65,544.31,Unlimited,SBD,M,
Boys,82.1,3,Josh Lozano,Sonora,80.2,208.65,120.2,188.24,517.1,Unlimited,SBD,M,
Boys,82.1,4,Lucan Clemons,San Angelo Grape Creek,81.83,195.04,102.06,208.65,505.76,Unlimited,SBD,M,
Boys,82.1,5,Jack Hamby,Big Spring,77.84,183.7,122.47,183.7,489.88,Unlimited,SBD,M,
Boys,82.1,6,Liam Silva,San Angelo TLC Academy,81.47,140.61,86.18,156.49,383.29,Unlimited,SBD,M,
Boys,82.1,7,Cl Fogle,Miles,75.57,142.88,88.45,140.61,371.95,Unlimited,SBD,M,
Boys,82.1,8,James Mcwhorter,Mertzon Irion County,76.02,136.08,102.06,127.01,365.14,Unlimited,SBD,M,
Boys,82.1,9,Lane Perez,Sonora,78.83,145.15,79.38,131.54,356.07,Unlimited,SBD,M,
Boys,82.1,10,Julian Carrasco,Imperial Buena Vista,81.1,129.27,70.31,156.49,356.07,Unlimited,SBD,M,
Boys,82.1,DQ,Roberto O'Campo,San Angelo TLC Academy,77.02,,,,,Unlimited,SBD,M,
Boys,82.1,DQ,Kayden Carpenter,San Angelo Grape Creek,79.11,197.31,,58.97,,Unlimited,SBD,M,
Boys,89.81,1,Jaysen Santellano,Eldorado,86.82,213.19,149.69,238.14,601.01,Unlimited,SBD,M,
Boys,89.81,2,Zaid Hernandez,Eldorado,89.58,206.38,133.81,204.12,544.31,Unlimited,SBD,M,
Boys,89.81,3,Marcos Flynn,Eldorado,88.54,183.7,138.35,183.7,505.76,Unlimited,SBD,M,
Boys,89.81,4,Sire Garcia,San Angelo Grape Creek,88.99,183.7,113.4,208.65,505.76,Unlimited,SBD,M,
Boys,89.81,5,Christopher Gray,Water Valley,88,181.44,97.52,192.78,471.74,Unlimited,SBD,M,
Boys,89.81,6,Jayden Soto,Imperial Buena Vista,87.72,161.03,74.84,163.29,399.16,Unlimited,SBD,M,
Boys,89.81,7,Jaime Cajica,McCamey,85.55,165.56,81.65,136.08,383.29,Unlimited,SBD,M,
Boys,89.81,8,Daughtry Hazzelwood,McCamey,82.83,108.86,81.65,117.93,308.44,Unlimited,SBD,M,
Boys,89.81,DQ,Jace Cobb,Christoval,87.72,167.83,,,,Unlimited,SBD,M,
Boys,89.81,DQ,Cutter Lange,Water Valley,89.09,142.88,,,,Unlimited,SBD,M,
Boys,99.79,1,Marco Ponce,Junction,93.35,210.92,111.13,206.38,528.44,Unlimited,SBD,M,
Boys,99.79,2,Adyn Tristan,Big Spring,99.79,197.31,108.86,172.37,478.54,Unlimited,SBD,M,
Boys,99.79,3,Matthew Sandoval,Big Spring,93.53,185.97,108.86,172.37,467.2,Unlimited,SBD,M,
Boys,99.79,4,Jesse Balderama,Imperial Buena Vista,92.17,174.63,111.13,172.37,458.13,Unlimited,SBD,M,
Boys,99.79,5,Izaack Ruiz,San Angelo TLC Academy,96.07,154.22,99.79,158.76,412.77,Unlimited,SBD,M,
Boys,99.79,DQ,Axell Botello,Sonora,94.98,199.58,,,,Unlimited,SBD,M,
Boys,99.79,DQ,Josiah Ramirez,Water Valley,89.99,151.95,,,,Unlimited,SBD,M,
Boys,109.77,1,Julian Yocom,Abilene Wylie,103.69,231.33,165.56,195.04,591.94,Unlimited,SBD,M,
Boys,109.77,2,Colton Kelly,Miles,101.06,192.78,122.47,204.12,519.36,Unlimited,SBD,M,
Boys,109.77,3,Justin Knoll,Junction,101.51,204.12,113.4,185.97,503.49,Unlimited,SBD,M,
Boys,124.74,1,Josiah New,Big Spring,117.93,222.26,117.93,217.72,557.92,Unlimited,SBD,M,
Boys,124.74,2,Jordan Roberts,Big Spring,120.47,224.53,124.74,208.65,557.92,Unlimited,SBD,M,
Boys,124.74,3,Peyton Kinzey,San Angelo Grape Creek,116.75,208.65,131.54,183.7,523.9,Unlimited,SBD,M,
Boys,124.74,4,Greg Hodges,McCamey,121.11,197.31,113.4,199.58,510.29,Unlimited,SBD,M,
Boys,139.71,1,Zadrian Washington,Big Spring,129,208.65,133.81,222.26,564.72,Unlimited,SBD,M,
Boys,139.71,2,Rylee Muncy,Water Valley,127.82,181.44,108.86,183.7,474,Unlimited,SBD,M,
Boys,139.71,3,Jonathon Santiago,McCamey,126.92,167.83,97.52,167.83,433.18,Unlimited,SBD,M,
Boys,139.71,4,Treyton Pina,Eldorado,132.09,136.08,88.45,133.81,358.34,Unlimited,SBD,M,
Boys,139.71,5,Henry Hernandez,San Angelo Grape Creek,131.09,104.33,81.65,163.29,349.27,Unlimited,SBD,M,
Boys,139.71+,1,Sutton Peck,Abilene Wylie,152.77,260.82,174.63,215.46,650.91,Unlimited,SBD,M,
Boys,139.71+,2,Ethan Lee #3,Christoval,151.5,217.72,131.54,208.65,557.92,Unlimited,SBD,M,
Boys,139.71+,DQ,Lorenzo Longoria,San Angelo Grape Creek,144.24,226.8,120.2,,,Unlimited,SBD,M,
Boys,,NS,Justin Solis,Water Valley,,,,,,Unlimited,SBD,M,
Boys,,NS,Abel Ramirez,Water Valley,,,,,,Unlimited,SBD,M,
Boys,,NS,Cole Baker,Water Valley,,,,,,Unlimited,SBD,M,
Boys,,NS,Gahel Griner,Christoval,,,,,,Unlimited,SBD,M,
Boys,,NS,Garret Spearman,Christoval,,,,,,Unlimited,SBD,M,
Boys,,NS,Aaron Willis,Junction,,,,,,Unlimited,SBD,M,
Boys,,NS,Bryson Book,Miles,,,,,,Unlimited,SBD,M,
Boys,,NS,Ricky Romo,Eldorado,,,,,,Unlimited,SBD,M,
Boys,,NS,Raul Iglesias,Eldorado,,,,,,Unlimited,SBD,M,
Boys,,NS,Deven Luna,Eldorado,,,,,,Unlimited,SBD,M,
Boys,,NS,Cam Vann,Abilene Wylie,,,,,,Unlimited,SBD,M,
Boys,,NS,Hayden Milican,San Angelo TLC Academy,,,,,,Unlimited,SBD,M,
Boys,,NS,Hunter Gregory,San Angelo TLC Academy,,,,,,Unlimited,SBD,M,
