Division,WeightClassKg,Place,Name,Team,BodyweightKg,Best3SquatKg,Best3BenchKg,Best3DeadliftKg,TotalKg,Equipment,Event,Sex
Boys,51.71,1,Randy Trevino,Gregory-Portland,50.98,142.88,79.38,149.69,371.95,Single-ply,SBD,M
Boys,51.71,2,Pete Olivarez,Orange Grove,50.26,142.88,81.65,127.01,351.53,Single-ply,SBD,M
Boys,51.71,DQ,Max Laguna,Kingsville King,51.35,,,,,Single-ply,SBD,M
Boys,51.71,DQ,Michael Perez,Corpus Christi Tuloso-Midway,44.45,45.36,,,,Single-ply,SBD,M
Boys,59.87,1,Thomas Soto,Corpus Christi Calallen,55.97,199.58,104.33,208.65,512.56,Single-ply,SBD,M
Boys,59.87,2,Jacob de la Paz,Corpus Christi Calallen,55.97,151.95,72.57,161.03,385.55,Single-ply,SBD,M
Boys,55.79,3,Jared Medina,Banquete,55.25,113.4,74.84,138.35,326.59,Single-ply,SBD,M
Boys,55.79,4,Patrick Ayala,Banquete,52.98,102.06,70.31,138.35,310.71,Single-ply,SBD,M
Boys,55.79,5,Estevan Galvan,Freer,54.07,115.67,70.31,124.74,310.71,Single-ply,SBD,M
Boys,55.79,6,Amit Patel,Three Rivers,55.52,106.59,65.77,124.74,297.1,Single-ply,SBD,M
Boys,55.79,7,Alonzo Aguilar,Ben Bolt-Palito Blanco,53.25,81.65,63.5,74.84,219.99,Single-ply,SBD,M
Boys,55.79,DQ,Leonel Villarreal,Falfurrias,55.52,77.11,,,,Single-ply,SBD,M
Boys,55.79,DQ,Daniel Porros,Orange Grove,53.98,,,,,Single-ply,SBD,M
Boys,67.13,1,Tyler Pastrano,San Diego,59.92,170.1,106.59,176.9,453.59,Single-ply,SBD,M
Boys,67.13,2,Andre Wilson,Kingsville King,59.96,149.69,83.91,165.56,399.16,Single-ply,SBD,M
Boys,59.87,3,Chance Mickens,Corpus Christi Calallen,58.69,133.81,74.84,154.22,362.87,Single-ply,SBD,M
Boys,59.87,4,Josh Baez,Falfurrias,56.79,136.08,83.91,136.08,356.07,Single-ply,SBD,M
Boys,67.13,5,Alex Villalpando,Alice,59.96,113.4,61.23,129.27,303.91,Single-ply,SBD,M
Boys,67.13,6,Alex Guerrero #4,Gregory-Portland,60.06,77.11,56.7,99.79,233.6,Single-ply,SBD,M
Boys,59.87,DQ,Johnathan Starks,Banquete,56.34,158.76,,,,Single-ply,SBD,M
Boys,59.87,DQ,Bobby Bourlon,Banquete,59.06,,,,,Single-ply,SBD,M
Boys,59.87,DQ,Fernando Arevaco,Robstown,59.78,,,,,Single-ply,SBD,M
Boys,67.13,1,Matt Valdez,San Diego,64.86,197.31,106.59,206.38,510.29,Single-ply,SBD,M
Boys,67.13,2,Ted Crain,Falfurrias,65.41,204.12,92.99,188.24,485.34,Single-ply,SBD,M
Boys,74.84,3,Aaron Serrato,Freer,67.31,172.37,90.72,204.12,467.2,Single-ply,SBD,M
Boys,67.13,4,John Renninger,Gregory-Portland,65.05,156.49,104.33,188.24,449.06,Single-ply,SBD,M
Boys,67.13,5,Tristan Ruiz,Corpus Christi Calallen,61.78,170.1,92.99,181.44,444.52,Single-ply,SBD,M
Boys,67.13,6,Arnold Bednorz,Freer,64.77,165.56,106.59,165.56,437.72,Single-ply,SBD,M
Boys,67.13,7,Alex Jiminian,Agua Dulce,62.32,149.69,97.52,172.37,419.57,Single-ply,SBD,M
Boys,67.13,8,Marcos Casas,Falfurrias,60.6,106.59,83.91,174.63,365.14,Single-ply,SBD,M
Boys,67.13,9,Garrett Canchola,Orange Grove,60.6,124.74,63.5,142.88,331.12,Single-ply,SBD,M
Boys,67.13,10,Jarrett Bosze,Orange Grove,65.05,108.86,77.11,142.88,328.85,Single-ply,SBD,M
Boys,67.13,11,Armondo Soliz,Orange Grove,62.69,122.47,61.23,140.61,324.32,Single-ply,SBD,M
Boys,67.13,12,Jonathon Hernandez,Orange Grove,61.42,108.86,68.04,140.61,317.51,Single-ply,SBD,M
Boys,67.13,13,Candelario Segura,Ben Bolt-Palito Blanco,60.6,92.99,68.04,102.06,263.08,Single-ply,SBD,M
Boys,67.13,DQ,Joseph Canales,Alice,64.59,147.42,,,,Single-ply,SBD,M
Boys,74.84,1,Rico Rodriguez,San Diego,67.59,263.08,142.88,251.74,657.71,Single-ply,SBD,M
Boys,82.1,2,Daniel Rivera,Orange Grove,75.02,197.31,117.93,199.58,514.83,Single-ply,SBD,M
Boys,74.84,3,Jared Garcia,Corpus Christi Calallen,72.85,195.04,113.4,204.12,512.56,Single-ply,SBD,M
Boys,74.84,4,Miguel Salazar,Corpus Christi Tuloso-Midway,70.85,195.04,113.4,188.24,496.68,Single-ply,SBD,M
Boys,74.84,5,Juan Gonzalez,Alice,68.58,188.24,115.67,183.7,487.61,Single-ply,SBD,M
Boys,74.84,6,Ricky Benavides,Banquete,74.12,183.7,124.74,170.1,478.54,Single-ply,SBD,M
Boys,74.84,7,Bryce Kneip,Corpus Christi Calallen,71.03,181.44,99.79,195.04,476.27,Single-ply,SBD,M
Boys,74.84,8,Damian Cisneros,Gregory-Portland,71.3,192.78,102.06,170.1,464.93,Single-ply,SBD,M
Boys,74.84,9,Paul Almendarez,Three Rivers,73.84,165.56,79.38,188.24,433.18,Single-ply,SBD,M
Boys,74.84,10,Xaivian Stewart,Banquete,74.39,124.74,102.06,154.22,381.02,Single-ply,SBD,M
Boys,74.84,11,Camoren McIver,George West,73.48,124.74,102.06,147.42,374.21,Single-ply,SBD,M
Boys,74.84,12,Johnathan Garza,Kingsville King,73.48,138.35,74.84,161.03,374.21,Single-ply,SBD,M
Boys,74.84,13,Josh Gongora,Alice,73.21,145.15,79.38,136.08,360.61,Single-ply,SBD,M
Boys,74.84,14,Eugene DeLeon,Freer,74.3,111.13,72.57,142.88,326.59,Single-ply,SBD,M
Boys,74.84,15,Lucas Mora,Falfurrias,71.4,106.59,61.23,149.69,317.51,Single-ply,SBD,M
Boys,74.84,DQ,James Barker,Corpus Christi Tuloso-Midway,74.39,,,,,Single-ply,SBD,M
Boys,74.84,DQ,Rudy Luna,Robstown,71.4,,,,,Single-ply,SBD,M
Boys,82.1,1,Chris Hernandez,Gregory-Portland,80.83,208.65,124.74,208.65,542.04,Single-ply,SBD,M
Boys,82.1,2,James Bain,Corpus Christi Tuloso-Midway,79.11,206.38,102.06,199.58,508.02,Single-ply,SBD,M
Boys,82.1,3,Jesus Carrasco,Alice,81.47,174.63,102.06,222.26,498.95,Single-ply,SBD,M
Boys,82.1,4,Aaron Villarreal,Kingsville King,82.1,197.31,102.06,192.78,492.15,Single-ply,SBD,M
Boys,82.1,5,Richard Rodriguez,Ben Bolt-Palito Blanco,78.02,192.78,106.59,183.7,483.08,Single-ply,SBD,M
Boys,82.1,6,Dylan Vasquez,Falfurrias,77.84,183.7,104.33,192.78,480.81,Single-ply,SBD,M
Boys,82.1,7,German Uscanga,Robstown,79.29,158.76,102.06,183.7,444.52,Single-ply,SBD,M
Boys,82.1,8,Adam Martinez,Corpus Christi Tuloso-Midway,78.02,149.69,86.18,181.44,417.3,Single-ply,SBD,M
Boys,82.1,9,Gilbert Jasso,Robstown,77.2,142.88,88.45,165.56,396.89,Single-ply,SBD,M
Boys,89.81,10,Felipe Ruiz,Freer,82.28,97.52,61.23,106.59,265.35,Single-ply,SBD,M
Boys,82.1,DQ,Justin Sobczak,Corpus Christi Tuloso-Midway,78.2,174.63,97.52,,,Single-ply,SBD,M
Boys,82.1,DQ,Abel Rodriguez,Corpus Christi Tuloso-Midway,81.74,,,,,Single-ply,SBD,M
Boys,82.1,DQ,Angel Casas,Corpus Christi Tuloso-Midway,81.47,,,,,Single-ply,SBD,M
Boys,82.1,DQ,Anthony Garza,Falfurrias,76.43,174.63,,,,Single-ply,SBD,M
Boys,82.1,DQ,Cord Casas,Freer,80.2,,,,,Single-ply,SBD,M
Boys,82.1,DQ,Javier Perez,Banquete,80.56,115.67,,,,Single-ply,SBD,M
Boys,82.1,DQ,Balde Alaniz,San Diego,81.65,,,,,Single-ply,SBD,M
Boys,89.81,1,Kameron Handy,Corpus Christi Tuloso-Midway,89.18,258.55,149.69,235.87,644.1,Single-ply,SBD,M
Boys,89.81,2,Justin Mask,Gregory-Portland,85.82,217.72,147.42,197.31,562.45,Single-ply,SBD,M
Boys,89.81,3,Andrew Garza,Falfurrias,87.63,195.04,120.2,226.8,542.04,Single-ply,SBD,M
Boys,89.81,4,Kevin Pena,Robstown,82.55,192.78,120.2,217.72,530.7,Single-ply,SBD,M
Boys,89.81,5,Manny Jimenez,Kingsville King,88.18,183.7,102.06,204.12,489.88,Single-ply,SBD,M
Boys,99.79,6,Tony Zapata,Alice,89.99,183.7,108.86,181.44,474,Single-ply,SBD,M
Boys,89.81,7,Jeremy Alaniz,Freer,85.18,165.56,92.99,183.7,442.25,Single-ply,SBD,M
Boys,89.81,8,Gilbert Aguirre,Three Rivers,85.46,183.7,95.25,149.69,428.64,Single-ply,SBD,M
Boys,89.81,9,Anthony Montoya,Gregory-Portland,86.36,181.44,90.72,154.22,426.38,Single-ply,SBD,M
Boys,89.81,10,Jose Moreno,San Diego,87.36,154.22,90.72,170.1,415.04,Single-ply,SBD,M
Boys,89.81,11,Daniel Chapa,Orange Grove,89.13,131.54,70.31,142.88,344.73,Single-ply,SBD,M
Boys,89.81,DQ,Mike Ruelas,Kingsville King,88.45,149.69,,,,Single-ply,SBD,M
Boys,89.81,DQ,David Ybarra,Gregory-Portland,89.27,,,,,Single-ply,SBD,M
Boys,89.81,DQ,Austin Gonzales,Freer,89.18,174.63,,,,Single-ply,SBD,M
Boys,89.81,DQ,Mike DeLeon,Falfurrias,89.63,,,,,Single-ply,SBD,M
Boys,99.79,1,Luis Lopez #3,San Diego,97.98,317.51,197.31,272.16,786.98,Single-ply,SBD,M
Boys,99.79,2,Alex Tanguma,Corpus Christi Calallen,99.25,272.16,183.7,265.35,721.21,Single-ply,SBD,M
Boys,99.79,3,Matt Garcia,Ben Bolt-Palito Blanco,95.8,265.35,174.63,260.82,700.8,Single-ply,SBD,M
Boys,99.79,4,Brendon Breland,Banquete,97.16,219.99,142.88,226.8,589.67,Single-ply,SBD,M
Boys,99.79,5,John Rivera,Alice,97.52,235.87,142.88,183.7,562.45,Single-ply,SBD,M
Boys,99.79,6,Riley Richardson,Gregory-Portland,94.8,201.85,122.47,201.85,526.17,Single-ply,SBD,M
Boys,99.79,7,Edward Silva,Robstown,91.63,192.78,102.06,204.12,498.95,Single-ply,SBD,M
Boys,99.79,8,Bubba Everett,San Diego,98.52,208.65,102.06,183.7,494.42,Single-ply,SBD,M
Boys,99.79,9,Justin Salinas,Kingsville King,92.26,190.51,120.2,151.95,462.66,Single-ply,SBD,M
Boys,99.79,10,Nick Isaacks,Gregory-Portland,99.34,170.1,95.25,174.63,439.98,Single-ply,SBD,M
Boys,99.79,11,Andrew Pena,Robstown,98.25,163.29,97.52,170.1,430.91,Single-ply,SBD,M
Boys,99.79,12,Michael Cortinas,George West,96.71,183.7,113.4,129.27,426.38,Single-ply,SBD,M
Boys,99.79,13,Josh Carroll,Freer,98.16,74.84,65.77,113.4,254.01,Single-ply,SBD,M
Boys,99.79,DQ,Jesse Gonzales,Kingsville King,99.06,165.56,120.2,,,Single-ply,SBD,M
Boys,109.77,1,Reno Perez,San Diego,100.24,328.85,170.1,281.23,780.18,Single-ply,SBD,M
Boys,109.77,2,Alex Garcia #6,San Diego,100.43,272.16,154.22,249.48,675.85,Single-ply,SBD,M
Boys,109.77,3,Dakota Cooksy,Corpus Christi Calallen,107.59,265.35,165.56,244.94,675.85,Single-ply,SBD,M
Boys,109.77,4,Blade Bronstad,Corpus Christi Calallen,108.23,258.55,127.01,238.14,623.69,Single-ply,SBD,M
Boys,109.77,5,Warren Oaks,Alice,108.41,199.58,161.03,215.46,576.06,Single-ply,SBD,M
Boys,109.77,6,Lee Cook,Ben Bolt-Palito Blanco,104.33,206.38,147.42,201.85,555.65,Single-ply,SBD,M
Boys,109.77,7,Bryan Chesser,George West,105.96,215.46,124.74,183.7,523.9,Single-ply,SBD,M
Boys,109.77,8,Levi Fulcher,Three Rivers,108.41,206.38,113.4,199.58,519.36,Single-ply,SBD,M
Boys,109.77,9,Dabi Reyna,Robstown,103.06,176.9,108.86,201.85,487.61,Single-ply,SBD,M
Boys,109.77,10,Oscar Ramirez,Gregory-Portland,102.69,185.97,111.13,181.44,478.54,Single-ply,SBD,M
Boys,109.77,11,Bobby Garza,Falfurrias,101.06,158.76,136.08,174.63,469.47,Single-ply,SBD,M
Boys,109.77,12,Derick Espinoza,San Diego,107.68,174.63,106.59,158.76,439.98,Single-ply,SBD,M
Boys,109.77,13,Kasey Hosey,Robstown,102.33,120.2,111.13,197.31,428.64,Single-ply,SBD,M
Boys,109.77,14,Zach Hernandez,Ben Bolt-Palito Blanco,101.7,108.86,65.77,108.86,283.5,Single-ply,SBD,M
Boys,109.77,DQ,Aaron Guiterrez,Kingsville King,104.33,174.63,,,,Single-ply,SBD,M
Boys,124.74,1,Michael Rodriguez #4,Kingsville King,113.85,294.84,197.31,240.4,732.55,Single-ply,SBD,M
Boys,124.74,2,Kristopher Gebert,Orange Grove,123.65,240.4,142.88,206.38,589.67,Single-ply,SBD,M
Boys,124.74,3,David Silva,Corpus Christi Calallen,113.58,233.6,120.2,215.46,569.26,Single-ply,SBD,M
Boys,124.74,4,Juan Macias,Alice,117.48,226.8,142.88,185.97,555.65,Single-ply,SBD,M
Boys,124.74,5,Ariel Solis,Alice,114.49,204.12,154.22,190.51,548.85,Single-ply,SBD,M
Boys,124.74,DQ,Vince Gutierrez,Corpus Christi Tuloso-Midway,116.66,,,,,Single-ply,SBD,M
Boys,124.74,DQ,Richie Salinas,Kingsville King,123.83,263.08,,,,Single-ply,SBD,M
Boys,124.74,DQ,Zak Pizzini,San Diego,110.31,242.67,,,,Single-ply,SBD,M
Boys,124.74+,1,Luis Lopez #1,Kingsville King,138.25,274.42,124.74,226.8,625.96,Single-ply,SBD,M
Boys,124.74+,2,Hector Garza,Robstown,133.72,226.8,136.08,226.8,589.67,Single-ply,SBD,M
Boys,124.74+,3,Bobby Pulido,Falfurrias,126.01,154.22,145.15,217.72,517.1,Single-ply,SBD,M
Boys,124.74+,4,Manuel González,Alice,127.19,183.7,136.08,172.37,492.15,Single-ply,SBD,M
Boys,124.74+,5,David Salazar,Freer,129.82,165.56,113.4,185.97,464.93,Single-ply,SBD,M
Boys,124.74+,6,Justin Ortiz,Agua Dulce,129.91,142.88,97.52,161.03,401.43,Single-ply,SBD,M
Boys,124.74+,7,Justin Lopez,Ben Bolt-Palito Blanco,129,108.86,68.04,124.74,301.64,Single-ply,SBD,M
Boys,124.74+,DQ,Gabriel Vera,San Diego,125.24,,,,,Single-ply,SBD,M
