[
  {
    "name": "ERYS",
    "price": "1000",
    "singer": "Jaden",
    "year": "2019",
    "url": "cardPhoto/erys.jpg",
    "article": "3132",
    "color": "#56caf9"
  },
  {
    "name": "Collection one",
    "price": "3000",
    "singer": "Saint JHN",
    "year": "2018",
    "url": "cardPhoto/collectionOne.png",
    "article": "4222",
    "color": "#56caf9"
  },
  {
    "name": "Culture 3",
    "price": "9000",
    "year": "2021",
    "singer": "Migos",
    "url": "cardPhoto/culture3.png",
    "article": "4902",
    "color": "#56caf9"
  },
  {
    "name": "After hours",
    "price": "1910",
    "year": "2020",
    "singer": "Weeknd",
    "url": "cardPhoto/afterHours.jpg",
    "article": "4951",
    "color": "#56caf9"
  },
  {
    "name": "6pc Hot Ep",
    "price": "90000",
    "year": "2020",
    "singer": "6lack",
    "url": "cardPhoto/6pc.jpg",
    "article": "0111",
    "color": "#56caf9"
  },
  {
    "name": "DONDA",
    "price": "10000",
    "year": "2021",
    "singer": "Kanye West",
    "url": "cardPhoto/DONDA.jpg",
    "article": "0000",
    "color": "#56caf9"
  },
  {
    "name": "Рассвет",
    "price": "739",
    "year": "2020",
    "singer": "Леван Горозия",
    "url": "cardPhoto/l-one.jpg",
    "article": "0099",
    "color": "#56caf9"
  },
  {
    "name": "Свистки и бумажки",
    "price": "7777",
    "year": "2021",
    "singer": "Скриптонит",
    "url": "cardPhoto/scryp.jpg",
    "article": "4109",
    "color": "#56caf9"
  },
  {
    "name": "The Off-Season",
    "price": "3821",
    "year": "2021",
    "singer": "J-Cole",
    "url": "cardPhoto/theoffseason.jpg",
    "article": "4831",
    "color": "#56caf9"
  },
  {
    "name": "Wunna",
    "price": "4144",
    "year": "2020",
    "singer": "Gunna",
    "url": "cardPhoto/wunna.png",
    "article": "4899",
    "color": "#56caf9"
  }
]