module svc-sub

go 1.17

require (
	github.com/alicebob/miniredis/v2 v2.15.1
	github.com/go-redis/redis/v8 v8.11.3
	github.com/gorilla/mux v1.8.0
	github.com/gorilla/websocket v1.4.2
	github.com/stretchr/testify v1.7.0
)

require (
	github.com/alicebob/gopher-json v0.0.0-20200520072559-a9ecdc9d1d3a // indirect
	github.com/cespare/xxhash/v2 v2.1.1 // indirect
	github.com/davecgh/go-spew v1.1.1 // indirect
	github.com/dgryski/go-rendezvous v0.0.0-20200823014737-9f7001d12a5f // indirect
	github.com/kr/pretty v0.1.0 // indirect
	github.com/pmezard/go-difflib v1.0.0 // indirect
	github.com/yuin/gopher-lua v0.0.0-20200816102855-ee81675732da // indirect
	gopkg.in/check.v1 v1.0.0-20190902080502-41f04d3bba15 // indirect
	gopkg.in/yaml.v3 v3.0.0-20200313102051-9f266ea9e77c // indirect
)
