{
  "$schema": "https://docs.renovatebot.com/renovate-schema.json",
  "extends": [
    ":ignoreModulesAndTests",
    "group:monorepos",
    "group:recommended",
    "helpers:disableTypesNodeMajor"
  ],
  "commitMessagePrefix": "(renovate)",
  "dependencyDashboard": true,
  "dependencyDashboardTitle": "Renovate Upgrade Bot Status",
  "enabledManagers": ["npm"],
  "prConcurrentLimit": 4,
  "rangeStrategy": "bump",
  "separateMinorPatch": false,
  "separateMultipleMajor": true,
  "stabilityDays": 7,
  "rollbackPrs": true,
  "gitLabAutomerge": true,
  "automerge": false,
  "timezone": "America/Los_Angeles",
  "minor": {
    "automerge": false
  }
}
