{
    "_id": "1miLVRtvsnZU6TTk",
    "data": {
        "actionCategory": {
            "value": ""
        },
        "actionType": {
            "value": "passive"
        },
        "actions": {
            "value": null
        },
        "description": {
            "value": "<p>Small roots sprout from your feet, steadying you as you move. You gain the @Compendium[pf2e.feats-srd.Steady Balance]{Steady Balance} skill feat, even if you aren't trained in Acrobatics, and you can use the @Compendium[pf2e.actionspf2e.Anchor]{Anchor} action.</p>"
        },
        "featType": {
            "value": "ancestry"
        },
        "level": {
            "value": 5
        },
        "location": "",
        "prerequisites": {
            "value": []
        },
        "rules": [],
        "source": {
            "value": "Pathfinder Lost Omens: Ancestry Guide"
        },
        "traits": {
            "custom": "",
            "rarity": {
                "value": "common"
            },
            "value": [
                "leshy"
            ]
        }
    },
    "effects": [],
    "flags": {},
    "img": "systems/pf2e/icons/features/feats/feats.webp",
    "name": "Anchoring Roots",
    "type": "feat"
}
