{
    "_id": "E3KaNlIYwSD4fpfL",
    "data": {
        "attributes": {
            "ac": {
                "value": 0
            },
            "hardness": 0,
            "hasHealth": true,
            "hp": {
                "details": "",
                "max": 0,
                "temp": 0,
                "value": 0
            },
            "stealth": {
                "details": "<p>(expert)</p>",
                "value": 11
            }
        },
        "creatureType": "",
        "details": {
            "description": "<p>The pile of bones transforms into a Large silver dragon, while the PCs appear to transform into dark, shadowy figures of alien physique. The dragon's flesh appears to slowly dissolve into lines of black smoke, which trail away toward the PCs and appear to be absorbed into their bodies. Once the dragon is stripped of flesh, its skeleton explodes in a shower of bone fragments.</p>",
            "disable": "<p><span data-pf2-check=\"religion\" data-pf2-traits=\"haunt\" data-pf2-label=\"Exorcise the Spirit DC\" data-pf2-dc=\"20\" data-pf2-show-dc=\"gm\">Religion</span> (trained) to exorcise the spirit (two actions), or <span data-pf2-check=\"diplomacy\" data-pf2-traits=\"haunt\" data-pf2-label=\"Calm the Spirit DC\" data-pf2-dc=\"23\" data-pf2-show-dc=\"gm\">Diplomacy</span> (trained) to calm the spirit momentarily (two actions).</p>",
            "isComplex": false,
            "level": {
                "value": 3
            },
            "reset": "<p>1 minute, as the bone fragments slowly move back into a neat pile with the skull on top.</p>",
            "routine": "<p data-visibility=\"gm\"><strong>Trigger</strong> A creature comes within 15 feet of the dragon skull;</p>\n<p><strong>Effect</strong> All living creatures within 20 feet of the nest are peppered with bone shards and take [[/r {2d10+7}[slashing]]]{2d10+7 slashing damage} (<span data-pf2-saving-throw=\"reflex\" data-pf2-traits=\"damaging-effect,haunt,divine,necromancy\" data-pf2-label=\"Dragon's Death DC\" data-pf2-dc=\"20\" data-pf2-show-dc=\"gm\">basic Reflex</span> save).</p>"
        },
        "saves": {
            "fortitude": {
                "saveDetail": "",
                "value": 0
            },
            "reflex": {
                "saveDetail": "",
                "value": 0
            },
            "will": {
                "saveDetail": "",
                "value": 0
            }
        },
        "source": {
            "value": "Pathfinder Society Scenario 2-01: Citadel of Corruption"
        },
        "statusEffects": [],
        "traits": {
            "ci": [],
            "di": {
                "custom": "",
                "selected": {},
                "value": []
            },
            "dr": [],
            "dv": [],
            "rarity": {
                "value": "common"
            },
            "size": {
                "value": "med"
            },
            "traits": {
                "custom": "",
                "value": [
                    "haunt"
                ]
            }
        }
    },
    "effects": [],
    "flags": {},
    "img": "systems/pf2e/icons/default-icons/hazard.svg",
    "items": [],
    "name": "Dragon's Death (1-2)",
    "token": {
        "disposition": 0,
        "height": 1,
        "img": "systems/pf2e/icons/default-icons/hazard.svg",
        "name": "Dragon's Death",
        "width": 1
    },
    "type": "hazard"
}
