{
    "_id": "YPxpk9JbMnKjbNLc",
    "data": {
        "abilityBoostLevels": {
            "value": [
                5,
                10,
                15,
                20
            ]
        },
        "ancestryFeatLevels": {
            "value": [
                1,
                5,
                9,
                13,
                17
            ]
        },
        "attacks": {
            "advanced": 0,
            "martial": 0,
            "other": {
                "name": "",
                "rank": 0
            },
            "simple": 1,
            "unarmed": 1
        },
        "classDC": 1,
        "classFeatLevels": {
            "value": [
                1,
                2,
                4,
                6,
                8,
                10,
                12,
                14,
                16,
                18,
                20
            ]
        },
        "defenses": {
            "heavy": 0,
            "light": 0,
            "medium": 0,
            "unarmored": 2
        },
        "description": {
            "value": "<p><em>The strength of your fist flows from your mind and spirit. You seek perfection-honing your body into a flawless instrument and your mind into an orderly bastion of wisdom. You're a fierce combatant renowned for martial arts skills and combat stances that grant you unique fighting moves. While the challenge of mastering many fighting styles drives you to great heights, you also enjoy meditating on philosophical questions and discovering new ways to obtain peace and enlightenment.</em></p>\n<p><strong>Key Ability: STRENGTH OR DEXTERITY</strong></p>\n<p>At 1st level, your class gives you an ability boost to your choice of Strength or Dexterity.</p>\n<p><strong>Hit Points: 10 plus your Constitution modifier</strong></p>\n<p>You increase your maximum number of HP by this number at 1st level and every level thereafter.</p>\n<h1>Roleplaying the Monk</h1>\n<h2>During Combat Encounters...</h2>\n<p>You speed into the fray, dodging or leaping past obstacles with acrobatic maneuvers. You strike opponents in a rapid flurry of attacks, using your bare fists or wielding specialized weapons that you mastered during your monastic training. Stances let you change up your combat style for different situations, and ki abilities allow you to perform mystic feats like healing yourself and soaring through the air.</p>\n<h2>During Social Encounters...</h2>\n<p>Your perceptiveness lets you see through falsehoods, and your philosophical training provides insight into any situation.</p>\n<h2>While Exploring...</h2>\n<p>You climb up walls, dodge traps, overcome obstacles, and leap over pits. You usually stay toward the outside of the group to protect more vulnerable members, and you're well suited to looking for danger or moving stealthily.</p>\n<h2>In Downtime...</h2>\n<p>You diligently exercise, eat healthy foods, meditate, and study various philosophies. You might also take up a craft that you strive to perfect.</p>\n<h2>You Might...</h2>\n<ul>\n<li>Maintain a regimen of physical training and meditation.</li>\n<li>Face adversity with a calm and measured approach, never panicking or succumbing to despair.</li>\n<li>Look to the future for ways you can improve, while remaining at peace with your present self.</li>\n</ul>\n<h2>Others Probably...</h2>\n<ul>\n<li>Marvel at your feats of physical prowess.</li>\n<li>Think you're more than a bit uptight, given your vows and tenets.</li>\n<li>Come to you for philosophical advice.</li>\n</ul>\n<h1>Initial Proficiencies</h1>\n<p>At 1st level, you gain the listed proficiency ranks in the following statistics. You are untrained in anything not listed unless you gain a better proficiency rank in some other way.</p>\n<h2>Perception</h2>\n<p>Trained in Perception</p>\n<h2>Saving Throws</h2>\n<p>Expert in Fortitude</p>\n<p>Expert in Reflex</p>\n<p>Expert in Will</p>\n<h2>Skills</h2>\n<p>Trained in a number of skills equal to 4 plus your Intelligence modifier</p>\n<h2>Attacks</h2>\n<p>Trained in simple weapons</p>\n<p>Trained in unarmed attacks</p>\n<h2>Defenses</h2>\n<p>Untrained in all armor</p>\n<p>Expert in unarmored defense</p>\n<h2>Class DC</h2>\n<p>Trained in monk class DC</p>\n<h1>Class Features</h1>\n<p>You gain these features as a Monk. Abilities gained at higher levels list the levels at which you gain them next to the features' names.</p>\n<table class=\"pf2-table\">\n<thead>\n<tr>\n<th>Your Level</th>\n<th>Class Features</th>\n</tr>\n</thead>\n<tbody>\n<tr>\n<td>1</td>\n<td>Ancestry and background, initial proficiencies, flurry of blows, monk feat, powerful fist</td>\n</tr>\n<tr>\n<td>2</td>\n<td>Monk feat, skill feat</td>\n</tr>\n<tr>\n<td>3</td>\n<td>General feat, incredible movement +10 feet, mystic strikes, skill increase</td>\n</tr>\n<tr>\n<td>4</td>\n<td>Monk feat, skill feat</td>\n</tr>\n<tr>\n<td>5</td>\n<td>Ability boosts, alertness, ancestry feat, expert strikes, skill increase</td>\n</tr>\n<tr>\n<td>6</td>\n<td>Monk feat, skill feat</td>\n</tr>\n<tr>\n<td>7</td>\n<td>General feat, incredible movement +15 feet, path to perfection, skill increase, weapon specialization</td>\n</tr>\n<tr>\n<td>8</td>\n<td>Monk feat, skill feat</td>\n</tr>\n<tr>\n<td>9</td>\n<td>Ancestry feat, metal strikes, monk expertise, skill increase</td>\n</tr>\n<tr>\n<td>10</td>\n<td>Ability boosts, monk feat, skill feat</td>\n</tr>\n<tr>\n<td>11</td>\n<td>General feat, incredible movement +20 feet, second path to perfection, skill increase</td>\n</tr>\n<tr>\n<td>12</td>\n<td>Monk feat, skill feat</td>\n</tr>\n<tr>\n<td>13</td>\n<td>Ancestry feat, graceful mastery, master strikes, skill increase</td>\n</tr>\n<tr>\n<td>14</td>\n<td>Monk feat, skill feat</td>\n</tr>\n<tr>\n<td>15</td>\n<td>Ability boosts, general feat, greater weapon specialization, incredible movement +25 feet, skill increase, third path to perfection</td>\n</tr>\n<tr>\n<td>16</td>\n<td>Monk feat, skill feat</td>\n</tr>\n<tr>\n<td>17</td>\n<td>Adamantine strikes, ancestry feat, graceful legend, skill increase</td>\n</tr>\n<tr>\n<td>18</td>\n<td>Monk feat, skill feat</td>\n</tr>\n<tr>\n<td>19</td>\n<td>General feat, incredible movement +30 feet, perfected form, skill increase</td>\n</tr>\n<tr>\n<td>20</td>\n<td>Ability boosts, monk feat, skill feat</td>\n</tr>\n</tbody>\n</table>\n<h2>Ancestry and Background</h2>\n<p>In addition to the abilities provided by your class at 1st level, you have the benefits of your selected ancestry and background.</p>\n<h2>Flurry of Blows</h2>\n<p>You can attack rapidly with fists, feet, elbows, knees, and other unarmed attacks. You gain the Flurry of Blows action.</p>\n<p>@Compendium[pf2e.actionspf2e.Flurry of Blows]{Flurry of Blows} <span class=\"pf2-icon\">A</span></p>\n<hr />\n<p>Make two unarmed Strikes. If both hit the same creature, combine their damage for the purpose of resistances and weaknesses. Apply your multiple attack penalty to the Strikes normally. As it has the flourish trait, you can use Flurry of Blows only once per turn.</p>\n<h2>Ki Spells</h2>\n<p>By tapping into a supernatural inner reserve called ki, you can create magical effects. Certain feats grant you special spells called ki spells, which are a type of focus spell. It costs 1 Focus Point to cast a focus spell. When you gain your first ki spell, you also gain a focus pool of 1 Focus Point. You refill your focus pool during your daily preparations, and you regain 1 Focus Point by spending 10 minutes using the @Compendium[pf2e.actionspf2e.Refocus]{Refocus} activity to meditate in order to reach inner peace.</p>\n<p>Focus spells are automatically heightened to half your level rounded up. Taking feats can give you more focus spells and increase the size of your focus pool, though your focus pool can never hold more than 3 points.</p>\n<p>When you first gain a ki spell, decide whether your ki spells are divine or occult spells. You are trained in spell attack rolls and spell DCs of that tradition, and your key spellcasting ability is Wisdom.</p>\n<h2>Initial Proficiencies</h2>\n<p>At 1st level, you gain a number of proficiencies representing your basic training, which are noted at the start of this class.</p>\n<h2>Monk Feats</h2>\n<p>At 1st level and every even-numbered level thereafter, you gain a monk class feat.</p>\n<h2>Powerful Fist</h2>\n<p>You know how to wield your fists as deadly weapons. The damage die for your fist increases to 1d6 instead of 1d4. Most people take a -2 circumstance penalty when making a lethal attack with nonlethal unarmed attacks, because they find it hard to use their fists with deadly force. You don't take this penalty when making a lethal attack with your fist or any other unarmed attacks.</p>\n<h2>Skill Feats<span style=\"float: right;\">Level 2</span></h2>\n<p>At 2nd level and every 2 levels thereafter, you gain a skill feat. You must be trained or better in the corresponding skill to select a skill feat.</p>\n<h2>General Feats<span style=\"float: right;\">Level 3</span></h2>\n<p>At 3rd level and every 4 levels thereafter, you gain a general feat.</p>\n<h2>Incredible Movement<span style=\"float: right;\">Level 3</span></h2>\n<p>You move like the wind. You gain a +10-foot status bonus to your Speed whenever you're not wearing armor. The bonus increases by 5 feet for every 4 levels you have beyond 3rd.</p>\n<h2>Mystic Strikes<span style=\"float: right;\">Level 3</span></h2>\n<p>Focusing your will into your physical attacks imbues them with mystical energy. Your unarmed attacks become magical, allowing them to get past resistances to non-magical attacks. However, you still need an item such as @Compendium[pf2e.equipment-srd.Handwraps of Mighty Blows]{Handwraps of Mighty Blows (+1)} to gain an item bonus to attack rolls or increase your attacks' weapon damage dice.</p>\n<h2>Skill Increases<span style=\"float: right;\">Level 3</span></h2>\n<p>At 3rd level and every 2 levels thereafter, you gain a skill increase. You can use this increase to either become trained in one skill you're untrained in, or become an expert in one skill in which you're already trained.</p>\n<p>At 7th level, you can use skill increases to become a master in a skill in which you're already an expert, and at 15th level, you can use them to become legendary in a skill in which you're already a master.</p>\n<h2>Ability Boosts<span style=\"float: right;\">Level 5</span></h2>\n<p>At 5th level and every 5 levels thereafter, you boost four different ability scores. You can use these ability boosts to increase your ability scores above 18. Boosting an ability score increases it by 1 if it's already 18 or above, or by 2 if it starts out below 18.</p>\n<h2>Alertness<span style=\"float: right;\">Level 5</span></h2>\n<p>You remain alert to threats around you. Your proficiency rank for Perception increases to expert.</p>\n<h2>Ancestry Feats<span style=\"float: right;\">Level 5</span></h2>\n<p>In addition to the ancestry feat you started with, you gain an ancestry feat at 5th level and every 4 levels thereafter.</p>\n<h2>Expert Strikes<span style=\"float: right;\">Level 5</span></h2>\n<p>You've practiced martial arts and have now surpassed your former skill. Your proficiency ranks for unarmed attacks and simple weapons increase to expert.</p>\n<h2>Path to Perfection<span style=\"float: right;\">Level 7</span></h2>\n<p>You have progressed along your own path to enlightenment. Choose your Fortitude, Reflex, or Will saving throw. Your proficiency rank for the chosen saving throw increases to master. When you roll a success on the chosen saving throw, you get a critical success instead.</p>\n<h2>Weapon Specialization<span style=\"float: right;\">Level 7</span></h2>\n<p>You've learned how to inflict greater injuries with the weapons you know best. You deal 2 additional damage with weapons and unarmed attacks in which you are an expert. This damage increases to 3 if you're a master, and 4 if you're legendary.</p>\n<h2>Metal Strikes<span style=\"float: right;\">Level 9</span></h2>\n<p>You can adjust your body to make unarmed attacks infused with the mystic energy of rare metals. Your unarmed attacks are treated as cold iron and silver. This allows you to deal more damage to a variety of supernatural creatures, such as demons, devils, and fey.</p>\n<h2>Monk Expertise<span style=\"float: right;\">Level 9</span></h2>\n<p>Your proficiency rank for your monk class DC increases to expert. If you have ki spells, your proficiency rank for spell attacks and spell DCs with the tradition of magic you use for your ki spells increases to expert.</p>\n<h2>Second Path to Perfection<span style=\"float: right;\">Level 11</span></h2>\n<p>You've learned to find perfection in every success. Choose a different saving throw than the one you chose for your path to perfection. Your proficiency rank for the chosen saving throw increases to master. If you roll a success with the chosen saving throw, you instead critically succeed.</p>\n<h2>Graceful Mastery<span style=\"float: right;\">Level 13</span></h2>\n<p>You move with perpetual grace in battle, eluding and turning aside blows. Your proficiency rank for unarmored defense increases to master.</p>\n<h2>Master Strikes<span style=\"float: right;\">Level 13</span></h2>\n<p>You have honed your skill in using your body as a weapon. Your proficiency ranks for unarmed attacks and simple weapons increase to master.</p>\n<h2>Greater Weapon Specialization<span style=\"float: right;\">Level 15</span></h2>\n<p>Your damage from weapon specialization increases to 4 with weapons and unarmed attacks in which you're an expert, 6 if you're a master, and 8 if you're legendary.</p>\n<h2>Third Path to Perfection<span style=\"float: right;\">Level 15</span></h2>\n<p>You have made great progress in your personal studies of enlightenment. Choose one of the saving throws you selected for path to perfection or second path to perfection. Your proficiency rank for the chosen type of save increases to legendary. When you roll a critical failure on the chosen type of save, you get a failure instead. When you roll a failure on the chosen type of save against an effect that deals damage, you take half damage.</p>\n<h2>Adamantine Strikes<span style=\"float: right;\">Level 17</span></h2>\n<p>When you focus your will into your limbs, your blows are as unyielding as the hardest of metals. Your unarmed attacks are treated as adamantine.</p>\n<h2>Graceful Legend<span style=\"float: right;\">Level 17</span></h2>\n<p>Your sublime movement grants you unparalleled protection and offense. Your proficiency rank for unarmored defense increases to legendary, and your proficiency rank for your monk class DC increases to master. If you have ki spells, your proficiency rank for spell attack rolls and spell DCs with the tradition of magic you use for your ki spells increases to master.</p>\n<h2>Perfected Form<span style=\"float: right;\">Level 19</span></h2>\n<p>You have purged incompetence from your techniques. On your first Strike of your turn, if you roll lower than 10, you can treat the attack roll as a 10. This is a fortune effect.</p>"
        },
        "generalFeatLevels": {
            "value": [
                3,
                7,
                11,
                15,
                19
            ]
        },
        "hp": 10,
        "items": {
            "1fw9s": {
                "id": "D2AE8RfMlZ3D1FuV",
                "img": "systems/pf2e/icons/features/classes/mystic-strikes.webp",
                "level": 3,
                "name": "Mystic Strikes",
                "pack": "pf2e.classfeatures"
            },
            "2yqet": {
                "id": "WiM7X4xmpMx4s6LD",
                "img": "systems/pf2e/icons/features/classes/weapon-specialization.webp",
                "level": 7,
                "name": "Weapon Specialization (Level 7)",
                "pack": "pf2e.classfeatures"
            },
            "3ohvk": {
                "id": "y6qnbUc8y0815QNE",
                "img": "systems/pf2e/icons/features/classes/choice-feature.webp",
                "level": 11,
                "name": "Second Path to Perfection",
                "pack": "pf2e.classfeatures"
            },
            "4ru9g": {
                "id": "Z7HX6TeFsaup7Dx9",
                "img": "systems/pf2e/icons/features/classes/greater-weapon-specialization.webp",
                "level": 15,
                "name": "Greater Weapon Specialization (Level 15)",
                "pack": "pf2e.classfeatures"
            },
            "8tl8t": {
                "id": "Cq6NjvcKZOMySBVj",
                "img": "systems/pf2e/icons/features/classes/incredible-movement.webp",
                "level": "3",
                "name": "Incredible Movement",
                "pack": "pf2e.classfeatures"
            },
            "ai4sq": {
                "id": "VgZIutWjFl8oZQFi",
                "img": "systems/pf2e/icons/features/classes/expert-strikes.webp",
                "level": "5",
                "name": "Expert Strikes",
                "pack": "pf2e.classfeatures"
            },
            "bgd0f": {
                "id": "2o1Cj7hDayDlslqY",
                "img": "systems/pf2e/icons/features/classes/alertness.webp",
                "level": 5,
                "name": "Alertness (Level 5)",
                "pack": "pf2e.classfeatures"
            },
            "c8q3r": {
                "id": "NLHHHiAcdnZ5ohc2",
                "img": "systems/pf2e/icons/features/classes/flurry-of-blows.webp",
                "level": "1",
                "name": "Flurry of Blows",
                "pack": "pf2e.classfeatures"
            },
            "dzcvw": {
                "id": "JWDfzYub3JfuEtth",
                "img": "systems/pf2e/icons/features/classes/graceful-legend.webp",
                "level": "17",
                "name": "Graceful Legend",
                "pack": "pf2e.classfeatures"
            },
            "iqbky": {
                "id": "SB8UJ8rZmvbcBweJ",
                "img": "systems/pf2e/icons/features/classes/powerful-fist.webp",
                "level": "1",
                "name": "Powerful Fist",
                "pack": "pf2e.classfeatures"
            },
            "k3mxz": {
                "id": "95LI24ZSx0d4qfKX",
                "img": "systems/pf2e/icons/features/classes/graceful-mastery.webp",
                "level": "13",
                "name": "Graceful Mastery",
                "pack": "pf2e.classfeatures"
            },
            "t4zic": {
                "id": "lxImO5D0qWp0gXFB",
                "img": "systems/pf2e/icons/features/classes/monk-expertise.webp",
                "level": "9",
                "name": "Monk Expertise",
                "pack": "pf2e.classfeatures"
            },
            "udbeu": {
                "id": "CoRfFkisEsHE1e43",
                "img": "systems/pf2e/icons/features/classes/metal-strikes.webp",
                "level": 9,
                "name": "Metal Strikes",
                "pack": "pf2e.classfeatures"
            },
            "xcxpa": {
                "id": "5cthRUkRqRtduVvN",
                "img": "systems/pf2e/icons/features/classes/adamantine-strikes.webp",
                "level": 17,
                "name": "Adamantine Strikes",
                "pack": "pf2e.classfeatures"
            },
            "z0s0v": {
                "id": "1K6m6AVmn3r8XZ9d",
                "img": "systems/pf2e/icons/features/classes/choice-feature.webp",
                "level": 7,
                "name": "Path to Perfection",
                "pack": "pf2e.classfeatures"
            },
            "zeyz5": {
                "id": "KmTfg7Sg5va4yU00",
                "img": "systems/pf2e/icons/features/classes/perfected-form.webp",
                "level": "19",
                "name": "Perfected Form",
                "pack": "pf2e.classfeatures"
            },
            "zgtbz": {
                "id": "haoTkr2U5k7kaAKN",
                "img": "systems/pf2e/icons/features/classes/choice-feature.webp",
                "level": 15,
                "name": "Third Path to Perfection",
                "pack": "pf2e.classfeatures"
            },
            "zl9gg": {
                "id": "0iidKkzC2yy13lIf",
                "img": "systems/pf2e/icons/features/classes/master-strikes.webp",
                "level": 13,
                "name": "Master Strikes",
                "pack": "pf2e.classfeatures"
            }
        },
        "keyAbility": {
            "value": [
                "dex",
                "str"
            ]
        },
        "perception": 1,
        "rules": [],
        "savingThrows": {
            "fortitude": 2,
            "reflex": 2,
            "will": 2
        },
        "skillFeatLevels": {
            "value": [
                2,
                4,
                6,
                8,
                10,
                12,
                14,
                16,
                18,
                20
            ]
        },
        "skillIncreaseLevels": {
            "value": [
                3,
                5,
                7,
                9,
                11,
                13,
                15,
                17,
                19
            ]
        },
        "source": {
            "value": "Pathfinder Core Rulebook"
        },
        "trainedSkills": {
            "additional": 4,
            "value": []
        },
        "traits": {
            "custom": "",
            "rarity": {
                "value": "common"
            },
            "value": []
        }
    },
    "effects": [],
    "flags": {},
    "img": "systems/pf2e/icons/classes/monk.webp",
    "name": "Monk",
    "type": "class"
}
