{
    "_id": "QibpLccM5bLUMopj",
    "content": "<h1 class=\"title\">Lymnieris (The Auroral Tower) [LG]</h1>\n<p class=\"title\"><span id=\"ctl00_MainContent_DetailedOutput\"><span id=\"ctl00_MainContent_DetailedOutput\"><strong>Edicts</strong> Help others achieve their desires, aid and protect sex workers, help others through difficult transitions</p>\n<p><strong>Anathema</strong> Persecute sex workers, force or support unwanted marriages</p>\n<p><strong>Follower Alignments</strong> LG, NG, CG</span></p>\n<p></span></p>\n<h2 class=\"title\">Devotee Benefits</h2>\n<div>\n<div><strong>Divine Ability</strong> Wisdom or Charisma</div>\n<div><strong>Divine Font</strong> heal</div>\n<div><strong>Divine Skill</strong> Society</div>\n<div><strong>Favored Weapon</strong> longsword</div>\n<div><strong>Domains</strong> change, passion, protection, repose</div>\n<div><strong>Cleric Spells</strong> 1st: mage armor, 3rd: abyssal plague (threefold aspect (Advanced Player's Guide, coming soon)), 4th: resilient sphere</div>\n</div>",
    "flags": {},
    "name": "Lymnieris",
    "permission": {
        "default": 0
    }
}
