{
    "_id": "4Abc5gg8ac5ixGx1",
    "data": {
        "attributes": {
            "ac": {
                "value": 30
            },
            "hardness": 16,
            "hasHealth": true,
            "hp": {
                "details": "",
                "max": 80,
                "temp": 0,
                "tempmax": 0,
                "value": 80
            },
            "stealth": {
                "details": "(expert) to detect the magical sensor; noticing the wheel has a DC of 0",
                "value": 19
            }
        },
        "creatureType": "",
        "details": {
            "description": "An ornate wheel, divided into eight segments with a rune painted on each, is mounted on a pole and controlled by a lever that can be triggered manually or a sensor that detects creatures within 30 feet in front of it.",
            "disable": "DC 31 Thievery (master) on the wheel to flip the switch returning it to a harmless carnival game, DC 26 Thievery (expert) to erase each rune, or dispel magic (5th level; counteract DC 28) to counteract each rune.",
            "isComplex": true,
            "level": {
                "value": 10
            },
            "reset": "The trap deactivates and resets if 1 minute passes  without any creature moving within range of its sensor.",
            "routine": "[[2-actions]] On its initiative, the trap uses its  first action to spin, then stops. Roll 1d8 to determine which segment is topmost when the wheel  stops spinning. The wheel uses its second action to replicate the spell listed for that segment (5th level, DC 27, spell attack roll +17). This  spell's target is centered on or  otherwise  includes the nearest creature in the spell's area.  This increases the spell's range to 30 feet if necessary. Any spell cast by this trap is occult.\n1 black tentacles\n2 blindness\n3 confusion\n4 death ward\n5 outcast's curse\n6 shadow blast force damage in a 30‑foot line)\n7 sound burst\n8 spider climb"
        },
        "saves": {
            "fortitude": {
                "saveDetail": "",
                "value": 0
            },
            "reflex": {
                "saveDetail": "",
                "value": 0
            },
            "will": {
                "saveDetail": "",
                "value": 0
            }
        },
        "source": {
            "value": "Pathfinder #152: Legacy of the Lost God"
        },
        "statusEffects": [],
        "traits": {
            "ci": [],
            "di": {
                "custom": "",
                "selected": {},
                "value": [
                    "critical-hits",
                    "object-immunities",
                    "precision"
                ]
            },
            "dr": [],
            "dv": [],
            "rarity": {
                "value": "rare"
            },
            "size": {
                "value": "med"
            },
            "traits": {
                "custom": "",
                "value": [
                    "magical",
                    "mechanical"
                ]
            }
        }
    },
    "effects": [],
    "flags": {},
    "img": "systems/pf2e/icons/default-icons/hazard.svg",
    "items": [
        {
            "_id": "Stv3Oe7QU577Gke1",
            "data": {
                "actionCategory": {
                    "value": ""
                },
                "actionType": {
                    "value": "reaction"
                },
                "actions": {
                    "value": null
                },
                "description": {
                    "value": "<p data-visibility=\"gm\"><strong>Trigger</strong> A creature pulls the lever or enters the sensor's detection area;</p>\n<p><strong>Effect</strong> The wheel begins to spin and rolls initiative.</p>"
                },
                "requirements": {
                    "value": ""
                },
                "rules": [],
                "slug": null,
                "source": {
                    "value": ""
                },
                "traits": {
                    "custom": "",
                    "rarity": {
                        "value": "common"
                    },
                    "value": []
                },
                "trigger": {
                    "value": ""
                },
                "weapon": {
                    "value": ""
                }
            },
            "effects": [],
            "flags": {},
            "img": "systems/pf2e/icons/actions/Reaction.webp",
            "name": "Wheel Spin",
            "sort": 100000,
            "type": "action"
        }
    ],
    "name": "Hallowed Wheel",
    "token": {
        "disposition": 0,
        "height": 1,
        "img": "systems/pf2e/icons/default-icons/hazard.svg",
        "name": "Hallowed Wheel",
        "width": 1
    },
    "type": "hazard"
}
