{
    "_id": "HD7g8T8ioy1EH3M8",
    "content": "<h1 class=\"title\">Bolka (The Golden Gift) [NG]</h1>\n<p class=\"title\"><span id=\"ctl00_MainContent_DetailedOutput\"><span id=\"ctl00_MainContent_DetailedOutput\">Bolka is the dwarven goddess of marriage. She is the daughter of the dwarven god Torag and his wife Folgrit. Bolka is said to be a beautiful dwarven maiden. As the dwarves' goddess of marriage she helps reluctant suitors summon the courage to ask out their partner and helps foster love between the partners in an arranged marriage.</p>\n<p></span><span id=\"ctl00_MainContent_DetailedOutput\"><strong>Edicts</strong> Encourage those seeking love, seek the beauty in others, support others' relationships</p>\n<p><strong>Anathema</strong> Betray your spouse, disrupt a genuine marriage, prevent a suitor from seeking a partner</p>\n<p><strong>Follower Alignments</strong> LG, NG, CG</span></p>\n<p></span></p>\n<h2 class=\"title\">Devotee Benefits</h2>\n<div>\n<div><strong>Divine Ability</strong> Wisdom or Charisma</div>\n<div><strong>Divine Font</strong> heal</div>\n<div><strong>Divine Skill</strong> Diplomacy</div>\n<div><strong>Favored Weapon</strong> mace</div>\n<div><strong>Domains</strong> confidence, family, healing, passion</div>\n<div><strong>Cleric Spells</strong> 1st: soothe, 4th: creation, 6th: collective transposition</div>\n</div>\n<p></p>",
    "flags": {},
    "name": "Bolka",
    "permission": {
        "default": 0
    }
}
