{
    "_id": "3ffVxwgtvR1imHm8",
    "content": "<h1 class=\"title\">Gendowyn (Lady of the Fangwood) [CN]</h1>\n<p class=\"title\"><span id=\"ctl00_MainContent_DetailedOutput\"><span id=\"ctl00_MainContent_DetailedOutput\"><strong>Gendowyn</strong> is the queen of the fey Accressiel court in the Fangwood.</p>\n<p></span><span id=\"ctl00_MainContent_DetailedOutput\"><strong>Edicts</strong> Preserve primal areas, destroy blighted fey and agents of Cyth V'sug, protect those who placate you with offerings</p>\n<p><strong>Anathema</strong> Parley or make a deal with fiends, forgive those who deceive you, harm an innocent child</p>\n<p><strong>Follower Alignments</strong> CG, N, CN, CE</span></p>\n<p></span></p>\n<h2 class=\"title\">Devotee Benefits</h2>\n<div>\n<div><strong>Divine Ability</strong> Dexterity or Charisma</div>\n<div><strong>Divine Font</strong> heal</div>\n<div><strong>Divine Skill</strong> Stealth</div>\n<div><strong>Favored Weapon</strong> whip</div>\n<div><strong>Domains</strong> earth, family, luck, nature</div>\n<div><strong>Cleric Spells</strong> 1st: summon fey, 2nd: barkskin, 5th: tree stride</div>\n</div>",
    "flags": {},
    "name": "Gendowyn",
    "permission": {
        "default": 0
    }
}
