{
    "_id": "giupBd3dyOwdeoFl",
    "data": {
        "actionCategory": {
            "value": ""
        },
        "actionType": {
            "value": "passive"
        },
        "actions": {
            "value": null
        },
        "description": {
            "value": "<p>Your experience has made you better with a wide variety of weapons. Your proficiency ranks for simple weapons and martial weapons increase to expert, as does your proficiency rank for your chosen advanced weapon.</p>"
        },
        "featType": {
            "value": "archetype"
        },
        "level": {
            "value": 16
        },
        "location": "",
        "prerequisites": {
            "value": [
                {
                    "value": "Provocator Dedication"
                },
                {
                    "value": "expert in any kind of weapon or unarmed attack"
                }
            ]
        },
        "rules": [
            {
                "key": "ActiveEffectLike",
                "mode": "upgrade",
                "path": "data.martial.martial.rank",
                "value": 2
            },
            {
                "key": "ActiveEffectLike",
                "mode": "upgrade",
                "path": "data.martial.simple.rank",
                "value": 2
            }
        ],
        "source": {
            "value": "Pathfinder #159: All or Nothing"
        },
        "traits": {
            "custom": "",
            "rarity": {
                "value": "common"
            },
            "value": [
                "archetype"
            ]
        }
    },
    "effects": [],
    "flags": {},
    "img": "systems/pf2e/icons/features/feats/feats.webp",
    "name": "Performance Weapon Expert",
    "type": "feat"
}
