{
    "_id": "AMFkYKUNQ3kCD0ob",
    "content": "<h1 class=\"title\">Doloras (Our Lady of Pain) [LE]</h1>\n<p class=\"title\"><span id=\"ctl00_MainContent_DetailedOutput\"><span id=\"ctl00_MainContent_DetailedOutput\">Perhaps the cruelest of Hell's divinities, the Sadistic Angel shares certain characteristics with the velstracs who once resided in Hell-most notably, a drive to inflict physical pain upon living creatures. She does not inflict her torments out of anger or retribution; she practices her art with an unparalleled detachment and absence of emotion. Her followers are sadists, torturers who relish their grisly work, and those diabolists who summon velstracs rather than devils. While she bears the title of Queen of the Night and commands power commensurate with the others, Our Lady in Pain is content with her station and holds no ambitions beyond ensuring she can continue her tortures uninterrupted.</p>\n<p><strong>Edicts</strong> Push the boundaries of science and suffering, torture other creatures</p>\n<p><strong>Anathema</strong> Show or act on emotion, allow a plea for mercy to sway you</p>\n<p><strong>Follower Alignments</strong> LE, NE</span></p>\n<p></span></p>\n<h2 class=\"title\">Devotee Benefits</h2>\n<div>\n<div><strong>Divine Ability</strong> Constitution or Wisdom</div>\n<div><strong>Divine Font</strong> harm</div>\n<div><strong>Divine Skill</strong> Medicine</div>\n<div><strong>Favored Weapon</strong> kukri</div>\n<div><strong>Domains</strong> creation, pain, repose, sorrow</div>\n<div><strong>Cleric Spells</strong> 1st: phantom pain, 3rd: earthbind, 5th: synaptic pulse</div>\n</div>",
    "flags": {},
    "name": "Doloras",
    "permission": {
        "default": 0
    }
}
