{
    "_id": "XOAtP64xiSRIofsY",
    "data": {
        "actionCategory": {
            "value": ""
        },
        "actionType": {
            "value": "passive"
        },
        "actions": {
            "value": null
        },
        "description": {
            "value": "<p>Your grapples are incredibly reliable. When you roll a critical failure on a check to Grapple a target, you get a failure instead. In addition, when a creature you have grabbed rolls a failure on its check to Escape, it gets a critical failure instead, and if it rolls a critical success, it gets a success instead.</p>"
        },
        "featType": {
            "value": "bonus"
        },
        "level": {
            "value": 0
        },
        "location": "",
        "prerequisites": {
            "value": [
                {
                    "value": "Order of the Chain"
                }
            ]
        },
        "rules": [],
        "source": {
            "value": ""
        },
        "traits": {
            "custom": "",
            "rarity": {
                "value": "common"
            },
            "value": []
        }
    },
    "effects": [],
    "flags": {},
    "img": "systems/pf2e/icons/default-icons/feat.svg",
    "name": "Sturdy Bindings",
    "type": "feat"
}
