{
    "_id": "N16lctDPZpvk9Khq",
    "data": {
        "actionCategory": {
            "value": ""
        },
        "actionType": {
            "value": "passive"
        },
        "actions": {
            "value": null
        },
        "description": {
            "value": "<p>You gain the @Compendium[pf2e.classfeatures.Sneak Attack]{Sneak Attack} class feature, except you deal <a class=\"inline-roll roll\" data-mode=\"roll\" data-flavor=\"precision\" data-formula=\"1d6\" title=\"precision\"><i class=\"fas fa-dice-d20\"></i> 1d6</a> precision damage regardless of your level.</p>\n<p>Sneak attack from multiple sources isn't cumulative. If you have sneak attack from more than one source, use only the highest number of dice when you sneak attack rather than adding the amounts together.</p>"
        },
        "featType": {
            "value": "archetype"
        },
        "level": {
            "value": 10
        },
        "location": "",
        "prerequisites": {
            "value": [
                {
                    "value": "Shadowdancer Dedication"
                }
            ]
        },
        "rules": [
            {
                "category": "precision",
                "diceNumber": 1,
                "dieSize": "d6",
                "key": "DamageDice",
                "predicate": {
                    "all": [
                        "target:flatFooted"
                    ],
                    "any": [
                        "finesse",
                        "agile",
                        "ranged"
                    ]
                },
                "selector": "damage"
            }
        ],
        "source": {
            "value": "Pathfinder Advanced Player's Guide"
        },
        "traits": {
            "custom": "",
            "rarity": {
                "value": "common"
            },
            "value": [
                "archetype"
            ]
        }
    },
    "effects": [],
    "flags": {},
    "img": "systems/pf2e/icons/features/feats/feats.webp",
    "name": "Shadow Sneak Attack",
    "type": "feat"
}
