{
    "_id": "AydIHjDNbOZizj5U",
    "data": {
        "actionCategory": {
            "value": "offensive"
        },
        "actionType": {
            "value": "passive"
        },
        "actions": {
            "value": null
        },
        "description": {
            "value": "<p>@Template[type:emanation|distance:5|damaging:yes]{5 feet} @Compendium[pf2e.bestiary-ability-glossary-srd.Aura]{Aura}</p>\n<p>The air within 5 feet of the ghost is supernaturally cold. Characters that enter or begin their turn in the ghost's aura take [[/r {1d6}[cold]]]{1d6 cold damage} per 3 levels the ghost has (<span data-pf2-check=\"fortitude\" data-pf2-dc=\"\" data-pf2-traits=\"aura,cold,divine,damaging-effect\" data-pf2-label=\"Cold Spot DC\" data-pf2-show-dc=\"gm\">basic Fortitude</span> save).</p>"
        },
        "requirements": {
            "value": ""
        },
        "rules": [],
        "source": {
            "value": "Pathfinder #165: Eyes of Empty Death"
        },
        "traits": {
            "custom": "",
            "rarity": {
                "value": "common"
            },
            "value": []
        },
        "trigger": {
            "value": ""
        }
    },
    "effects": [],
    "flags": {},
    "img": "systems/pf2e/icons/actions/Passive.webp",
    "name": "(Ghost) Cold Spot",
    "type": "action"
}
