{
    "_id": "gScuJzOR6B0D5sHV",
    "data": {
        "baseItem": null,
        "brokenThreshold": {
            "value": 0
        },
        "bulkCapacity": {
            "value": ""
        },
        "collapsed": {
            "value": false
        },
        "containerId": {
            "value": ""
        },
        "description": {
            "value": "<p>Each of these full-face masks is made of stitched materials — often including humanoid skin — and has a single, bulbous eye. While wearing the mask, you gain a +1 item bonus to Deception checks to Lie and the mask doesn't impair your vision. The mask can also be activated, with an ability based on its type.</p>\n<hr />\n<p>This mask is made of gray and black tiles sewn together. It has a messy, inky spiral over the mouth.</p>\n<hr />\n<p><strong>Activate</strong> <span class=\"pf2-icon\">1</span> Interact (auditory, linguistic)</p>\n<p><strong>Frequency</strong> once per day</p>\n<p><strong>Effect</strong> You touch the mask's spiral and identify a target creature within 30 feet. For the next 10 minutes, any normal speech you utter can, at your discretion, be inaudible to all creatures except the target creature, who can hear you clearly regardless of ambient sound so long as it is within 1 mile. This ability doesn't silence magical words, such as the verbal component of spellcasting or commands to activate magic items.</p>"
        },
        "equipped": {
            "value": false
        },
        "equippedBulk": {
            "value": ""
        },
        "hardness": {
            "value": 0
        },
        "hp": {
            "value": 0
        },
        "identification": {
            "misidentified": {},
            "status": "identified",
            "unidentified": {
                "data": {
                    "description": {
                        "value": ""
                    }
                },
                "img": "",
                "name": ""
            }
        },
        "invested": {
            "value": false
        },
        "level": {
            "value": 0
        },
        "maxHp": {
            "value": 0
        },
        "negateBulk": {
            "value": "0"
        },
        "preciousMaterial": {
            "value": ""
        },
        "preciousMaterialGrade": {
            "value": ""
        },
        "price": {
            "value": "0 gp"
        },
        "quantity": {
            "value": 1
        },
        "rules": [
            {
                "key": "FlatModifier",
                "label": "Secret-Keeper's Mask",
                "predicate": {
                    "any": [
                        "action:lie"
                    ]
                },
                "selector": "deception",
                "type": "item",
                "value": 1
            }
        ],
        "size": {
            "value": "med"
        },
        "source": {
            "value": "Pathfinder GM's Toolkit: Secret Keeper's Mask"
        },
        "stackGroup": {
            "value": ""
        },
        "traits": {
            "custom": "",
            "rarity": {
                "value": "rare"
            },
            "value": [
                "divination",
                "enchantment",
                "invested",
                "magical"
            ]
        },
        "usage": {
            "value": "wornmask"
        },
        "weight": {
            "value": "-"
        }
    },
    "effects": [],
    "flags": {},
    "img": "systems/pf2e/icons/equipment/worn-items/other-worn-items/secret-keepers-mask.webp",
    "name": "Secret-Keeper's Mask (Reaper of Reputation)",
    "type": "equipment"
}
