{
    "_id": "l1eCHNahsBb7rUkT",
    "data": {
        "actionCategory": {
            "value": ""
        },
        "actionType": {
            "value": "passive"
        },
        "actions": {
            "value": null
        },
        "description": {
            "value": "<p>As a pirate, you sail the seas in search of enemy ships to plunder. You become trained in Sailing Lore, or become an expert in it if you were already trained.</p>\n<p>You ignore the effects of difficult terrain or uneven ground caused by a ship's movement. Additionally, you gain the @Compendium[pf2e.actionspf2e.Boarding Assault]{Boarding Assault} action.</p>\n<p><strong>Special</strong> You can't select another dedication feat until you have gained two other feats from the pirate archetype.</p>"
        },
        "featType": {
            "value": "archetype"
        },
        "level": {
            "value": 2
        },
        "prerequisites": {
            "value": [
                {
                    "value": "trained in Intimidation"
                }
            ]
        },
        "rules": [],
        "source": {
            "value": "Pathfinder Advanced Player's Guide"
        },
        "traits": {
            "custom": "",
            "rarity": {
                "value": "common"
            },
            "value": [
                "archetype",
                "dedication"
            ]
        }
    },
    "effects": [],
    "flags": {},
    "img": "systems/pf2e/icons/features/feats/feats.webp",
    "name": "Pirate Dedication",
    "type": "feat"
}
