{
    "_id": "jgSS31hwrQ1n4jVF",
    "data": {
        "attributes": {
            "ac": {
                "value": 39
            },
            "hardness": 25,
            "hasHealth": true,
            "hp": {
                "details": "to destroy a tub and prevent it from making any further attacks; <b>Door Seal Hardness</b> 18; <b>Door Seal HP</b> 72 (BT 36) to destroy the wax on a sealed door and allow anyone to escape through the door",
                "max": 104,
                "temp": 0,
                "tempmax": 0,
                "value": 104
            },
            "stealth": {
                "details": "(master)",
                "value": 27
            }
        },
        "creatureType": "",
        "details": {
            "description": "Four huge tubs containing congealed wax, enchanted to melt and envelop unwary intruders, each sit atop a cold fire.",
            "disable": "Thievery DC 43 (master) to drain the wax from a tub or Athletics DC 45 (master) to push through the wax blocking a sealed door and escape (other creatures must push their own way through, as the wax reseals)",
            "isComplex": true,
            "level": {
                "value": 16
            },
            "reset": "The trap deactivates and resets after 1 hour. At that time, the wax in the tubs cools and congeals, and any wax elsewhere in the room magically goes back into the tubs.",
            "routine": "(4 actions) The trap loses 1 action each turn per drained or destroyed tub. On each action, a different tub spews hot wax at a random creature in the room, dealing 3d12 fire damage to the target and all adjacent creatures (DC 35 basic Reflex save). On a failure or critical failure, the creature is also encased in hot wax. A creature that starts its turn encased in wax takes 8d12 fire damage and is immobilized until it Escapes the hardening wax (DC 35). Each turn it remains encased, the damage dealt by the hot wax decreases by 2d12 but the DC to Escape increases by 2 (minimum 0 damage, maximum DC 43). A creature that can't get free from the wax might suffocate."
        },
        "saves": {
            "fortitude": {
                "saveDetail": "",
                "value": 30
            },
            "reflex": {
                "saveDetail": "",
                "value": 25
            },
            "will": {
                "saveDetail": "",
                "value": 0
            }
        },
        "source": {
            "value": "Pathfinder #160: Assault on Hunting Lodge Seven"
        },
        "statusEffects": [],
        "traits": {
            "ci": [],
            "di": {
                "custom": "",
                "selected": {},
                "value": [
                    "critical-hits",
                    "fire",
                    "object-immunities",
                    "precision"
                ]
            },
            "dr": [],
            "dv": [],
            "rarity": {
                "value": "common"
            },
            "size": {
                "value": "med"
            },
            "traits": {
                "custom": "",
                "value": [
                    "magical"
                ]
            }
        }
    },
    "effects": [],
    "flags": {},
    "img": "systems/pf2e/icons/default-icons/hazard.svg",
    "items": [
        {
            "_id": "aSPT9O0IpzqjiqG0",
            "data": {
                "actionCategory": {
                    "value": "offensive"
                },
                "actionType": {
                    "value": "reaction"
                },
                "actions": {
                    "value": null
                },
                "description": {
                    "value": "<p data-visibility=\"gm\"><strong>Trigger</strong> A creature comes within 5 feet of a tub; <strong>Effect</strong> The fires beneath the vats blaze to life, magically melting the wax in the tubs. The tubs emit gouts of wax over the room's exits, sealing them shut. The trap then rolls initiative.</p>"
                },
                "requirements": {
                    "value": ""
                },
                "rules": [],
                "slug": null,
                "source": {
                    "value": ""
                },
                "traits": {
                    "custom": "",
                    "rarity": {
                        "value": "common"
                    },
                    "value": []
                },
                "trigger": {
                    "value": ""
                },
                "weapon": {
                    "value": ""
                }
            },
            "effects": [],
            "flags": {},
            "img": "systems/pf2e/icons/actions/Reaction.webp",
            "name": "Seal Room",
            "sort": 100000,
            "type": "action"
        }
    ],
    "name": "Waxworks Onslaught Trap",
    "token": {
        "disposition": 0,
        "height": 1,
        "img": "systems/pf2e/icons/default-icons/hazard.svg",
        "name": "Waxworks Onslaught Trap",
        "width": 1
    },
    "type": "hazard"
}
