{
    "_id": "cokeXkDHUAo4zHsw",
    "data": {
        "ability": {
            "value": ""
        },
        "area": {
            "areaType": "",
            "value": null
        },
        "areasize": {
            "value": ""
        },
        "category": {
            "value": "focus"
        },
        "components": {
            "material": false,
            "somatic": false,
            "verbal": true
        },
        "cost": {
            "value": ""
        },
        "damage": {
            "value": {}
        },
        "description": {
            "value": "<p><strong>Trigger</strong> You make a promise or deal.</p>\n<hr />\n<p>A magical indicator assures a creature that you've upheld your end of a bargain. When you Cast the Spell, you create a bracelet, flower, or other such trinket. If, while the spell persists, you complete the terms of the promise or deal you made, the trinket fades away with a pleasant chime; if you violate the terms instead, the trinket breaks with a dissonant crash.</p>\n<hr />\n<p><strong>Heightened (3rd)</strong> The duration becomes 1 day.</p>\n<p><strong>Heightened (5th)</strong> The duration becomes 1 week.</p>\n<p><strong>Heightened (7th)</strong> The duration becomes 1 month.</p>\n<p><strong>Heightened (9th)</strong> The duration becomes 1 year.</p>"
        },
        "duration": {
            "value": "1 hour"
        },
        "hasCounteractCheck": {
            "value": false
        },
        "level": {
            "value": 1
        },
        "location": {
            "value": ""
        },
        "materials": {
            "value": ""
        },
        "prepared": {
            "value": ""
        },
        "primarycheck": {
            "value": ""
        },
        "range": {
            "value": ""
        },
        "rules": [],
        "save": {
            "basic": "",
            "value": ""
        },
        "school": {
            "value": "conjuration"
        },
        "secondarycasters": {
            "value": ""
        },
        "secondarycheck": {
            "value": ""
        },
        "source": {
            "value": "Pathfinder Lost Omens: Gods & Magic"
        },
        "spellType": {
            "value": "utility"
        },
        "sustained": {
            "value": false
        },
        "target": {
            "value": ""
        },
        "time": {
            "value": "free"
        },
        "traditions": {
            "custom": "",
            "value": []
        },
        "traits": {
            "custom": "",
            "rarity": {
                "value": "uncommon"
            },
            "value": [
                "cleric"
            ]
        }
    },
    "effects": [],
    "flags": {},
    "img": "systems/pf2e/icons/spells/oathkeeper's-insignia.webp",
    "name": "Oathkeeper's Insignia",
    "type": "spell"
}
