{
    "_id": "wga13mR4vo73tbTY",
    "content": "<table class=\"pf2-table\">\n<thead>\n<tr>\n<th>\n<h3><strong>Name</strong></h3>\n</th>\n<th>\n<h3><strong>Crit Effect</strong></h3>\n</th>\n<th>\n<h3><strong>Type</strong></h3>\n</th>\n</tr>\n</thead>\n<tbody>\n<tr>\n<td>Off Balance</td>\n<td>You take a -2 circumstance penalty to attack rolls until the end of your next turn.</td>\n<td>\n<h3>Melee</h3>\n</td>\n</tr>\n<tr>\n<td>Friendly Fire</td>\n<td>You the ally nearest to the target.</td>\n<td>\n<h3>Ranged</h3>\n</td>\n</tr>\n<tr>\n<td>Something's Broken</td>\n<td>You take 1d4 bludgeoning damage, and you can't use this attack until healed.</td>\n<td>\n<h3>Unarmed</h3>\n</td>\n</tr>\n<tr>\n<td>Power Drain</td>\n<td>You one prepared spell or spell slot (determined randomly by the GM).</td>\n<td>\n<h3>Spell</h3>\n</td>\n</tr>\n</tbody>\n</table>\n<h3 style=\"text-align: left;\"> </h3>",
    "flags": {},
    "name": "Critical Fumble Deck #10",
    "permission": {
        "default": 0
    }
}
