{
    "_id": "XmpWko9I3NDN6rjJ",
    "content": "<table class=\"pf2-table\">\n<thead>\n<tr>\n<th>\n<h3><strong>Name</strong></h3>\n</th>\n<th>\n<h3><strong>Crit Effect</strong></h3>\n</th>\n<th>\n<h3><strong>Type</strong></h3>\n</th>\n</tr>\n</thead>\n<tbody>\n<tr>\n<td>\n<h3>Roundhouse</h3>\n</td>\n<td>\n<h3>Make one additional attack against a foe adjacent to the original target, using the same attack modifier as the original attack.</h3>\n</td>\n<td>\n<h3>Bludgeoning</h3>\n</td>\n</tr>\n<tr>\n<td>\n<h3>Ragged Wound</h3>\n</td>\n<td>\n<h3>The target takes 1d6 persistent bleed damage.</h3>\n</td>\n<td>\n<h3>Piercing</h3>\n</td>\n</tr>\n<tr>\n<td>\n<h3>Delayed Wound</h3>\n</td>\n<td>\n<h3>Normal damage. The target takes the same amount of damage at the end of its next two turns.</h3>\n</td>\n<td>\n<h3>Slashing</h3>\n</td>\n</tr>\n<tr>\n<td>\n<h3>Concussive Blast</h3>\n</td>\n<td>\n<h3>The target is pushed up to 10 feet and knocked prone.</h3>\n</td>\n<td>\n<h3>Bomb or Spell</h3>\n</td>\n</tr>\n</tbody>\n</table>\n<h3 style=\"text-align: left;\"> </h3>",
    "flags": {},
    "name": "Critical Hit Deck #53",
    "permission": {
        "default": 0
    }
}
