{
    "_id": "pDw2wi0znVb8Dysg",
    "data": {
        "baseItem": null,
        "brokenThreshold": {
            "value": 0
        },
        "bulkCapacity": {
            "value": ""
        },
        "collapsed": {
            "value": false
        },
        "containerId": {
            "value": ""
        },
        "description": {
            "value": "<p>When tied over your eyes, this ragged strip of black linen gives you a +3 item bonus to Intimidation checks and darkvision. You can see through the blindfold, but only using darkvision.</p>\n<p>The first time a particular creature sees you in a day, it must succeed at a <span data-pf2-check=\"will\" data-pf2-dc=\"37\" data-pf2-traits=\"emotion,enchantment,fear,magical,mental\" data-pf2-label=\"Dread Blindfold DC\" data-pf2-show-dc=\"gm\">Will</span> save or be frightened 1. This is an emotion, fear, and mental effect, and your allies become immune to it after about a week.</p>\n<hr />\n<p><strong>Activate</strong> <span class=\"pf2-icon\">F</span> command</p>\n<p><strong>Frequency</strong> once per minute</p>\n<p><strong>Trigger</strong> You damage a creature with a Strike</p>\n<p><strong>Effect</strong> Your target is gripped by intense fear. This has the effect of a DC 37 <em>@Compendium[pf2e.spells-srd.Phantasmal Killer]{Phantasmal Killer}</em> spell, but it is an enchantment instead of an illusion. The creature is then temporarily immune for 24 hours.</p>\n<hr />\n<p>Automatically applied effects:</p>\n<ul>\n<li>+3 item bonus to Intimidation checks</li>\n<li>Darkvision</li>\n</ul>"
        },
        "equipped": {
            "value": false
        },
        "equippedBulk": {
            "value": ""
        },
        "hardness": {
            "value": 0
        },
        "hp": {
            "value": 0
        },
        "identification": {
            "misidentified": {},
            "status": "identified",
            "unidentified": {
                "data": {
                    "description": {
                        "value": ""
                    }
                },
                "img": "",
                "name": ""
            }
        },
        "invested": {
            "value": false
        },
        "level": {
            "value": 17
        },
        "maxHp": {
            "value": 0
        },
        "negateBulk": {
            "value": "0"
        },
        "preciousMaterial": {
            "value": ""
        },
        "preciousMaterialGrade": {
            "value": ""
        },
        "price": {
            "value": "15,000 gp"
        },
        "quantity": {
            "value": 1
        },
        "rules": [
            {
                "key": "FlatModifier",
                "selector": "intimidation",
                "type": "item",
                "value": 3
            },
            {
                "key": "Sense",
                "label": "PF2E.SensesDarkvision",
                "selector": "darkvision"
            }
        ],
        "size": {
            "value": "med"
        },
        "source": {
            "value": "Pathfinder Core Rulebook"
        },
        "stackGroup": {
            "value": ""
        },
        "traits": {
            "custom": "",
            "rarity": {
                "value": "common"
            },
            "value": [
                "emotion",
                "enchantment",
                "fear",
                "invested",
                "magical",
                "mental"
            ]
        },
        "usage": {
            "value": "worneyepiece"
        },
        "weight": {
            "value": "-"
        }
    },
    "effects": [],
    "flags": {},
    "img": "systems/pf2e/icons/equipment/worn-items/other-worn-items/dread-blindfold.webp",
    "name": "Dread Blindfold",
    "type": "equipment"
}
