{
    "_id": "qQLHPbUFASKFky1W",
    "data": {
        "description": {
            "value": "<p>Granted by <em>@Compendium[pf2e.spells-srd.Hyperfocus]{Hyperfocus}</em>.</p>\n<p>The target gains a +1 status bonus to Perception checks attempted with any of its precise senses.</p>"
        },
        "duration": {
            "expiry": "turn-start",
            "sustained": false,
            "unit": "minutes",
            "value": 1
        },
        "level": {
            "value": 1
        },
        "rules": [
            {
                "key": "FlatModifier",
                "label": "Hyperfocus (Precise senses)",
                "predicate": {
                    "all": [
                        "sense:precise"
                    ]
                },
                "selector": "perception",
                "type": "status",
                "value": 1
            }
        ],
        "source": {
            "value": ""
        },
        "start": {
            "initiative": null,
            "value": 0
        },
        "target": null,
        "tokenIcon": {
            "show": true
        },
        "traits": {
            "custom": "",
            "rarity": {
                "value": "common"
            },
            "value": []
        }
    },
    "effects": [],
    "flags": {},
    "img": "systems/pf2e/icons/spells/hyperfocus.webp",
    "name": "Spell Effect: Hyperfocus",
    "type": "effect"
}
