{
    "_id": "AIcDyoff265z9285",
    "content": "<h1 class=\"title\">Kofusachi (The Laughing God) [CG]</h1>\n<p class=\"title\"><span id=\"ctl00_MainContent_DetailedOutput\"><span id=\"ctl00_MainContent_DetailedOutput\"><strong>Edicts</strong> Support local businesses, bring prosperity to your community, sample life's pleasures</p>\n<p><strong>Anathema</strong> Become tied to one location, judge another based on sexual desires or gender roles</p>\n<p><strong>Follower Alignments</strong> NG, CG</span></p>\n<p></span></p>\n<h2 class=\"title\">Devotee Benefits</h2>\n<div>\n<div><strong>Divine Ability</strong> Dexterity or Constitution</div>\n<div><strong>Divine Font</strong> heal</div>\n<div><strong>Divine Skill</strong> Performance</div>\n<div><strong>Favored Weapon</strong> staff</div>\n<div><strong>Domains</strong> luck, passion, travel, wealth</div>\n<div><strong>Cleric Spells</strong> 1st: soothe, 2nd: hideous laughter, 8th: uncontrollable dance</div>\n</div>",
    "flags": {},
    "name": "Kofusachi",
    "permission": {
        "default": 0
    }
}
