{
    "_id": "aChBtIDfA59QQ7SN",
    "content": "<h1 class=\"title\">Ayrzul (The Fossilized King) [NE]</h1>\n<p class=\"title\"><span id=\"ctl00_MainContent_DetailedOutput\"><span id=\"ctl00_MainContent_DetailedOutput\">Lord of buried secrets, earth, and metal, the Fossilized King Ayrzul is a mystery even on the Plane of Earth. No one has seen the elemental lord of earth outside of his realm, the Blistering Labyrinth, and few know the truth of Ayrzul's nature or the form he takes when he appears. Some say he is an immense, undead crystalline dragon, an ancient genie wizard, or even a discarded splinter from some long-forgotten deity, shed before their primeval destruction. His power, motives, and origins are likewise the subjects of innumerable rumors. This speculation is all inconsequential to the Fossilized King; even the politics of his plane falls outside his notice. Instead, the lord of Earth spends his time plotting against his bitter rival, @Compendium[pf2e.deities.Ymeri]{Ymeri}, the elemental lord of fire.</p>\n<p>Ayrzul's followers include xiomorns-@Compendium[pf2e.deities.Sairazul]{Sairazul}'s  children whom he has stolen-a handful of mephits and other elementals, and groups of humanoids on the Material Plane with an interest in the unseen hostility of the earth.</p>\n<p><strong>Edicts</strong> Use the strength of stone to protect yourself and your secrets, obscure your true motives, slowly poison others</p>\n<p><strong>Anathema</strong> Remove a creature's petrified condition, make a fire larger or hotter than necessary</p>\n<p><strong>Areas of Concern</strong> buried secrets, earth, and metal</p>\n<p><strong>Follower Alignments</strong> N, LE, NE, CE</span></p>\n<p></span></p>\n<h2 class=\"title\">Devotee Benefits</h2>\n<div>\n<div><strong>Divine Ability</strong> Wisdom or Charisma</div>\n<div><strong>Divine Font</strong> heal</div>\n<div><strong>Divine Skill</strong> Performance</div>\n<div><strong>Favored Weapon</strong> katar</div>\n<div><strong>Domains</strong> fire, healing, protection, sun</div>\n<div><strong>Cleric Spells</strong> 1st: soothe, 3rd: ghostly weapon, 4th: fire shield</div>\n</div>",
    "flags": {},
    "name": "Ayrzul",
    "permission": {
        "default": 0
    }
}
