{
    "_id": "ZG9ZJ5BZrZ9MS3h3",
    "data": {
        "attributes": {
            "ac": {
                "value": 24
            },
            "hardness": 0,
            "hasHealth": true,
            "hp": {
                "details": "",
                "max": 60,
                "temp": 0,
                "tempmax": 0,
                "value": 60
            },
            "stealth": {
                "details": "(expert)",
                "value": 24
            }
        },
        "creatureType": "",
        "details": {
            "description": "The restless spirits of clergy who once inhabited this now-defiled temple of Aroden remain within the sanctuary and pulpit.",
            "disable": "DC 26 Occultism (expert) to exorcise the spirits, or Deception or DC 28 Religion (trained) to imitate the Arodenite faith and render the haunt harmless until it resets",
            "isComplex": false,
            "level": {
                "value": 6
            },
            "reset": "The spirits return in [[/br 1d8 #hours]]{1d8 hours} as long as any xulgaths remain in Moonstone Hall.",
            "routine": ""
        },
        "saves": {
            "fortitude": {
                "saveDetail": "",
                "value": 13
            },
            "reflex": {
                "saveDetail": "",
                "value": 0
            },
            "will": {
                "saveDetail": "",
                "value": 15
            }
        },
        "source": {
            "value": "Pathfinder #152: Legacy of the Lost God"
        },
        "statusEffects": [],
        "traits": {
            "ci": [],
            "di": {
                "custom": "",
                "selected": {},
                "value": [
                    "critical-hits",
                    "object-immunities",
                    "precision"
                ]
            },
            "dr": [],
            "dv": [
                {
                    "exceptions": "",
                    "label": "Positive",
                    "type": "positive",
                    "value": "10"
                }
            ],
            "rarity": {
                "value": "common"
            },
            "size": {
                "value": "med"
            },
            "traits": {
                "custom": "",
                "value": [
                    "haunt"
                ]
            }
        }
    },
    "effects": [],
    "flags": {},
    "img": "systems/pf2e/icons/default-icons/hazard.svg",
    "items": [
        {
            "_id": "lp862sClvRojxe2C",
            "data": {
                "actionCategory": {
                    "value": ""
                },
                "actionType": {
                    "value": "reaction"
                },
                "actions": {
                    "value": null
                },
                "description": {
                    "value": "<p data-visibility=\"gm\"><strong>Trigger</strong> A non-Arodenite creature approaches within 5 feet of the lectern;</p>\n<p><strong>Effect</strong> A spectral minister appears before the pulpit, resembling an ever-shifting amalgamation of several past priests. The spectral minister delivers fervent exhortations about faithlessness. Each creature on the dais must succeed at a <span data-pf2-check=\"will\" data-pf2-dc=\"24\" data-pf2-traits=\"divine,necromancy\" data-pf2-label=\"Phantom Sermon DC\" data-pf2-show-dc=\"gm\">Will</span> save or become @Compendium[pf2e.conditionitems.Drained]{Drained 2}. On a critical failure, the creature is drained 4.</p>"
                },
                "requirements": {
                    "value": ""
                },
                "rules": [],
                "slug": null,
                "source": {
                    "value": ""
                },
                "traits": {
                    "custom": "",
                    "rarity": {
                        "value": "common"
                    },
                    "value": [
                        "divine",
                        "necromancy"
                    ]
                },
                "trigger": {
                    "value": ""
                },
                "weapon": {
                    "value": ""
                }
            },
            "effects": [],
            "flags": {},
            "img": "systems/pf2e/icons/actions/Reaction.webp",
            "name": "Phantom Sermon",
            "sort": 100000,
            "type": "action"
        }
    ],
    "name": "Echoes of Faith",
    "token": {
        "disposition": 0,
        "height": 1,
        "img": "systems/pf2e/icons/default-icons/hazard.svg",
        "name": "Echoes of Faith",
        "width": 1
    },
    "type": "hazard"
}
