{
    "_id": "ArmPZQrl0SFAKvrY",
    "content": "<h1 class=\"title\">Ma'at (The Feather of Truth) [LN]</h1>\n<p class=\"title\"><span id=\"ctl00_MainContent_DetailedOutput\"><span id=\"ctl00_MainContent_DetailedOutput\"><strong>Edicts</strong> Defend civilization from chaos, live an honest and just life, be impartial in judgment and reveal the truth</p>\n<p><strong>Anathema</strong> Deal unfairly with your family or community, destroy the environment, lie</p>\n<p><strong>Follower Alignments</strong> LG, LN, N</span></p>\n<p></span></p>\n<h2 class=\"title\">Devotee Benefits</h2>\n<div>\n<div><strong>Divine Ability</strong> Intelligence or Wisdom</div>\n<div><strong>Divine Font</strong> heal</div>\n<div><strong>Divine Skill</strong> Society</div>\n<div><strong>Favored Weapon</strong> starknife</div>\n<div><strong>Domains</strong> knowledge, protection, star, truth</div>\n<div><strong>Cleric Spells</strong> 1st: feather fall, 4th: resilient sphere, 5th: mind probe</div>\n</div>",
    "flags": {},
    "name": "Ma'at",
    "permission": {
        "default": 0
    }
}
