{
    "_id": "BEqXsP6UqARzpEFD",
    "data": {
        "actionCategory": {
            "value": "offensive"
        },
        "actionType": {
            "value": "action"
        },
        "actions": {
            "value": 2
        },
        "description": {
            "value": "<p>You activate gears, explosives, and other @Compendium[pf2e.conditionitems.Hidden]{Hidden} mechanisms in your innovation to make a powerful attack. You make a Strike, dealing an extra die of weapon damage. If you're at least 10th level, increase this to two extra dice, and if you're at least 18th level, increase it to three extra dice. The type of Strike you can make depends on your innovation.</p>\n<ul>\n<li><strong>Armor</strong> You Strike with a melee unarmed attack or a melee weapon. To use a melee weapon for this, you must have prepared it in advance with special contraptions when you make your daily preparations.</li>\n<li><strong>Construct</strong> Your minion innovation Strikes.</li>\n<li><strong>Weapon</strong> You Strike with your weapon innovation.</li>\n</ul>\n<p><strong>Unstable Function</strong> You put even more force into the Strike, though you risk stress fractures to your innovation. Add the unstable trait to Megaton Strike. The Strike deals another extra damage die, for a total of two extra dice at 4th level, three at 10th level, and four at 18th level.</p>\n<p><strong>Special</strong> If your innovation is a minion, it can take this action rather than you.</p>"
        },
        "featType": {
            "value": "class"
        },
        "level": {
            "value": 4
        },
        "location": "",
        "prerequisites": {
            "value": [
                {
                    "value": "armor, construct, or weapon innovation"
                }
            ]
        },
        "rules": [],
        "source": {
            "value": ""
        },
        "traits": {
            "custom": "",
            "rarity": {
                "value": "common"
            },
            "value": [
                "inventor"
            ]
        }
    },
    "effects": [],
    "flags": {},
    "img": "systems/pf2e/icons/default-icons/feats.webp",
    "name": "Megaton Strike",
    "type": "feat"
}
