{
    "_id": "FbzbZc4LGUTcz9tA",
    "data": {
        "actionCategory": {
            "value": "offensive"
        },
        "actionType": {
            "value": "action"
        },
        "actions": {
            "value": 1
        },
        "description": {
            "value": "<p><strong>Requirements</strong> You're wielding a loaded one-handed firearm.</p>\n<hr />\n<p>Your flair keeps foes' attention, as your motions with your gun draw your foes into a deadly game. As you toy with them and performatively brandish your weapon, you build their tunnel vision, leaving them trapped in a perceptual gauntlet of your own making. Attempt a Performance check against the Will DC of a single target within your one-handed firearm's first range increment.</p>\n<hr />\n<p><strong>Critical Success</strong> The target takes a -2 status penalty to attack rolls against creatures other than you until the beginning of your next turn.</p>\n<p><strong>Success</strong> The target takes a -1 status penalty to attack rolls against creatures other than you until the beginning of your next turn.</p>"
        },
        "featType": {
            "value": "archetype"
        },
        "level": {
            "value": 4
        },
        "location": "",
        "prerequisites": {
            "value": [
                {
                    "value": "Pistol Phenom Dedication"
                }
            ]
        },
        "rules": [],
        "source": {
            "value": ""
        },
        "traits": {
            "custom": "",
            "rarity": {
                "value": "common"
            },
            "value": [
                "archetype"
            ]
        }
    },
    "effects": [],
    "flags": {},
    "img": "systems/pf2e/icons/default-icons/feats.webp",
    "name": "Gunpowder Gauntlet",
    "type": "feat"
}
