{
    "_id": "Osr01ZmGZNdArXyT",
    "data": {
        "description": {
            "value": "<p>You stand just steps from the grave.</p>\n<p>Non-magical effects that would restore your Hit Points only grant you half as many HP as normal.</p>\n<p>You become @Compendium[pf2e.conditionitems.Drained]{Drained 1}, and this drained condition is cumulative with any other drained conditions you gain. This drained condition is removed only when you Refocus; effects that normally remove the drained condition reduce your drained condition to drained 1 instead.</p>\n<p>You become @Compendium[pf2e.conditionitems.Wounded]{Wounded 1}. This wounded condition is removed only when you Refocus; effects that normally remove the wounded condition reduce your wounded condition to wounded 1 instead.</p>\n<p>In addition, you gain resistance to poison equal to half your level.</p>\n<p>You gain a +4 status bonus to saves against diseases, poisons, and death effects, and if you roll a success on such a save, you get a critical success instead. If you roll a critical failure on a save against a disease, poison, or death effect, you get a failure instead.</p>\n<p>When you would attempt a recovery check, you can choose to get an automatic success instead of rolling.</p>\n<hr />\n<p><em>Note: The bonus to saving throws is applied automatically. You need to apply the remaining effects manually.</em></p>"
        },
        "duration": {
            "expiry": "turn-start",
            "sustained": false,
            "unit": "unlimited",
            "value": -1
        },
        "level": {
            "value": 1
        },
        "rules": [
            {
                "key": "Note",
                "predicate": {
                    "any": [
                        "disease",
                        "poison",
                        "death"
                    ]
                },
                "selector": "saving-throw",
                "text": "<p class='compact-text'><strong>Major Curse of Bones</strong> When you roll a success at a saving throw against a disease, poison or death effect, you get a critical success instead.</p>"
            },
            {
                "key": "Note",
                "predicate": {
                    "any": [
                        "disease",
                        "poison",
                        "death"
                    ]
                },
                "selector": "saving-throw",
                "text": "<p class='compact-text'><strong>Major Curse of Bones</strong> When you roll a critical failure at a saving throw against a disease, poison or death effect, you get a failure instead.</p>"
            },
            {
                "key": "FlatModifier",
                "label": "Major Bones Curse (vs Disease, Poison, or Death)",
                "predicate": {
                    "any": [
                        "disease",
                        "poison",
                        "death"
                    ]
                },
                "selector": "saving-throw",
                "type": "status",
                "value": 4
            }
        ],
        "source": {
            "value": ""
        },
        "start": {
            "initiative": null,
            "value": 0
        },
        "target": null,
        "tokenIcon": {
            "show": true
        },
        "traits": {
            "custom": "",
            "rarity": {
                "value": "common"
            },
            "value": []
        }
    },
    "effects": [],
    "flags": {},
    "img": "systems/pf2e/icons/features/classes/bones-mystery.webp",
    "name": "Effect: Major Bones Curse",
    "type": "effect"
}
