role,department,employee_name
ComputerProgrammer, SoftwareManagement,Calvin Edan Love
Salesman, Sales,Christine Reagan Deleon
SoftwareEngineer, SoftwareManagement,Jade Felicia Caldwell
ProductionLineWorker, Assembly,Aquila Stewart Dejesus
ProductionLineWorker, Assembly,Micah Abdul Rojas
Salesman, Sales,Gail Rhiannon Mcconnell
ProductionLineWorker, Assembly,April Alika Levy
Mathematician, Research,Rama Vielka Clayton
AdministrativeAssistant,NULL,Tasha Casey Dalton
ProductionLineWorker, Assembly,Aurora Sarah Manning
Technician, FieldService,Devin Abdul Rogers
ITAdmin, Security,Jacqueline Latifah Miles
Technician, FieldService,Ferris Omar Barry
ProductionLineWorker, Assembly,Grant Camden Gay
ITAdmin, Security,Howard Wing Yang
ProductionLineWorker, Assembly,Aspen Amber Vinson
Technician, Engineering,Colorado John Valentine
ProductionLineWorker, Assembly,Tyrone Damian Garner
Mathematician, Research,Stephanie Victoria Lyons
Salesman, Sales,Quynn Odessa Sanford
Salesman, Sales,Melyssa Deirdre Morgan
Salesman, Sales,Gray Mason Fulton
Salesman, Sales,Bianca Elizabeth Roach
SoftwareEngineer, SoftwareManagement,Aurelia Martina Reese
ManagementTrainer, Training,Yardley Cairo Elliott
Salesman, Sales,Blaine Jelani Weeks
ElectricalEngineer, Engineering,Delilah Pearl Schneider
Technician, FieldService,TaShya Yoko Bailey
InstructionalCoordinator, Training,Melissa Ava Stuart
ElectricalEngineer, Engineering,Kermit Beau Leach
ProductionLineWorker, Assembly,Geoffrey Harlan Lara
Technician, FieldService,Flynn Malcolm Gibson
Technician, FieldService,Heather Cynthia Leonard
AssemblySupervisor, Assembly,Shannon Chantale Price
Technician, FieldService,Castor Mark Wolf
Statistician, MarketAnalysis,Ryan Kelly Frost
Technician, FieldService,Damian Omar Le
ElectricalEngineer, Engineering,Robert Samuel Chen
ProductionLineWorker, Assembly,Cailin Casey Mckee
AdministrativeAssistant, FieldService,Nina Camille Hodges
ProductionLineWorker, Assembly,Aladdin Hu Day
ElectricalEngineer, Engineering,Nicolas Brandon Hendrix
Technician, FieldService,Olivia Rose Galloway
ProductionLineWorker, Assembly,Forrest Rashad Richards
ComputerProgrammer, SoftwareManagement,Miriam Shoshana Donovan
Technician, FieldService,Olivia Quynn Hardy
TestEngineer, Engineering,Bethany Stephanie Haynes
ITAdmin, Security,Kennedy Shad Parker
SoftwareEngineer, SoftwareManagement,Nigel Gareth Ochoa
SoftwareEngineer, SoftwareManagement,Vincent Craig Cunningham
ITAdmin, Security,Wesley Dustin Dickerson
ProductionLineWorker, Assembly,Kai Penelope Peck
Salesman, Sales,Raymond Tate Osborne
ProductionLineWorker, Assembly,Ariel Bertha Murphy
Manager, SoftwareManagement,Vance Ira Alston
Salesman, Sales,Benjamin Ignatius Hooper
Manager, Security,Clinton Coby Wolfe
Scientist, Research,Illana Yvette Bradshaw
Mathematician, Research,Orla Ruth Mckenzie
ProductionLineWorker, Assembly,Mikayla Jaden Barron
Technician, FieldService,Arthur Lucian Bonner
Physicist, Research,Leah Idola Moran
Accountant, Accounting,Lacota Helen Nash
ComputerProgrammer, SoftwareManagement,William Theodore Reeves
Attorney, Contracts,MacKenzie Kristen Stewart
AssemblySupervisor, Assembly,Armando Albert Walter
ProductionLineWorker, Assembly,Willow Jaime Daniel
ProductionLineWorker, Assembly,Irene Lacota Huffman
IndustrialEngineer, IndustrialEngineering,Tallulah Liberty Kirby
Statistician, QualityControl,William Aladdin Bennett
ElectricalEngineer, Engineering,Rashad Aristotle Guerrero
Salesman, Sales,Leilani Quail Callahan
VicePresident,NULL,Kai Wynne Craft
PurchasingClerk, Pricing,Cora Jane Kinney
ProductionLineWorker, Assembly,Flynn Edward Brennan
Technician, FieldService,Indira Jocelyn Mack
ComputerProgrammer, SoftwareManagement,Nicolas Kadeem Hayden
Physicist, Research,Jade Maris Coleman
Manager, SoftwareManagement,Stephanie Briar Harrington
ProductionLineWorker, Assembly,Julie Jaime Burns
SoftwareEngineer, SoftwareManagement,Amaya Iola Sawyer
Technician, FieldService,Hilda Alice Hahn
ProductionLineWorker, Assembly,Lila Dana Mcintyre
Salesman, Sales,Armand Jasper Nicholson
ITAdmin, Security,Bevis Brady Sheppard
ITAdmin, Security,Emerald Imani Schmidt
ProductionLineWorker, Assembly,Melodie Lee Glenn
Technician, FieldService,Hadley Rhona Dillon
TestEngineer, Engineering,Ethan Perry Wiggins
Scientist, Research,Jena Audrey Malone
ProductionLineWorker, Assembly,Noble Clinton Klein
ComputerScientist, SoftwareManagement,Luke Jacob Talley
ComputerScientist, Engineering,Chandler Ashton Madden
SystemsEngineer, Engineering,Suki Ori Grant
SoftwareEngineer, SoftwareManagement,Kameko Signe Harrison
Technician, FieldService,Bruno Donovan Ingram
ComputerScientist, SoftwareManagement,Paula Madaline Jackson
ComputerScientist, SoftwareManagement,Hedda Grace Gordon
HumanResourceSpecialist, Personnel,Mari Gretchen Shaw
ComputerProgrammer, SoftwareManagement,Dominic Howard Mcconnell
Physicist, Research,Evelyn Nevada Curtis
SecurityGuard, Security,Colin Evan Brown
ProductionLineWorker, Assembly,Yvette Jeanette Vang
Technician, FieldService,Brittany Mona Terry
Salesman, Sales,Caleb Jonas Chang
ITAdmin, Security,Sean Omar Burgess
ProductionLineWorker, Assembly,Glenna Caryn Sharpe
ProductionLineWorker, Assembly,Beck John Peters
VicePresident,NULL,Kirby Bo Pollard
SecurityGuard, Security,Fitzgerald Len Merrill
ComputerScientist, SoftwareManagement,Rhonda Rhona Parsons
ProductionLineWorker, Assembly,Maxwell Clark Faulkner
ElectricalEngineer, ManufacturingEngineering,Shelly Audra Ayala
Salesman, Sales,Teagan Hedy Romero
Scientist, Research,Kimberley Roary Maldonado
ProductionLineWorker, Assembly,Kenneth Steel Porter
Salesman, Sales,Lionel Omar Fisher
ProductionLineWorker, Assembly,Montana Basia Roberts
Salesman, Sales,Felicia Sloane Cabrera
Mathematician, Research,Medge Liberty Petersen
Physicist, Research,Charity Uta Daniels
AdministrativeAssistant, Research,Aurora Katell Rhodes
Salesman, Sales,Guy Zeus Chandler
Technician, FieldService,Hadassah Leah Harris
MechanicalEngineer, Engineering,Norman Jackson Beck
Technician, FieldService,Gregory Curran Sutton
Salesman, Sales,Nicole Macey Craig
Scientist, Research,Keegan Marvin Benson
Technician, FieldService,Cecilia Freya Morgan
MechanicalEngineer, Engineering,Holmes Arden Day
Mathematician, Research,Alexa Nadine Poole
SecurityGuard, Security,Leslie Briar Fields
Director, MarketAnalysis,Dacey Jorden Bowen
Attorney, Contracts,Baxter William Price
Technician, FieldService,Flavia Fiona Cannon
ComputerProgrammer, SoftwareManagement,Amal Judah Rich
Salesman, Sales,Blair Deborah Vaughn
Salesman, Sales,Cassady Quincy Hampton
ProductionLineWorker, Assembly,Jena Chanda Rollins
ProductionLineWorker, Assembly,Addison Edward Snyder
Technician, FieldService,Sydnee Leilani Parsons
Technician, FieldService,Cheyenne Lesley Dominguez
Salesman, Sales,Leo Chaney Daugherty
Manager, SoftwareManagement,Caleb Mason Ball
Technician, FieldService,Zenia Kiona Stevenson
MechanicalEngineer, Engineering,James Cain Vargas
Physicist, Research,Ali Murphy Hurley
Statistician, MarketAnalysis,Francis Kane Buckner
Scientist, Research,Amena Karyn Christian
ProductionLineWorker, Assembly,Ivory Leandra Rogers
ITAdmin, Security,Arthur John Floyd
TestEngineer, Engineering,Octavius Kelly Castaneda
Salesman, Sales,Oren Clinton Sharpe
Salesman, Sales,Urielle Jane Carter
ComputerScientist, SoftwareManagement,Marshall Benjamin Wilcox
Salesman, Sales,Martina Cassandra Fields
SystemsEngineer, Engineering,Sylvester Guy Sanders
SoftwareEngineer, SoftwareManagement,Brian Nathaniel Greer
Technician, FieldService,Olympia Shafira Harrison
AdministrativeAssistant, Engineering,Catherine Savannah Bullock
ProductionLineWorker, Assembly,Ella Rachel Hess
Technician, FieldService,Eagan Gannon Koch
Salesman, Sales,Maggy Melissa Burt
Technician, FieldService,Abel Adam Morton
Technician, FieldService,Eliana Stephanie Albert
Physicist, Research,Chandler Raymond Kirk
ComputerProgrammer, SoftwareManagement,Bruno Beau Hoover
ProductionLineWorker, Assembly,Jessica Rachel Freeman
Technician, FieldService,Sloane Jade Cochran
VicePresident,NULL,Halla Cathleen Simmons
Technician, FieldService,Edan Marsden Briggs
AdministrativeAssistant, Engineering,Jane Ignacia Mcdonald
Salesman, Sales,Kay Janna Snider
Scientist, Research,Eaton Burton Crane
Technician, FieldService,Willa Giselle Stanton
FinancialAnalyst, FinancialPlanning,Nissim Gil French
Salesman, Sales,Katell Amethyst Thornton
ComputerScientist, SoftwareManagement,Cora Clementine Higgins
Salesman, Sales,Doris Mona Michael
ProductionLineWorker, Assembly,Sylvia Ariana Head
Salesman, Sales,Connor Phelan Guerra
Salesman, Sales,Orson Barrett Houston
AdministrativeAssistant, Assembly,Sage Nichole Savage
TestEngineer, Engineering,Philip Keith Barron
Salesman, Sales,Nicole Aurelia Hanson
HumanResourceSpecialist, EmployeeRelations,Felicia Rhona Butler
Technician, FieldService,Amir Hayden Gray
ComputerScientist, SoftwareManagement,Chadwick Wayne Bond
Manager, SoftwareManagement,Aurora Tatiana Payne
HardwareEngineer, Engineering,Dalton Perry Mejia
Director, Training,Walter Kaseem Foley
Salesman, Sales,Jarrod Malik Burris
ProductionLineWorker, Assembly,Amity Kendall Foley
Scientist, Research,Jermaine Mannix Hansen
Mathematician, Research,Camille Julie Freeman
ComputerProgrammer, SoftwareManagement,Ignatius Reese Morton
Salesman, Sales,Fulton Quinn Avery
Technician, FieldService,Cecilia Yuri Ashley
AdministrativeAssistant,NULL,Gay Ria Cantu
Mathematician, Research,Benjamin Lewis Sweeney
Salesman, Sales,Harlan Jason Benjamin
Manager, QualityControl,Kimberley Kiona Sosa
ProductionLineWorker, Assembly,Raymond Arsenio Blackwell
Scientist, Research,Demetrius Barry Bullock
Mathematician, Research,Teagan Raven Kennedy
TestEngineer, Engineering,Blossom Scarlett Aguirre
IndustrialEngineer, IndustrialEngineering,Rachel Hermione Le
Scientist, Research,Caldwell Ian Maxwell
ProductionLineWorker, Assembly,Cassidy Florence Gibbs
Manager, Payroll,Vera Mollie Jenkins
PurchasingClerk, Purchasing,Sawyer Abel Turner
SystemsEngineer, Engineering,Harper Basil Obrien
Physicist, Research,Declan Zachery Caldwell
MechanicalEngineer, Engineering,Theodore Eagan Bass
ProductionLineWorker, Assembly,Maryam Nelle Ruiz
ComputerProgrammer, SoftwareManagement,Daryl Ocean Patel
Technician, FieldService,Uriel Axel Diaz
Mathematician, Research,Ayanna Leandra Dunlap
Manager, Sales,Lysandra Chastity Brennan
TestEngineer, Engineering,Hyacinth Clare Lindsay
Technician, Engineering,Tamara Shaeleigh Best
Salesman, Sales,Elton Zeus Horton
Salesman, Sales,Josiah Chester Gray
ProductionLineWorker, Assembly,Malcolm Sebastian Garrison
Technician, FieldService,Lionel Jasper Johnston
MaterialsEngineer, Engineering,Hall Colorado Morin
Salesman, Sales,Malachi Thor Butler
Technician, FieldService,Clayton Clark Humphrey
ComputerScientist, SoftwareManagement,Cole Aaron Mcfarland
SoftwareEngineer, SoftwareManagement,Lyle Brady Hayes
Scientist, Research,Cedric Alexander Bowers
ProductionLineWorker, Assembly,William Graham Rowe
Technician, FieldService,Mohammad Taylor Terrell
Technician, FieldService,Gisela Quintessa Fischer
PurchasingClerk, Purchasing,Callum Scott Parrish
ProductionLineWorker, Assembly,Octavia May Maddox
Technician, FieldService,Irma Melanie Patrick
ProductionLineWorker, Assembly,Owen Ross Burks
Technician, FieldService,Jenette McKenzie Lynn
ComputerScientist, Engineering,Noble Devin Mack
Technician, FieldService,Ferdinand Rashad Lee
Technician, FieldService,Lynn Adena Pratt
Salesman, Sales,Harper Clark Vazquez
AdministrativeAssistant, Payroll,Kimberley Joy Anderson
ProductionLineWorker, Assembly,Erasmus Cameron Franco
Technician, FieldService,Buffy Vivien Nichols
ProductionLineWorker, Assembly,Bruno Stewart Silva
Engineer, Contracts,Jonathan John Martinez
Salesman, Sales,Adam Ishmael Mcdaniel
ElectricalEngineer, Engineering,Rashad August Hatfield
Technician, FieldService,Xenos Hayden Gallegos
MechanicalEngineer, ManufacturingEngineering,Tobias Dakota Jacobs
Scientist, Research,John Price Atkins
ComputerScientist, Engineering,Elaine Hanna Raymond
ProductionLineWorker, Assembly,Sharon Jemima Whitehead
Technician, FieldService,Colton Nathan Barber
ProductionLineWorker, Assembly,Ethan Arden Hays
HumanResourceSpecialist, Personnel,Curran Tarik Ayala
Scientist, Research,Sandra Roary Solomon
Technician, FieldService,Hadley Willa Hill
SystemsEngineer, Engineering,Halee Kim Burnett
Salesman, Sales,Chanda Celeste Mosley
Technician, FieldService,Shelley Eleanor Dawson
ITAdmin, Security,Logan Branden Cherry
Engineer, QualityControl,Chloe Keiko Holland
TestEngineer, Engineering,Melvin Brody Garza
ProductionLineWorker, Assembly,Mohammad Vladimir Farrell
HardwareEngineer, Engineering,Alea Tana Ferrell
MaterialsEngineer, Engineering,Kendall Thaddeus Glover
ITAdmin, Security,Alfonso Colin Cooley
AdministrativeAssistant, Sales,Arsenio Kato Wilder
Salesman, Sales,Kirk Palmer Rosales
SoftwareEngineer, SoftwareManagement,Amaya Britanni Newton
Salesman, Sales,Colton Kaseem Bolton
ProductionLineWorker, Assembly,Alfreda Morgan Holloway
Technician, Engineering,Quinn Coby Hays
Manager, SoftwareManagement,Sara Gail George
LabManager, Research,Sarah Imelda Juarez
VicePresident,NULL,Byron Tyrone Williamson
ProductionLineWorker, Assembly,Risa Laura Bolton
Salesman, Sales,William Damian Oconnor
SoftwareEngineer, SoftwareManagement,Kaden Chastity Briggs
Salesman, Sales,Vincent Calvin Young
Technician, FieldService,Brock Aladdin Joyce
SoftwareEngineer, SoftwareManagement,Madonna Kristen Love
ElectricalEngineer, Engineering,Elijah Gary Diaz
Scientist, Research,Dale Benjamin Sharpe
Salesman, Sales,Jael Jennifer Hansen
SecurityGuard, Security,Ulric Ferdinand Knapp
MechanicalEngineer, Engineering,Brent Laith Beck
Scientist, Research,Cheyenne Kay Dickerson
ProductionLineWorker, Assembly,Myra Kay Greer
ComputerProgrammer, SoftwareManagement,Edward Dean Anthony
Technician, FieldService,Illana Isabelle Lamb
ITAdmin, Security,TaShya Savannah Mcgowan
AdministrativeAssistant,NULL,Price Bevis Pittman
Salesman, Sales,Louis Hyatt Bruce
Technician, FieldService,Guy Tad Daniel
ProductionLineWorker, Assembly,Calvin Jarrod Hood
ElectricalEngineer, Engineering,Desirae Mari Koch
ComputerProgrammer, SoftwareManagement,Willow Iliana Quinn
ProductionLineWorker, Assembly,Peter Tad Hartman
Scientist, Research,Nicholas Cade Owen
Salesman, Sales,Maxwell Hammett Green
Scientist, Research,Robert Ali Webb
TechnicalTrainer, Training,Hillary Ainsley Mccormick
Technician, FieldService,Serina Ariana Butler
Physicist, Research,Ira Benjamin Mays
AdministrativeAssistant, Pricing,Yasir Dexter Nelson
Mathematician, Research,Grace Alma Fry
Director, Medical,Alec Mannix Mcneil
SecurityGuard, Security,Aquila Mark Vega
Technician, FieldService,Merritt Oliver Phelps
Salesman, Sales,Callum Brendan Gonzalez
ChiefEngineer, Engineering,Cameron Noel Elliott
Salesman, Sales,Gil Quincy Potter
Mathematician, Research,Philip Travis Hartman
HumanResourceSpecialist, Personnel,Garrison Levi Rollins
ITAdmin, Security,Gareth Thomas Dickson
ITAdmin, Security,Blossom Keiko Weiss
ComputerScientist, SoftwareManagement,Constance Audrey Hicks
ManagementTrainer, Training,Althea Ina Palmer
ITAdmin, Security,Kennedy Robert Vega
MaterialsEngineer, Engineering,Ivor Amir Tucker
Salesman, Sales,Jocelyn Brenna Daniels
Salesman, Sales,Roary Ursa Massey
Salesman, Sales,Declan Gareth Mclaughlin
Mathematician, Research,Savannah Marcia Yang
IndustrialEngineer, IndustrialEngineering,Harrison Oscar Burke
Salesman, Sales,Donovan Garth Nieves
ProductionLineWorker, Assembly,Kirk Jakeem Joyce
Salesman, Sales,Justin Xerxes Hansen
Technician, FieldService,Peter Gil Harrington
Salesman, Sales,Josiah Preston Wall
Technician, FieldService,Nichole Melodie Gilbert
ProductionLineWorker, Assembly,Heidi Mia Wilson
Salesman, Sales,Malik Adrian Hebert
Attorney, Contracts,Quentin Nolan Fitzpatrick
Salesman, Sales,Keane Kennan Watts
MaterialsEngineer, Engineering,Thaddeus Emery Martin
AdministrativeAssistant, Contracts,Reuben Victor Freeman
SoftwareEngineer, SoftwareManagement,Tobias Martin Ashley
ComputerProgrammer, SoftwareManagement,Vernon Finn Mcgee
Salesman, Sales,Salvador Byron Norton
Salesman, Sales,Zenaida Justine England
InstructionalCoordinator, Training,Hasad Paki Mcfadden
ProductionLineWorker, Assembly,Cody Jonathan Potter
AdministrativeAssistant, MarketAnalysis,Dante Raja Roberts
ComputerScientist, SoftwareManagement,Evelyn Sarah Reilly
Salesman, Sales,Colt Walter Reynolds
Director, Research,Summer Leilani Boyer
Salesman, Sales,Ira Dustin Oneill
Technician, FieldService,Alfonso Gage Blankenship
ElectricalEngineer, Engineering,Roary Jane Barrett
Mathematician, Research,Oren Curran Brady
TestEngineer, Engineering,Elton Tyler Richard
ProductionLineWorker, Assembly,Ivana Kaitlin Parsons
ProductionLineWorker, Assembly,Leo Hasad Byrd
ProductionLineWorker, Assembly,Chester Caldwell Mendoza
ChiefEngineer, Engineering,Gage Kaden Odonnell
FieldServiceEngineer, FieldService,Garrett Nicholas Solomon
Technician, FieldService,Sybill Sage Shaw
ElectricalEngineer, Engineering,Lane Oleg Mclaughlin
TestEngineer, Engineering,Simone Scarlet Rose
SoftwareEngineer, SoftwareManagement,Adena Lisandra Hardin
Technician, FieldService,Anastasia Kylan Kaufman
Manager, Pricing,Eugenia Whilemina Harrington
Director, SoftwareManagement,Todd Vance Spears
Technician, FieldService,Troy Uriah Conway
Technician, FieldService,Sonia Karly Goodwin
Salesman, Sales,Isabella Marah Graham
Salesman, Sales,Blair Bruno Grimes
Salesman, Sales,Chanda Tamekah William
Salesman, Sales,Sonya Beatrice Nichols
ProductionLineWorker, Assembly,Emerald Lysandra Hodges
Salesman, Sales,Brynn Madeline Sherman
Technician, FieldService,Thomas Shad Guthrie
Salesman, Sales,Rebecca Kelsie Daugherty
SystemsEngineer, Engineering,Jakeem Magee Knight
Salesman, Sales,Macon Kyle Pope
LabManager, Research,Honorato Ivan Wall
ProductionLineWorker, Assembly,Cherokee Tashya Ramirez
FieldServiceEngineer, FieldService,Blaine Helen Cervantes
ProductionLineWorker, Assembly,Dominic Calvin Hewitt
ComputerScientist, SoftwareManagement,Wade Ira Frazier
Technician, FieldService,Hanae Wendy Meyer
ProductionLineWorker, Assembly,Mufutau Nehru Contreras
Technician, FieldService,Abel Reese Boone
Engineer, QualityControl,Azalia Halee Cantu
ProductionLineWorker, Assembly,Zenia Freya Macias
Manager, Assembly,Delilah Iliana Wilkinson
Statistician, Pricing,Upton Sebastian Holt
Salesman, Sales,Mallory Alexis Daniel
LabManager, Research,Kim Dara Sullivan
ProductionLineWorker, Assembly,Laith Jason Britt
Scientist, Research,Farrah Kim Keith
Physicist, Research,Tara Alma Potts
ProductionLineWorker, Assembly,Fletcher Perry Cantu
Salesman, Sales,Galena Britanney Merritt
Technician, FieldService,Casey Xerxes Conrad
MechanicalEngineer, Engineering,Hakeem Mason Mccall
Manager, ManufacturingEngineering,Fritz Dale Ellison
Director, Security,Fatima Ulla Mcclure
Mathematician, Research,Nelle April Bowen
Mathematician, Research,Geoffrey Jin Tucker
ElectricalEngineer, ManufacturingEngineering,Kathleen Aline Chan
Salesman, Sales,Raymond Gray Hyde
Salesman, Sales,Charde Cynthia Rasmussen
MechanicalEngineer, ManufacturingEngineering,Tiger Tucker Dawson
MechanicalEngineer, Engineering,Oleg Kane Britt
HardwareEngineer, Engineering,Xander Aaron Acevedo
Mathematician, Research,Reuben Fulton Pugh
Scientist, Research,Josiah Thaddeus Stewart
ProductionLineWorker, Assembly,Cameran Madonna Shepard
ElectricalEngineer, ManufacturingEngineering,Jaden Kylan Buckley
LabManager, Research,Lillith Adena Matthews
Salesman, Sales,Grady Craig Coffey
ProductionLineWorker, Assembly,Colin Lawrence Holder
Physicist, Research,Keely Mollie Weiss
ProductionLineWorker, Assembly,Piper Sasha Fuentes
Technician, FieldService,Nathaniel Hunter Heath
SystemsEngineer, Engineering,Nehru Cyrus Everett
ComputerScientist, SoftwareManagement,Camilla Camille Leach
ProductionLineWorker, Assembly,Anne Jane Carey
ProductionLineWorker, Assembly,George Cade Chen
Technician, FieldService,Noah Andrew Beck
HealthSafetyEngineer, Safety,Alice Orli Stout
Salesman, Sales,Jana Amanda Dorsey
ComputerScientist, SoftwareManagement,Alea Maggie Whitfield
Scientist, Research,Fay Ingrid Rodriquez
SecurityGuard, Security,Rowan Neve Parks
ChiefEngineer, Engineering,Rose Hanae Yates
ProductionLineWorker, Assembly,Chiquita Linda Stokes
Technician, FieldService,Julian Samson Allen
AdministrativeAssistant,NULL,Rina Denise Mcgee
ProductionLineWorker, Assembly,Joel Kennan Mccarty
ProductionLineWorker, Assembly,Irene Jemima Meyers
SoftwareEngineer, SoftwareManagement,September Vielka Livingston
ProductionLineWorker, Assembly,Lacota Dahlia Good
SystemsEngineer, Engineering,Raymond Otto Bond
NursePractitioner, Medical,Lamar Nissim Strickland
Scientist, Research,Charissa Nyssa Mcgee
MechanicalEngineer, Engineering,Halla Germaine Nolan
Technician, FieldService,Kay Maxine Skinner
Physicist, Research,Beverly Melissa Garner
SecurityGuard, Security,Hollee Vanna Becker
Technician, FieldService,Phelan Nissim Howell
LabManager, Research,Jackson Linus Wilkerson
SoftwareEngineer, SoftwareManagement,Justine Nola Adkins
HealthSafetyEngineer, Safety,Orla Yolanda Middleton
ProductionLineWorker, Assembly,Naida Imelda Hughes
Salesman, Sales,Rogan Chandler Coffey
ProductionLineWorker, Assembly,Grady Jordan Duran
ProductionLineWorker, Assembly,Marcia Lillian Lynn
ProductionLineWorker, Assembly,Daria Samantha Mcbride
Physicist, Research,Bernard Tobias Landry
ProductionLineWorker, Assembly,Selma Barbara Nicholson
Technician, FieldService,Camilla Claire Whitehead
SoftwareEngineer, SoftwareManagement,Ira Wyatt Moss
AdministrativeAssistant, Training,John Omar Lancaster
ElectricalEngineer, Engineering,Ella Nita Lewis
ProductionLineWorker, Assembly,Talon Ian Ware
ElectricalEngineer, Engineering,Zachery Samson Kerr
Technician, FieldService,Chaim Grant Fernandez
ElectricalEngineer, Engineering,Erich Harding Bryant
SystemsEngineer, Engineering,Rhona Germane Nelson
Salesman, Sales,Frances Hermione Owens
ProductionLineWorker, Assembly,Jescie Kristen Jenkins
Salesman, Sales,Shana Callie Ferguson
FieldServiceEngineer, FieldService,Blythe Veda Cooke
ProductionLineWorker, Assembly,Noel Reagan Foster
Manager, Sales,Hashim Damon Dudley
Accountant, Payroll,Irma Eugenia Booker
ProductionLineWorker, Assembly,Idola Carly Haley
ProductionLineWorker, Assembly,Zena Sigourney Langley
ProductionLineWorker, Assembly,Ann Jolie Potts
ProductionLineWorker, Assembly,Galena Deborah Francis
ElectricalEngineer, ManufacturingEngineering,Thor Jameson Diaz
ComputerScientist, Engineering,Ocean Maite Summers
Technician, FieldService,Bevis Christopher Mcknight
ProductionLineWorker, Assembly,Brett Damian Beck
ComputerScientist, Engineering,Nash Conan Knight
ProductionLineWorker, Assembly,Lunea Priscilla Hardy
Technician, FieldService,Meredith Florence Valdez
AdministrativeAssistant, Accounting,Myles August Heath
ProductionLineWorker, Assembly,Ella Cassandra Rivera
Technician, FieldService,Preston Odysseus Bryan
Salesman, Sales,Iris Rhea Terrell
Salesman, Sales,Halla Kendall Irwin
ElectricalEngineer, Engineering,Deanna Imelda Blanchard
ComputerScientist, SoftwareManagement,Imani Aubrey Ray
Salesman, Sales,Cora Maisie Mclean
ComputerProgrammer, SoftwareManagement,Leslie Cassandra Colon
Technician, FieldService,Armand Gabriel Brewer
TestEngineer, Engineering,Portia Illana David
SoftwareEngineer, SoftwareManagement,Hadley Leandra May
AdministrativeAssistant, SoftwareManagement,Keaton Ronan Leonard
ITAdmin, Security,Meghan Phoebe Macias
Salesman, Sales,Jonah Dakota Bird
Technician, Engineering,Amal Alexander Shelton
HardwareEngineer, Engineering,Zorita Jaime Spears
Technician, FieldService,Cleo Jeanette Morales
ProductionLineWorker, Assembly,Morgan Deborah Hoover
ITAdmin, Security,Jackson Rafael Sutton
Salesman, Sales,Wynne Xyla Hartman
Mathematician, Research,Montana Hannah Arnold
Technician, FieldService,Jane Zia Day
SoftwareEngineer, SoftwareManagement,Hedwig Dai Duffy
SoftwareEngineer, SoftwareManagement,Bruce Sawyer Barrera
AssemblySupervisor, Assembly,Amy Lucy Chen
Physicist, Research,Jonas Connor Riddle
SoftwareEngineer, SoftwareManagement,Rogan Reuben Alexander
ProductionLineWorker, Assembly,Seth Harlan Walls
AdministrativeAssistant, Personnel,Gil Calvin Lindsay
ComputerScientist, SoftwareManagement,Garrett Omar Kelly
Mathematician, Research,Buckminster Connor Bush
ProductionLineWorker, Assembly,Ivor Herrod Kaufman
Salesman, Sales,Sawyer Arden Puckett
Technician, FieldService,Alma Leila Duncan
AdministrativeAssistant,NULL,Kenyon Raja Galloway
ProductionLineWorker, Assembly,Teegan Jillian Burris
ProductionLineWorker, Assembly,Ivan Levi Craig
Technician, FieldService,Renee Ivana Hayden
HardwareEngineer, Engineering,Hermione Casey Witt
Physicist, Research,Demetrius Alvin Levy
MaterialsEngineer, Engineering,Roth Mannix Simon
Technician, FieldService,Kibo Dolan Turner
ComputerScientist, SoftwareManagement,Kay Alexa Logan
Technician, FieldService,Abdul Ralph Deleon
ProductionLineWorker, Assembly,Blair Todd Long
AssemblySupervisor, Assembly,Whilemina Pandora England
Salesman, Sales,Candice Lunea Fischer
HumanResourceSpecialist, Personnel,Honorato Joseph Adkins
ProductionLineWorker, Assembly,Mariko Ivana Mckee
TestEngineer, Engineering,Casey Edward Joyce
Salesman, Sales,Jeanette Cally Whitfield
ITAdmin, Security,Daria Felicia Rowland
ITAdmin, Security,Byron Armand Livingston
SecurityGuard, Security,Ashely Sarah Shields
SoftwareEngineer, SoftwareManagement,Isaiah Upton Buchanan
AdministrativeAssistant,NULL,Alec Scott Goff
Salesman, Sales,Tyler Eden Talley
MechanicalEngineer, Engineering,Alexander Rafael Arnold
Salesman, Sales,Axel Malik Rosa
Mathematician, Research,William Trevor Fuentes
ProductionLineWorker, Assembly,Akeem Jerry Lopez
HumanResourceSpecialist, Personnel,Skyler Deborah Frazier
Accountant, Accounting,Raven Deirdre Morrison
ProductionLineWorker, Assembly,Hiroko Kiona Faulkner
MechanicalEngineer, Engineering,Dustin Gage Franco
Salesman, Sales,Cora Aurora Buckner
ElectricalEngineer, Engineering,Devin Brett Guzman
Salesman, Sales,Zeph Dakota Wilkerson
Technician, FieldService,Ulric Colt Holt
Technician, FieldService,Caesar Allen Cash
ProductionLineWorker, Assembly,Ezra Hilel Dyer
Salesman, Sales,Oscar Laith Berger
ComputerScientist, SoftwareManagement,Brock William Hunter
ITAdmin, Security,Dorothy Marny Goff
Technician, FieldService,Magee Ashton Evans
ChiefEngineer, Engineering,Ainsley MacKensie Doyle
ProductionLineWorker, Assembly,Xanthus Louis Buck
ComputerProgrammer, SoftwareManagement,Deirdre Amaya Garcia
SoftwareEngineer, SoftwareManagement,Whilemina Liberty Velez
ProductionLineWorker, Assembly,Eugenia Hannah Blanchard
Salesman, Sales,Fuller Baker Warner
Technician, FieldService,Stuart Nicolas Cervantes
ITAdmin, Security,Ira Brendan Ball
ProductionLineWorker, Assembly,Ramona Alma Moses
AdministrativeAssistant, Engineering,Alden Jesse Day
ITAdmin, Security,Megan Simone Hess
ComputerProgrammer, SoftwareManagement,Quyn Jolie Rosario
Technician, FieldService,Hilel Tobias Flynn
TestEngineer, Engineering,Igor Ulric Yang
SystemsEngineer, Engineering,Rosalyn Daphne Tillman
Technician, FieldService,Xenos Rudyard Small
Salesman, Sales,Risa Lana Guthrie
Salesman, Sales,Meredith Lunea Delaney
ITAdmin, Security,Mariko Olga Snyder
AdministrativeAssistant, FieldService,Emerson Tyrone Rojas
ProductionLineWorker, Assembly,Ruth Yael Burris
Manager, Purchasing,August Armando Evans
SecurityGuard, Security,Nicolas Alvin Fitzpatrick
MaterialsEngineer, Engineering,Deborah Victoria Mcclure
Technician, FieldService,Jolene Frances Carey
HumanResourceSpecialist, Personnel,Azalia Orli Beach
SoftwareEngineer, SoftwareManagement,Anika Isabella Pennington
MechanicalEngineer, ManufacturingEngineering,Jin Jonathan Buckley
SecurityGuard, Security,Mallory Carol Spence
ElectricalEngineer, Engineering,Alec Boris Chase
SecurityGuard, Security,Tasha Quail Sanchez
SystemsEngineer, Engineering,Roanna Sacha Monroe
SoftwareEngineer, SoftwareManagement,Jeanette Eliana Rivera
AdministrativeAssistant, Research,Chastity Ima Gibson
MechanicalEngineer, Engineering,Igor Ishmael Ward
SoftwareEngineer, SoftwareManagement,Hector Vance Foster
TestEngineer, Engineering,Hayes William Wheeler
Salesman, Sales,Plato Ethan Valdez
TestEngineer, Engineering,Pearl Georgia Owen
Technician, FieldService,Mallory Virginia Bender
ProductionLineWorker, Assembly,Timon Jacob Gay
AdministrativeAssistant, FinancialPlanning,Sasha Rina Huffman
TestEngineer, Engineering,Ian Jonas Morrow
ComputerScientist, Engineering,Colt Ishmael Mccall
ProductionLineWorker, Assembly,Cameron Shay Lester
ProductionLineWorker, Assembly,Anthony Aidan Nixon
ITAdmin, Security,Jonathan Gary Terry
Technician, FieldService,Adam Kendall Harrell
ComputerProgrammer, SoftwareManagement,Harrison Samuel Gonzales
ElectricalEngineer, Engineering,Mercedes Ina Landry
SoftwareEngineer, SoftwareManagement,Jared Geoffrey Morin
IndustrialEngineer, IndustrialEngineering,Kermit Coby Oliver
ProductionLineWorker, Assembly,Scott Gary Burks
Salesman, Sales,Nichole Azalia Frye
VicePresident,NULL,Hyatt Trevor Hayes
Statistician, FinancialPlanning,Eve Isadora Mckenzie
AssemblySupervisor, Assembly,Alan Benjamin Holder
Technician, FieldService,Eagan Zephania Talley
ProductionLineWorker, Assembly,Beatrice Alexis Kidd
ITAdmin, Security,Jack Carlos Cannon
AdministrativeAssistant, Engineering,Erich Malik Wolf
ProductionLineWorker, Assembly,Kasper Lance Huffman
MaterialsEngineer, Engineering,Shea Jane Franks
Technician, FieldService,Charity Stacey Jennings
Mathematician, Research,Rae Melissa Wilson
ProductionLineWorker, Assembly,Jorden Helen Pierce
ProductionLineWorker, Assembly,Hollee Shannon Dudley
Technician, FieldService,Yasir Wade Wilcox
AdministrativeAssistant, SoftwareManagement,Prescott Giacomo Conley
ITAdmin, Security,Medge Serina Obrien
ProductionLineWorker, Assembly,Wang Dean Vasquez
Salesman, Sales,Quail Rana Mclean
Technician, FieldService,Alfreda Sierra Savage
Technician, FieldService,Leonard Uriel Ramos
MechanicalEngineer, Engineering,Eve Shaeleigh Holman
Manager, Contracts,Whoopi Britanney Camacho
ProductionLineWorker, Assembly,Penelope Lysandra Hayes
Mathematician, Research,Vivian Sarah Arnold
Technician, FieldService,Kermit Jonas Gould
Salesman, Sales,Deborah Barbara White
Scientist, Research,Kyla Blythe Carter
ITAdmin, Security,Cathleen Samantha Craig
Salesman, Sales,Burke Rooney Stafford
HumanResourceSpecialist, EmployeeRelations,Keane Nicholas Blevins
Technician, FieldService,Paula Isabelle Santiago
ProductionLineWorker, Assembly,Aretha Dorothy Deleon
Salesman, Sales,Martin Armand Douglas
ComputerProgrammer, SoftwareManagement,Nicholas Kato Pennington
Technician, FieldService,Valentine Lucian Benjamin
Technician, FieldService,Dai Keely Bullock
Salesman, Sales,Kylie Elizabeth Santos
ProductionLineWorker, Assembly,Isadora Buffy Brewer
ComputerScientist, SoftwareManagement,Bethany Lydia Lyons
Salesman, Sales,Allegra Bree Coffey
MechanicalEngineer, Engineering,Hector Abraham Hayes
SystemsEngineer, Engineering,Nyssa Britanney Carver
ProductionLineWorker, Assembly,Cade Rajah Patterson
MechanicalEngineer, ManufacturingEngineering,Josephine Indira Garza
ProductionLineWorker, Assembly,Ivor Jelani Robbins
Mathematician, Research,Xander Walter Doyle
ComputerScientist, SoftwareManagement,Leslie Denise Dillon
ProductionLineWorker, Assembly,Elaine Sonya Hughes
Salesman, Sales,Risa Hillary Obrien
Salesman, Sales,Dennis Gray Wilson
ProductionLineWorker, Assembly,Hillary Piper Riddle
ProductionLineWorker, Assembly,Teagan Briar Townsend
ITAdmin, Security,Sonia Anne Kirkland
ComputerProgrammer, SoftwareManagement,Blaze Jakeem Hahn
VicePresident,NULL,Thomas Vladimir Stokes
Manager, Security,Frances Alisa Wiggins
ComputerProgrammer, SoftwareManagement,Wanda Samantha Rogers
ProductionLineWorker, Assembly,Lilah Renee Wagner
MechanicalEngineer, Engineering,Zachary Myles Cardenas
ComputerScientist, SoftwareManagement,Samantha Audrey Curtis
TestEngineer, Engineering,Cathleen Kelsey Burke
Director, EmployeeRelations,Blaze Trevor Stone
MaterialsEngineer, Engineering,Ingrid Irene Atkins
Director, Safety,Wesley Kasper Duffy
ComputerScientist, SoftwareManagement,Jaden Nicole Johnston
Technician, FieldService,Tarik Linus Hubbard
Technician, FieldService,Iona Brenda Payne
ElectricalEngineer, Engineering,William Aristotle Sampson
ITAdmin, Security,Quemby Nita Pollard
Technician, FieldService,Katelyn Lani Murray
ProductionLineWorker, Assembly,Ariel Ina Barrett
Salesman, Sales,Raphael Benjamin Bryan
Salesman, Sales,Robert Zeus Cox
HumanResourceSpecialist, Personnel,Myles Donovan Macias
Scientist, Research,Xandra Briar Nielsen
ProductionLineWorker, Assembly,Shaeleigh MacKenzie Harris
MechanicalEngineer, ManufacturingEngineering,Mallory Charissa Dixon
MechanicalEngineer, Engineering,Matthew Harper Glass
TestEngineer, Engineering,Robert Aristotle Stevenson
ElectricalEngineer, ManufacturingEngineering,Emily Illana Perry
Technician, FieldService,Elvis Marshall Walton
LabManager, Research,Sasha Britanney Quinn
ProductionLineWorker, Assembly,Phelan Dieter Hendricks
ProductionLineWorker, Assembly,George Zachery Burch
ProductionLineWorker, Assembly,Naomi Meredith Baxter
ComputerScientist, Engineering,Octavia Nora Leblanc
Salesman, Sales,Meghan Brianna Jensen
ComputerProgrammer, SoftwareManagement,Daphne Ruby Reilly
Salesman, Sales,Aurora Jael Hopkins
Technician, FieldService,Lester Quamar Pearson
SystemsEngineer, Engineering,Dante Vaughan Weber
Scientist, Research,Sierra Margaret Barker
Scientist, Research,Kylie Brielle Greer
Salesman, Sales,Brianna Aretha Hopper
Technician, FieldService,Shelby Lila Turner
ITAdmin, Security,Joseph Alan Vaughan
Salesman, Sales,Claire Olivia Martin
ComputerProgrammer, SoftwareManagement,Chaim Chadwick Chang
Technician, FieldService,Quintessa Shana Vance
Physicist, Research,Britanni Marah Cash
Technician, FieldService,Akeem William Mayer
ProductionLineWorker, Assembly,Felicia Xantha Farley
Salesman, Sales,Sylvia Velma Sweet
SoftwareEngineer, SoftwareManagement,Dexter Jamal Simon
Scientist, Research,Nigel Harrison Estrada
Mathematician, Research,Meredith Pamela Tanner
SoftwareEngineer, SoftwareManagement,Akeem Quamar Davenport
Scientist, Research,Yardley Ezra Vang
ProductionLineWorker, Assembly,Zane Cadman Fields
ProductionLineWorker, Assembly,Kevyn Quin Charles
Technician, FieldService,Lavinia Justine Richmond
ProductionLineWorker, Assembly,Caldwell Quamar Head
ElectricalEngineer, Engineering,Patricia Denise Wright
ProductionLineWorker, Assembly,Fitzgerald Wayne Miranda
ITAdmin, Security,Hayes Drake Stephenson
ProductionLineWorker, Assembly,Jeremy Rooney Henderson
AdministrativeAssistant, Sales,Stephanie Eliana Rasmussen
AssemblySupervisor, Assembly,Sandra Beverly Diaz
ProductionLineWorker, Assembly,Jerry Kennan Fischer
MaterialsEngineer, Engineering,Carl Ferdinand Wong
ProductionLineWorker, Assembly,Basia Nevada Riggs
ProductionLineWorker, Assembly,Alice Sierra Valenzuela
Physicist, Research,Kasimir Nehru Galloway
Salesman, Sales,Nola Nerea Ayala
SystemsEngineer, Engineering,Kane Quinlan Stevenson
Technician, FieldService,Merrill Hiram Hess
ProductionLineWorker, Assembly,Eric Gray Duncan
Scientist, Research,Vladimir Thomas Todd
ComputerScientist, SoftwareManagement,Anastasia Sage Griffith
ITAdmin, Security,William Price Robles
IndustrialEngineer, IndustrialEngineering,Hu Akeem Vincent
Technician, FieldService,Hayley Carolyn Cunningham
Technician, FieldService,Ursa Britanney Frederick
Scientist, Research,Todd Scott Roth
HumanResourceSpecialist, EmployeeRelations,Nathan Kenneth Hicks
Technician, FieldService,Sigourney Xandra Maddox
Salesman, Sales,Kenyon Chancellor Sharpe
ITAdmin, Security,Cyrus Connor Atkinson
ProductionLineWorker, Assembly,Priscilla Martha Vinson
ElectricalEngineer, Engineering,Preston Kennan Burns
Salesman, Sales,Martin Ivan Cooper
Salesman, Sales,Samson Denton Oconnor
ElectricalEngineer, Engineering,Vincent Avram Aguirre
ProductionLineWorker, Assembly,Emmanuel Lawrence Briggs
Director, FieldService,Sharon Britanni Kerr
Scientist, Research,Axel Seth Lewis
Mathematician, Research,Tobias Lucas Morin
ComputerProgrammer, SoftwareManagement,Steel Orson Fields
AdministrativeAssistant, EmployeeRelations,Sybill Grace Mckay
HumanResourceSpecialist, Personnel,Mark Yardley Dunlap
Manager, Security,Francis Brian Armstrong
SecurityGuard, Security,August Ronan Lucas
Technician, FieldService,Yoshio Joseph Farmer
Scientist, Research,Rogan Judah Mcintyre
AdministrativeStaff, Payroll,Vernon Samuel Sawyer
Technician, FieldService,Jonah Merritt Wilder
SoftwareEngineer, SoftwareManagement,Ivor Kenneth Rollins
Salesman, Sales,Eden Merrill Stokes
SystemsEngineer, Engineering,Finn Tucker Medina
ProductionLineWorker, Assembly,Raphael Aristotle Ray
ITAdmin, Security,Medge Nichole Sims
Manager, Sales,Winter Veda Burks
MechanicalEngineer, Engineering,Steel Solomon Garrison
ProductionLineWorker, Assembly,Madison Lydia Morrison
ChiefEngineer, Engineering,Harper Price Harris
Physicist, Research,Veda Martina Jacobson
ProductionLineWorker, Assembly,Nevada Leilani Ortega
AdministrativeAssistant, Engineering,Patricia Emily Salazar
ProductionLineWorker, Assembly,Otto Hedley Chase
Technician, FieldService,Noble Merrill Fuller
Salesman, Sales,Leo Elmo Monroe
Salesman, Sales,Bruce Eden Clemons
Salesman, Sales,Oliver Logan Fowler
SystemsEngineer, Engineering,Kirestin Vanna Sykes
Salesman, Sales,Arthur Jacob Raymond
Scientist, Research,Diana Lillian Solis
ProductionLineWorker, Assembly,Bruno Carter Robles
AdministrativeAssistant, Engineering,Lani Dai Beard
SoftwareEngineer, SoftwareManagement,Gwendolyn Amaya Ferrell
Scientist, Research,Noah Nathan Shaffer
ProductionLineWorker, Assembly,Joy Rosalyn Leblanc
Salesman, Sales,Natalie Sheila Santiago
ProductionLineWorker, Assembly,Slade Orson Burch
Salesman, Sales,Dane Davis Atkins
Technician, FieldService,Dakota Edward Brady
SoftwareEngineer, SoftwareManagement,Owen Len Wheeler
SoftwareEngineer, SoftwareManagement,MacKensie Mara Grant
ComputerScientist, SoftwareManagement,Reece Nicolas Lopez
Technician, FieldService,Lacey Nomlanga Rasmussen
ProductionLineWorker, Assembly,Albert Mohammad Joseph
FieldServiceEngineer, FieldService,Hedwig Regina Livingston
Mathematician, Research,Dean Lester Figueroa
ITAdmin, Security,Madonna Veronica Hardy
ProductionLineWorker, Assembly,Tad Patrick Hardin
ITAdmin, Security,Kendall Ciaran Frank
MechanicalEngineer, Engineering,Bryar Ivana Sweet
President,NULL,Mona Susan Shannon
Technician, FieldService,Edward Finn Stokes
SecurityGuard, Security,Noelani Wynter Kennedy
ProductionLineWorker, Assembly,Philip Nathan Logan
Salesman, Sales,Colin Stuart Holloway
ProductionLineWorker, Assembly,Beau Hall Watts
Scientist, Research,Sonya Samantha Hahn
AdministrativeAssistant, ManufacturingEngineering,Astra Nicole Maldonado
Technician, FieldService,Carla Amelia Shannon
Technician, FieldService,Denise Ifeoma Doyle
ElectricalEngineer, Engineering,Kirby Amity Tyson
HumanResourceSpecialist, Personnel,Tara Echo Myers
Technician, FieldService,Salvador Herman Raymond
AdministrativeAssistant, Security,Jenna Darrel Charles
ProductionLineWorker, Assembly,Colt Kendall Perez
SystemsEngineer, Engineering,Herman Ian Abbott
ProductionLineWorker, Assembly,Hakeem Stephen Peck
Scientist, Research,Howard Raphael Weiss
AdministrativeAssistant,NULL,Kaye Brianna Blair
ITAdmin, Security,Cain Byron Baldwin
NursePractitioner, Medical,Diana Leigh Hays
Technician, FieldService,Nora Regina Oconnor
HardwareEngineer, Engineering,Nehru Wyatt Tate
Salesman, Sales,Quincy Preston Moses
Nurse, Medical,Kessie Vielka Trevino
SoftwareEngineer, SoftwareManagement,Lamar Francis Scott
Technician, FieldService,Wing Noah Bonner
Technician, FieldService,Patience Audrey Douglas
Manager, Sales,Bert Jason Henderson
MechanicalEngineer, Engineering,Oscar Nolan Wooten
Technician, FieldService,Sarah Susan Jarvis
ITAdmin, Security,Kyla Jocelyn Porter
Salesman, Sales,Isabelle Maggie Benjamin
Technician, FieldService,Britanney Quail Snyder
ComputerScientist, SoftwareManagement,Beck Troy Richards
Director, Engineering,Declan Lester Moss
SystemsEngineer, Engineering,Addison Hiram Morrow
ProductionLineWorker, Assembly,Carter Harrison Maldonado
Manager, SoftwareManagement,Jocelyn Bree Mccray
SecurityGuard, Security,Joseph Raja Gaines
Salesman, Sales,Prescott Laith Harding
Technician, FieldService,Reed Chaim Perkins
ProductionLineWorker, Assembly,Neve Sarah Crane
ProductionLineWorker, Assembly,Ayanna Vivian Murray
Salesman, Sales,Molly Sacha Zimmerman
MechanicalEngineer, Engineering,Stewart Dale Berger
ElectricalEngineer, Engineering,Hakeem Arden Curry
PurchasingClerk, Purchasing,Hadley Sonya Bowen
Mathematician, Research,Ayanna Sylvia Blankenship
ProductionLineWorker, Assembly,Wynter Rose Mercer
IndustrialEngineer, IndustrialEngineering,Brianna Rebecca Mcintyre
Salesman, Sales,Sebastian Elliott Sexton
ITAdmin, Security,Jerry Tad Mccall
Technician, FieldService,Ria Neve Flores
ProductionLineWorker, Assembly,Graiden Nehru Zimmerman
ChiefEngineer, Engineering,Hadassah Riley Baker
Technician, FieldService,Zia Shelley Blankenship
SoftwareEngineer, SoftwareManagement,Axel Donovan Compton
Technician, FieldService,Penelope Montana Colon
Technician, FieldService,Idola Lana Jarvis
TestEngineer, Engineering,Amaya Noelle Terrell
Technician, FieldService,Dean Flynn Hines
Salesman, Sales,Lee Lacey Velez
Physicist, Research,Grace Charde Roth
SecurityGuard, Security,Samson Jeremy Ortega
Mathematician, Research,Nadine Gay Cross
PurchasingClerk, Purchasing,Yolanda Idona Crosby
ProductionLineWorker, Assembly,Eden Deborah Ball
Salesman, Sales,Lacota Hilda Lindsey
Technician, FieldService,Heather Fredericka Baird
Technician, FieldService,Elton Jonas Williamson
HealthSafetyEngineer, Safety,Cathleen Risa Oneal
Salesman, Sales,Halee Keiko Rhodes
Manager, IndustrialEngineering,Grant Tyrone Doyle
Salesman, Sales,Daryl Skyler Brock
AdministrativeAssistant, IndustrialEngineering,Clio Ocean Faulkner
ProductionLineWorker, Assembly,Hope Dawn Jensen
Manager, Accounting,Cedric Herrod Gilliam
Scientist, Research,Aline Iris Hurst
ProductionLineWorker, Assembly,Troy Nicolas Molina
ProductionLineWorker, Assembly,Aaron Porter Gutierrez
Technician, FieldService,Roth Hu Conner
Technician, FieldService,Chastity Quyn Wilkerson
SoftwareEngineer, SoftwareManagement,Honorato John Sloan
Salesman, Sales,Xerxes Howard Wilcox
Salesman, Sales,Isadora Jael Waters
ComputerTrainer, Training,Nigel Addison Rios
ProductionLineWorker, Assembly,Nero Uriel Little
MechanicalEngineer, Engineering,Drew Ivan Beck
ITAdmin, Security,Brenden Samuel Shaffer
Technician, FieldService,Margaret Illana Burch
Technician, FieldService,Athena Amelia Foreman
Scientist, Research,Hayden Bernard Benson
Salesman, Sales,Melodie Chantale Joyce
Mathematician, Research,Hashim Damon Hebert
ProductionLineWorker, Assembly,Holly Xerxes Lara
HardwareEngineer, Engineering,Macaulay Otto Hopkins
Technician, FieldService,Keiko Naida Webb
Salesman, Sales,Cullen Gary Adams
Technician, Engineering,Nell Mari Schneider
ProductionLineWorker, Assembly,Tad Harlan Duncan
AdministrativeAssistant, QualityControl,Scarlet Pearl Ashley
Salesman, Sales,Lenore Piper Cardenas
Scientist, Research,Benjamin Tyrone Norman
ProductionLineWorker, Assembly,Hanae Gay Hogan
Salesman, Sales,Brielle Aubrey Marks
SoftwareEngineer, SoftwareManagement,Kessie Kay Cooper
ElectricalEngineer, Engineering,Buckminster Benjamin Swanson
Salesman, Sales,Hedy Delilah Lopez
Mathematician, Research,Nissim Rafael Delacruz
Director, Sales,Donovan Carlos Chapman
SystemsEngineer, Engineering,Minerva Emerald Solomon
HumanResourceSpecialist, EmployeeRelations,Leonard Malachi Floyd
Technician, Engineering,Barry Martin Mason
Salesman, Sales,Leila Tallulah Steele
ProductionLineWorker, Assembly,Armand Odysseus Key
Scientist, Research,Eaton Samuel Jennings
Physicist, Research,Aladdin Abraham Foley
Salesman, Sales,Kirby Ruby Lyons
ProductionLineWorker, Assembly,Serina Amena Chavez
Mathematician, Research,Uriel Charles Solomon
Technician, FieldService,Jared Cameron Rosa
ProductionLineWorker, Assembly,Ivy Charissa Solis
Technician, Engineering,Macy Karleigh Winters
Scientist, Research,Tana Sonya Moody
Physicist, Research,Octavius Judah Kirby
MechanicalEngineer, Engineering,Stephanie Mary Whitehead
Salesman, Sales,Barclay Eaton Hensley
SoftwareEngineer, SoftwareManagement,Ariana Doris Frazier
ProductionLineWorker, Assembly,Nicolas James Cantu
SoftwareEngineer, SoftwareManagement,Bertha Yetta Parrish
Technician, FieldService,Jane Maite Dotson
IndustrialEngineer, IndustrialEngineering,Lucas Ahmed Ferrell
Salesman, Sales,Kay Brynne Spears
ProductionLineWorker, Assembly,Genevieve Hyacinth Head
ProductionLineWorker, Assembly,Timothy Arthur Carroll
ProductionLineWorker, Assembly,Jaquelyn Angelica Jimenez
Technician, FieldService,Nevada Odette Bass
Physicist, Research,Daquan Tucker Pugh
ProductionLineWorker, Assembly,Colorado Joel Merrill
ProductionLineWorker, Assembly,Fallon Harriet Shelton
Salesman, Sales,Chelsea Aspen Allen
Technician, FieldService,Echo Leandra Torres
SystemsEngineer, Engineering,Katell Jasmine Wiggins
Technician, FieldService,Cairo Theodore Robles
NursePractitioner, Medical,Dolan Igor Cortez
ProductionLineWorker, Assembly,Jane Justina Hunt
Technician, FieldService,Mira Jamalia Snow
AdministrativeAssistant, Purchasing,Tarik Odysseus Rivera
Technician, FieldService,Sophia Cora Battle
SoftwareEngineer, SoftwareManagement,Maxwell Dante Hutchinson
Salesman, Sales,Jonathan Orlando Marsh
FieldServiceEngineer, FieldService,Burke Randall Burnett
Technician, FieldService,Macon Joseph Morrison
Technician, FieldService,Kibo Josiah Murray
SoftwareEngineer, SoftwareManagement,Courtney Brynn Garrett
Physicist, Research,Raya Regan Church
ComputerTrainer, Training,Tara Dai Stevenson
Manager, FinancialPlanning,Libby Rosalyn Richard
ProductionLineWorker, Assembly,Amelia Rhoda Burgess
ComputerScientist, SoftwareManagement,Kareem Porter Collins
Technician, FieldService,Charde Lareina Barrett
ComputerScientist, SoftwareManagement,Valentine Elton Britt
ProductionLineWorker, Assembly,Macey Christen Turner
ProductionLineWorker, Assembly,Jameson Damian Franco
ProductionLineWorker, Assembly,Callum Jasper Gilmore
SoftwareEngineer, SoftwareManagement,Riley Ginger Guy
Director, Personnel,Bethany Xerxes Johnson
Salesman, Sales,William Beau Callahan
Technician, FieldService,Claudia Galena Baldwin
ProductionLineWorker, Assembly,Chadwick Armand Nunez
Technician, Engineering,Bell Jorden Martinez
Manager, Sales,Meredith Ainsley Wolf
TestEngineer, Engineering,Preston Plato Fischer
Mathematician, Research,Samuel Eden James
ComputerProgrammer, SoftwareManagement,Alden Caesar Velez
MechanicalEngineer, Engineering,Kane Walter Eaton
ComputerProgrammer, SoftwareManagement,Edan Ciaran Larson
Salesman, Sales,Randall Hashim Palmer
Technician, FieldService,Brenda Alika Matthews
ProductionLineWorker, Assembly,Dale Dorian Mercado
ITAdmin, Security,Ursula Idona Richard
Salesman, Sales,Jaquelyn Cassandra Roberson
Salesman, Sales,Aquila Tanner Ellison
ProductionLineWorker, Assembly,Isadora Blaine Shepherd
ChiefEngineer, Engineering,Dylan Tiger Terry
Salesman, Sales,Price Rashad Mullen
Salesman, Sales,Florence Gloria Whitney
Technician, FieldService,Judith Shaeleigh Hayden
SoftwareEngineer, SoftwareManagement,Ferris Stone Bender
