﻿{
    "configurations": [
        {
            "name": "x64-Debug",
            "generator": "Ninja",
            "configurationType": "Debug",
            "inheritEnvironments": [ "msvc_x64_x64" ],
            "buildRoot": "${projectDir}\\out\\build\\${name}",
            "installRoot": "${projectDir}\\out\\install\\${name}"
        },
        {
            "name": "x64-Debug-ASAN",
            "generator": "Ninja",
            "configurationType": "Debug",
            "buildRoot": "${projectDir}\\out\\build\\${name}",
            "installRoot": "${projectDir}\\out\\install\\${name}",
            "inheritEnvironments": [ "msvc_x64_x64" ],
            "addressSanitizerEnabled": true,
            "variables": [
                {
                    "name": "DEBUG_ASAN",
                    "value": "True",
                    "type": "BOOL"
                }
            ]
        },
        {
            "name": "x64-Debug-CRT",
            "generator": "Ninja",
            "configurationType": "Debug",
            "buildRoot": "${projectDir}\\out\\build\\${name}",
            "installRoot": "${projectDir}\\out\\install\\${name}",
            "inheritEnvironments": [ "msvc_x64_x64" ],
            "variables": [
                {
                    "name": "DEBUG_CRT",
                    "value": "True",
                    "type": "BOOL"
                }
            ]
        },
        {
            "name": "x64-Release",
            "generator": "Ninja",
            "configurationType": "RelWithDebInfo",
            "inheritEnvironments": [ "msvc_x64_x64" ],
            "buildRoot": "${projectDir}\\out\\build\\${name}",
            "installRoot": "${projectDir}\\out\\install\\${name}"
        }
    ]
}