StartFontMetrics 4.1
FontName Poppins-Bold
FullName Poppins Bold
Notice Copyright 2020 The Poppins Project Authors [https://github.com/itfoundry/Poppins]
EncodingScheme FontSpecific
FamilyName Poppins
Weight Bold
Version 4.004
Characters 221
ItalicAngle 0.0
Ascender 1050
Descender -350
UnderlineThickness 50
UnderlinePosition -75
IsFixedPitch false
FontBBox -63 -275 1149 987
StartCharMetrics 256
C 0 ; WX 0 ; N .null ; B 60 0 856 749 ;
C 1 ; WX 500 ; N .notdef ; B 0 0 500 700 ;
C 2 ; WX 500 ; N .notdef ; B 0 0 500 700 ;
C 3 ; WX 500 ; N .notdef ; B 0 0 500 700 ;
C 4 ; WX 500 ; N .notdef ; B 0 0 500 700 ;
C 5 ; WX 500 ; N .notdef ; B 0 0 500 700 ;
C 6 ; WX 500 ; N .notdef ; B 0 0 500 700 ;
C 7 ; WX 500 ; N .notdef ; B 0 0 500 700 ;
C 8 ; WX 500 ; N .notdef ; B 0 0 500 700 ;
C 9 ; WX 500 ; N .notdef ; B 0 0 500 700 ;
C 10 ; WX 500 ; N .notdef ; B 0 0 500 700 ;
C 11 ; WX 500 ; N .notdef ; B 0 0 500 700 ;
C 12 ; WX 500 ; N .notdef ; B 0 0 500 700 ;
C 13 ; WX 212 ; N CR ; B 60 0 856 749 ;
C 14 ; WX 500 ; N .notdef ; B 0 0 500 700 ;
C 15 ; WX 500 ; N .notdef ; B 0 0 500 700 ;
C 16 ; WX 500 ; N .notdef ; B 0 0 500 700 ;
C 17 ; WX 500 ; N .notdef ; B 0 0 500 700 ;
C 18 ; WX 500 ; N .notdef ; B 0 0 500 700 ;
C 19 ; WX 500 ; N .notdef ; B 0 0 500 700 ;
C 20 ; WX 500 ; N .notdef ; B 0 0 500 700 ;
C 21 ; WX 500 ; N .notdef ; B 0 0 500 700 ;
C 22 ; WX 500 ; N .notdef ; B 0 0 500 700 ;
C 23 ; WX 500 ; N .notdef ; B 0 0 500 700 ;
C 24 ; WX 500 ; N .notdef ; B 0 0 500 700 ;
C 25 ; WX 500 ; N .notdef ; B 0 0 500 700 ;
C 26 ; WX 500 ; N .notdef ; B 0 0 500 700 ;
C 27 ; WX 500 ; N .notdef ; B 0 0 500 700 ;
C 28 ; WX 500 ; N .notdef ; B 0 0 500 700 ;
C 29 ; WX 500 ; N .notdef ; B 0 0 500 700 ;
C 30 ; WX 500 ; N .notdef ; B 0 0 500 700 ;
C 31 ; WX 500 ; N .notdef ; B 0 0 500 700 ;
C 32 ; WX 212 ; N space ; B 60 0 856 749 ;
C 33 ; WX 392 ; N exclam ; B 95 -8 298 727 ;
C 34 ; WX 411 ; N quotedbl ; B 40 579 371 800 ;
C 35 ; WX 904 ; N numbersign ; B 20 0 871 740 ;
C 36 ; WX 658 ; N dollar ; B 44 -87 593 792 ;
C 37 ; WX 870 ; N percent ; B 31 -11 839 715 ;
C 38 ; WX 798 ; N ampersand ; B 36 -11 798 716 ;
C 39 ; WX 221 ; N quotesingle ; B 40 579 181 800 ;
C 40 ; WX 477 ; N parenleft ; B 87 -209 470 913 ;
C 41 ; WX 477 ; N parenright ; B 7 -209 390 913 ;
C 42 ; WX 534 ; N asterisk ; B 74 360 463 740 ;
C 43 ; WX 628 ; N plus ; B 59 95 569 605 ;
C 44 ; WX 287 ; N comma ; B 26 -129 246 158 ;
C 45 ; WX 580 ; N hyphen ; B 52 280 492 422 ;
C 46 ; WX 282 ; N period ; B 40 -8 243 178 ;
C 47 ; WX 453 ; N slash ; B 10 -187 443 950 ;
C 48 ; WX 652 ; N zero ; B 45 3 607 745 ;
C 49 ; WX 376 ; N one ; B 27 0 304 730 ;
C 50 ; WX 571 ; N two ; B 37 10 541 746 ;
C 51 ; WX 605 ; N three ; B 42 -6 550 747 ;
C 52 ; WX 677 ; N four ; B 49 0 638 720 ;
C 53 ; WX 650 ; N five ; B 84 0 601 731 ;
C 54 ; WX 637 ; N six ; B 62 -4 585 745 ;
C 55 ; WX 535 ; N seven ; B 28 0 511 729 ;
C 56 ; WX 648 ; N eight ; B 54 -14 594 745 ;
C 57 ; WX 615 ; N nine ; B 52 -3 569 747 ;
C 58 ; WX 284 ; N colon ; B 40 -8 243 585 ;
C 59 ; WX 347 ; N semicolon ; B 50 -129 272 577 ;
C 60 ; WX 551 ; N less ; B 57 129 475 571 ;
C 61 ; WX 696 ; N equal ; B 68 147 628 553 ;
C 62 ; WX 541 ; N greater ; B 63 129 481 571 ;
C 63 ; WX 538 ; N question ; B 26 -8 503 741 ;
C 64 ; WX 1080 ; N at ; B 73 -225 1007 668 ;
C 65 ; WX 737 ; N A ; B 16 0 722 702 ;
C 66 ; WX 659 ; N B ; B 62 0 622 702 ;
C 67 ; WX 762 ; N C ; B 33 -5 719 710 ;
C 68 ; WX 727 ; N D ; B 62 0 693 702 ;
C 69 ; WX 541 ; N E ; B 62 0 492 702 ;
C 70 ; WX 547 ; N F ; B 62 0 519 702 ;
C 71 ; WX 762 ; N G ; B 33 -5 729 710 ;
C 72 ; WX 731 ; N H ; B 62 0 670 702 ;
C 73 ; WX 295 ; N I ; B 62 0 233 702 ;
C 74 ; WX 578 ; N J ; B 26 -7 502 702 ;
C 75 ; WX 697 ; N K ; B 62 0 678 702 ;
C 76 ; WX 477 ; N L ; B 62 0 457 702 ;
C 77 ; WX 918 ; N M ; B 62 0 857 702 ;
C 78 ; WX 752 ; N N ; B 62 0 690 702 ;
C 79 ; WX 786 ; N O ; B 33 -7 753 712 ;
C 80 ; WX 624 ; N P ; B 62 0 597 702 ;
C 81 ; WX 788 ; N Q ; B 33 -120 769 712 ;
C 82 ; WX 652 ; N R ; B 62 0 613 702 ;
C 83 ; WX 615 ; N S ; B 42 -7 572 712 ;
C 84 ; WX 591 ; N T ; B 24 0 567 702 ;
C 85 ; WX 705 ; N U ; B 59 -7 647 702 ;
C 86 ; WX 730 ; N V ; B 9 0 721 702 ;
C 87 ; WX 1052 ; N W ; B 25 0 1028 702 ;
C 88 ; WX 715 ; N X ; B 24 0 691 702 ;
C 89 ; WX 671 ; N Y ; B 7 0 664 702 ;
C 90 ; WX 596 ; N Z ; B 50 0 546 702 ;
C 91 ; WX 510 ; N bracketleft ; B 120 -209 420 913 ;
C 92 ; WX 802 ; N backslash ; B 183 -187 616 950 ;
C 93 ; WX 510 ; N bracketright ; B 90 -209 390 913 ;
C 94 ; WX 709 ; N asciicircum ; B 30 165 679 704 ;
C 95 ; WX 780 ; N underscore ; B 85 -205 705 -41 ;
C 96 ; WX 291 ; N grave ; B 10 596 251 830 ;
C 97 ; WX 679 ; N a ; B 28 -8 617 566 ;
C 98 ; WX 679 ; N b ; B 62 -8 651 740 ;
C 99 ; WX 605 ; N c ; B 28 -8 576 566 ;
C 100 ; WX 679 ; N d ; B 28 -8 617 740 ;
C 101 ; WX 616 ; N e ; B 28 -8 588 566 ;
C 102 ; WX 360 ; N f ; B 17 0 342 784 ;
C 103 ; WX 679 ; N g ; B 28 -275 617 566 ;
C 104 ; WX 674 ; N h ; B 62 0 617 740 ;
C 105 ; WX 295 ; N i ; B 46 0 249 801 ;
C 106 ; WX 294 ; N j ; B -31 -266 248 801 ;
C 107 ; WX 618 ; N k ; B 62 0 615 740 ;
C 108 ; WX 295 ; N l ; B 62 0 233 740 ;
C 109 ; WX 1059 ; N m ; B 62 0 1001 564 ;
C 110 ; WX 674 ; N n ; B 62 0 617 564 ;
C 111 ; WX 637 ; N o ; B 28 -8 608 566 ;
C 112 ; WX 679 ; N p ; B 62 -266 651 566 ;
C 113 ; WX 679 ; N q ; B 28 -266 617 564 ;
C 114 ; WX 428 ; N r ; B 62 0 408 564 ;
C 115 ; WX 558 ; N s ; B 32 -8 515 566 ;
C 116 ; WX 406 ; N t ; B 21 0 373 694 ;
C 117 ; WX 674 ; N u ; B 57 -6 613 558 ;
C 118 ; WX 626 ; N v ; B 9 0 616 558 ;
C 119 ; WX 866 ; N w ; B 4 0 863 558 ;
C 120 ; WX 588 ; N x ; B 5 0 584 558 ;
C 121 ; WX 632 ; N y ; B -1 -265 632 558 ;
C 122 ; WX 496 ; N z ; B 31 0 464 558 ;
C 123 ; WX 499 ; N braceleft ; B 91 -211 428 914 ;
C 124 ; WX 291 ; N bar ; B 60 -129 231 815 ;
C 125 ; WX 499 ; N braceright ; B 71 -211 408 914 ;
C 126 ; WX 636 ; N asciitilde ; B 28 208 609 425 ;
C 127 ; WX 500 ; N .notdef ; B 0 0 500 700 ;
C 128 ; WX 796 ; N Euro ; B 20 -5 767 710 ;
C 129 ; WX 500 ; N .notdef ; B 0 0 500 700 ;
C 130 ; WX 292 ; N quotesinglbase ; B 25 -105 252 163 ;
C 131 ; WX 336 ; N florin ; B -63 -266 350 783 ;
C 132 ; WX 520 ; N quotedblbase ; B 26 -105 479 163 ;
C 133 ; WX 760 ; N ellipsis ; B 40 -8 724 178 ;
C 134 ; WX 654 ; N dagger ; B 50 -266 604 789 ;
C 135 ; WX 654 ; N daggerdbl ; B 50 -266 604 789 ;
C 136 ; WX 330 ; N circumflex ; B 10 596 320 793 ;
C 137 ; WX 1179 ; N perthousand ; B 30 -10 1149 714 ;
C 138 ; WX 615 ; N Scaron ; B 42 -7 572 943 ;
C 139 ; WX 337 ; N guilsinglleft ; B 45 120 287 470 ;
C 140 ; WX 1063 ; N OE ; B 33 -10 1015 712 ;
C 141 ; WX 500 ; N .notdef ; B 0 0 500 700 ;
C 142 ; WX 596 ; N Zcaron ; B 50 0 546 939 ;
C 143 ; WX 500 ; N .notdef ; B 0 0 500 700 ;
C 144 ; WX 520 ; N quotedblbase ; B 26 -105 479 163 ;
C 145 ; WX 314 ; N quoteleft ; B 38 434 265 702 ;
C 146 ; WX 314 ; N quoteright ; B 49 434 276 702 ;
C 147 ; WX 541 ; N quotedblleft ; B 38 434 492 702 ;
C 148 ; WX 541 ; N quotedblright ; B 49 434 503 702 ;
C 149 ; WX 501 ; N bullet ; B 100 183 401 484 ;
C 150 ; WX 695 ; N endash ; B 70 280 625 422 ;
C 151 ; WX 930 ; N emdash ; B 70 280 860 422 ;
C 152 ; WX 410 ; N tilde ; B 5 605 405 753 ;
C 153 ; WX 883 ; N trademark ; B 27 355 838 706 ;
C 154 ; WX 558 ; N scaron ; B 32 -8 515 797 ;
C 155 ; WX 337 ; N guilsinglright ; B 50 120 292 470 ;
C 156 ; WX 1041 ; N oe ; B 28 -8 999 566 ;
C 157 ; WX 500 ; N .notdef ; B 0 0 500 700 ;
C 158 ; WX 496 ; N zcaron ; B 31 0 464 793 ;
C 159 ; WX 671 ; N Ydieresis ; B 7 0 664 913 ;
C 160 ; WX 212 ; N uni00A0 ; B 95 -163 298 572 ;
C 161 ; WX 392 ; N exclamdown ; B 95 -163 298 572 ;
C 162 ; WX 631 ; N cent ; B 42 -85 562 597 ;
C 163 ; WX 663 ; N sterling ; B 36 -4 588 747 ;
C 164 ; WX 577 ; N currency ; B 60 150 517 608 ;
C 165 ; WX 671 ; N yen ; B 7 0 664 702 ;
C 166 ; WX 381 ; N brokenbar ; B 105 -129 276 815 ;
C 167 ; WX 587 ; N section ; B 30 -224 557 712 ;
C 168 ; WX 367 ; N dieresis ; B 10 620 357 767 ;
C 169 ; WX 779 ; N copyright ; B 38 -7 742 712 ;
C 170 ; WX 469 ; N ordfeminine ; B 25 349 439 711 ;
C 171 ; WX 557 ; N guillemotleft ; B 45 120 512 470 ;
C 172 ; WX 717 ; N logicalnot ; B 47 180 662 442 ;
C 173 ; WX 580 ; N uni00AD ; B 52 280 492 422 ;
C 174 ; WX 514 ; N registered ; B 39 281 474 713 ;
C 175 ; WX 420 ; N macron ; B 10 628 410 746 ;
C 176 ; WX 463 ; N degree ; B 25 347 438 709 ;
C 177 ; WX 629 ; N plusminus ; B 60 111 570 626 ;
C 178 ; WX 383 ; N twosuperior ; B 34 352 353 714 ;
C 179 ; WX 374 ; N threesuperior ; B 15 348 349 714 ;
C 180 ; WX 261 ; N acute ; B 10 596 251 830 ;
C 181 ; WX 705 ; N uni00B5 ; B 75 -266 630 558 ;
C 182 ; WX 708 ; N paragraph ; B 28 0 633 702 ;
C 183 ; WX 299 ; N periodcentered ; B 50 222 253 408 ;
C 184 ; WX 313 ; N cedilla ; B 10 -267 303 7 ;
C 185 ; WX 249 ; N onesuperior ; B 20 352 209 704 ;
C 186 ; WX 458 ; N ordmasculine ; B 25 347 433 709 ;
C 187 ; WX 557 ; N guillemotright ; B 50 120 517 470 ;
C 188 ; WX 786 ; N onequarter ; B 40 0 756 704 ;
C 189 ; WX 821 ; N onehalf ; B 40 -1 762 704 ;
C 190 ; WX 891 ; N threequarters ; B 50 0 871 714 ;
C 191 ; WX 538 ; N questiondown ; B 34 -177 511 572 ;
C 192 ; WX 737 ; N Agrave ; B 16 0 722 976 ;
C 193 ; WX 737 ; N Aacute ; B 16 0 722 976 ;
C 194 ; WX 737 ; N Acircumflex ; B 16 0 722 939 ;
C 195 ; WX 737 ; N Atilde ; B 16 0 722 899 ;
C 196 ; WX 737 ; N Adieresis ; B 16 0 722 913 ;
C 197 ; WX 737 ; N Aring ; B 16 0 722 987 ;
C 198 ; WX 955 ; N AE ; B 6 0 906 702 ;
C 199 ; WX 762 ; N Ccedilla ; B 33 -271 719 710 ;
C 200 ; WX 541 ; N Egrave ; B 62 0 492 976 ;
C 201 ; WX 541 ; N Eacute ; B 62 0 492 976 ;
C 202 ; WX 541 ; N Ecircumflex ; B 62 0 492 939 ;
C 203 ; WX 541 ; N Edieresis ; B 62 0 492 913 ;
C 204 ; WX 295 ; N Igrave ; B 23 0 264 976 ;
C 205 ; WX 295 ; N Iacute ; B 23 0 264 976 ;
C 206 ; WX 295 ; N Icircumflex ; B -7 0 303 939 ;
C 207 ; WX 295 ; N Idieresis ; B -26 0 321 913 ;
C 208 ; WX 732 ; N Eth ; B 4 0 698 702 ;
C 209 ; WX 752 ; N Ntilde ; B 62 0 690 899 ;
C 210 ; WX 786 ; N Ograve ; B 33 -7 753 976 ;
C 211 ; WX 786 ; N Oacute ; B 33 -7 753 976 ;
C 212 ; WX 786 ; N Ocircumflex ; B 33 -7 753 939 ;
C 213 ; WX 786 ; N Otilde ; B 33 -7 753 899 ;
C 214 ; WX 786 ; N Odieresis ; B 33 -7 753 913 ;
C 215 ; WX 637 ; N multiply ; B 69 106 568 600 ;
C 216 ; WX 786 ; N Oslash ; B 22 -7 764 712 ;
C 217 ; WX 705 ; N Ugrave ; B 59 -7 647 976 ;
C 218 ; WX 705 ; N Uacute ; B 59 -7 647 976 ;
C 219 ; WX 705 ; N Ucircumflex ; B 59 -7 647 939 ;
C 220 ; WX 705 ; N Udieresis ; B 59 -7 647 913 ;
C 221 ; WX 671 ; N Yacute ; B 7 0 664 976 ;
C 222 ; WX 624 ; N Thorn ; B 62 0 597 702 ;
C 223 ; WX 760 ; N germandbls ; B 49 -10 712 768 ;
C 224 ; WX 679 ; N agrave ; B 28 -8 617 830 ;
C 225 ; WX 679 ; N aacute ; B 28 -8 617 830 ;
C 226 ; WX 679 ; N acircumflex ; B 28 -8 617 793 ;
C 227 ; WX 679 ; N atilde ; B 28 -8 617 753 ;
C 228 ; WX 679 ; N adieresis ; B 28 -8 617 767 ;
C 229 ; WX 679 ; N aring ; B 28 -8 617 841 ;
C 230 ; WX 1069 ; N ae ; B 28 -8 1041 566 ;
C 231 ; WX 605 ; N ccedilla ; B 28 -271 576 566 ;
C 232 ; WX 616 ; N egrave ; B 28 -8 588 834 ;
C 233 ; WX 616 ; N eacute ; B 28 -8 588 834 ;
C 234 ; WX 616 ; N ecircumflex ; B 28 -8 588 797 ;
C 235 ; WX 616 ; N edieresis ; B 28 -8 588 771 ;
C 236 ; WX 321 ; N igrave ; B 36 0 277 830 ;
C 237 ; WX 321 ; N iacute ; B 36 0 277 830 ;
C 238 ; WX 321 ; N icircumflex ; B 6 0 316 793 ;
C 239 ; WX 321 ; N idieresis ; B -13 0 334 767 ;
C 240 ; WX 640 ; N eth ; B 28 -7 612 740 ;
C 241 ; WX 674 ; N ntilde ; B 62 0 617 753 ;
C 242 ; WX 637 ; N ograve ; B 28 -8 608 834 ;
C 243 ; WX 637 ; N oacute ; B 28 -8 608 834 ;
C 244 ; WX 637 ; N ocircumflex ; B 28 -8 608 797 ;
C 245 ; WX 637 ; N otilde ; B 28 -8 608 757 ;
C 246 ; WX 637 ; N odieresis ; B 28 -8 608 771 ;
C 247 ; WX 611 ; N divide ; B 53 31 564 670 ;
C 248 ; WX 629 ; N oslash ; B 13 -8 616 566 ;
C 249 ; WX 674 ; N ugrave ; B 57 -6 613 830 ;
C 250 ; WX 674 ; N uacute ; B 57 -6 613 830 ;
C 251 ; WX 674 ; N ucircumflex ; B 57 -6 613 793 ;
C 252 ; WX 674 ; N udieresis ; B 57 -6 613 767 ;
C 253 ; WX 632 ; N yacute ; B -1 -265 632 830 ;
C 254 ; WX 679 ; N thorn ; B 62 -266 651 740 ;
C 255 ; WX 632 ; N ydieresis ; B -1 -265 632 767 ;
EndCharMetrics
EndFontMetrics
