<svg width="18" height="18" viewBox="0 0 18 18" fill="none" xmlns="http://www.w3.org/2000/svg">
<g id="shield-check">
<path id="Vector" d="M7.5 12.75L4.5 9.75L5.5575 8.6925L7.5 10.6275L12.4425 5.685L13.5 6.75M9 0.75L2.25 3.75V8.25C2.25 12.4125 5.13 16.305 9 17.25C12.87 16.305 15.75 12.4125 15.75 8.25V3.75L9 0.75Z" fill="#49AA19"/>
</g>
</svg>
