{
    "index": "/index.html",
    "assetGroups": [
        {
            "name": "app",
            "installMode": "prefetch",
            "resources": {
                "files": [
                    "/favicon.ico",
                    "/index.html"
                ],
                "versionedFiles": [
                    "/main.*.js",
                    "/polyfills.*.js",
                    "/runtime.*.js",
                    "/styles.*.css"
                ]
            }
        },
        {
            "name": "assets",
            "installMode": "lazy",
            "updateMode": "prefetch",
            "resources": {
                "files": [
                    "/assets/**"
                ]
            }
        }
    ],
    "dataGroups": [
        {
            "name": "FirebaseAPI",
            "urls": [
                "https://platzinotas-ec2b4.firebaseio.com/**"
            ],
            "cacheConfig": {
                "strategy": "freshness",
                "macAge": "2h",
                "maxSize": 100,
                "timeout": "5s"
            }
        }
    ]
}