<svg width="35" height="31" viewBox="0 0 35 31" fill="none" xmlns="http://www.w3.org/2000/svg">
<path d="M28.802 12.482V28.7646H22.6541V21.7224C22.6541 21.105 22.1537 20.6047 21.5363 20.6047H13.6744C13.057 20.6047 12.5566 21.1051 12.5566 21.7224V28.7646H6.44601V12.482H4.21045V29.8824C4.21045 30.4998 4.71087 31.0001 5.32823 31.0001H13.6745C14.2919 31.0001 14.7923 30.4997 14.7923 29.8824V22.8403H20.4185V29.8824C20.4185 30.4998 20.9189 31.0002 21.5363 31.0002H29.9198C30.5373 31.0002 31.0376 30.4998 31.0376 29.8824V12.482H28.802Z" fill="#59205B"/>
<path d="M34.5959 15.4665L18.3878 0.301727C17.9612 -0.0980806 17.2979 -0.100675 16.8676 0.294627L0.361438 15.4595C-0.0931146 15.8771 -0.122945 16.584 0.294747 17.0385C0.514958 17.2789 0.815992 17.4003 1.11819 17.4003C1.3883 17.4003 1.65957 17.3027 1.87418 17.1056L17.6173 2.642L33.0686 17.0989C33.5202 17.521 34.2266 17.4969 34.6484 17.0463C35.0699 16.5955 35.0467 15.8883 34.5959 15.4665Z" fill="#59205B"/>
</svg>
