%YAML 1.1
%TAG !u! tag:unity3d.com,2011:
--- !u!1 &1999082340911281523
GameObject:
  m_ObjectHideFlags: 0
  m_CorrespondingSourceObject: {fileID: 0}
  m_PrefabInstance: {fileID: 0}
  m_PrefabAsset: {fileID: 0}
  serializedVersion: 6
  m_Component:
  - component: {fileID: 1999082340911281525}
  - component: {fileID: 1999082340911281524}
  m_Layer: 0
  m_Name: MapMaker
  m_TagString: Untagged
  m_Icon: {fileID: 0}
  m_NavMeshLayer: 0
  m_StaticEditorFlags: 0
  m_IsActive: 1
--- !u!4 &1999082340911281525
Transform:
  m_ObjectHideFlags: 0
  m_CorrespondingSourceObject: {fileID: 0}
  m_PrefabInstance: {fileID: 0}
  m_PrefabAsset: {fileID: 0}
  m_GameObject: {fileID: 1999082340911281523}
  m_LocalRotation: {x: 0, y: 0, z: 0, w: 1}
  m_LocalPosition: {x: -2.3917422, y: 1.2766988, z: 0.03426635}
  m_LocalScale: {x: 1, y: 1, z: 1}
  m_ConstrainProportionsScale: 0
  m_Children: []
  m_Father: {fileID: 0}
  m_RootOrder: 0
  m_LocalEulerAnglesHint: {x: 0, y: 0, z: 0}
--- !u!114 &1999082340911281524
MonoBehaviour:
  m_ObjectHideFlags: 0
  m_CorrespondingSourceObject: {fileID: 0}
  m_PrefabInstance: {fileID: 0}
  m_PrefabAsset: {fileID: 0}
  m_GameObject: {fileID: 1999082340911281523}
  m_Enabled: 1
  m_EditorHideFlags: 0
  m_Script: {fileID: 11500000, guid: 8fd951c1499f5294692ec5361ae01e98, type: 3}
  m_Name: 
  m_EditorClassIdentifier: 
  tilemap: {fileID: 0}
  tile: {fileID: 11400000, guid: 2e6f527964163e24892b1fe9a162cbd1, type: 2}
  mapWidth: 1200
  mapHeight: 64
  cellularData: {fileID: 0}
  perlinData: {fileID: 0}
