%YAML 1.1
%TAG !u! tag:unity3d.com,2011:
--- !u!1001 &3821790323571550096
PrefabInstance:
  m_ObjectHideFlags: 0
  serializedVersion: 2
  m_Modification:
    m_TransformParent: {fileID: 0}
    m_Modifications:
    - target: {fileID: -8679921383154817045, guid: 1a0ea7a5028fd834b90e2af1c1fac36d, type: 3}
      propertyPath: m_RootOrder
      value: 0
      objectReference: {fileID: 0}
    - target: {fileID: -8679921383154817045, guid: 1a0ea7a5028fd834b90e2af1c1fac36d, type: 3}
      propertyPath: m_LocalPosition.x
      value: -362.73
      objectReference: {fileID: 0}
    - target: {fileID: -8679921383154817045, guid: 1a0ea7a5028fd834b90e2af1c1fac36d, type: 3}
      propertyPath: m_LocalPosition.y
      value: 125.41
      objectReference: {fileID: 0}
    - target: {fileID: -8679921383154817045, guid: 1a0ea7a5028fd834b90e2af1c1fac36d, type: 3}
      propertyPath: m_LocalPosition.z
      value: 1309.9
      objectReference: {fileID: 0}
    - target: {fileID: -8679921383154817045, guid: 1a0ea7a5028fd834b90e2af1c1fac36d, type: 3}
      propertyPath: m_LocalRotation.w
      value: 0.7071067
      objectReference: {fileID: 0}
    - target: {fileID: -8679921383154817045, guid: 1a0ea7a5028fd834b90e2af1c1fac36d, type: 3}
      propertyPath: m_LocalRotation.x
      value: -0.7071068
      objectReference: {fileID: 0}
    - target: {fileID: -8679921383154817045, guid: 1a0ea7a5028fd834b90e2af1c1fac36d, type: 3}
      propertyPath: m_LocalRotation.y
      value: 0
      objectReference: {fileID: 0}
    - target: {fileID: -8679921383154817045, guid: 1a0ea7a5028fd834b90e2af1c1fac36d, type: 3}
      propertyPath: m_LocalRotation.z
      value: -0
      objectReference: {fileID: 0}
    - target: {fileID: -8679921383154817045, guid: 1a0ea7a5028fd834b90e2af1c1fac36d, type: 3}
      propertyPath: m_LocalEulerAnglesHint.x
      value: 0
      objectReference: {fileID: 0}
    - target: {fileID: -8679921383154817045, guid: 1a0ea7a5028fd834b90e2af1c1fac36d, type: 3}
      propertyPath: m_LocalEulerAnglesHint.y
      value: 0
      objectReference: {fileID: 0}
    - target: {fileID: -8679921383154817045, guid: 1a0ea7a5028fd834b90e2af1c1fac36d, type: 3}
      propertyPath: m_LocalEulerAnglesHint.z
      value: 0
      objectReference: {fileID: 0}
    - target: {fileID: 919132149155446097, guid: 1a0ea7a5028fd834b90e2af1c1fac36d, type: 3}
      propertyPath: m_Name
      value: militar_Box
      objectReference: {fileID: 0}
    m_RemovedComponents: []
  m_SourcePrefab: {fileID: 100100000, guid: 1a0ea7a5028fd834b90e2af1c1fac36d, type: 3}
