sizeof(char)          =      1
sizeof(int)           =      2
sizeof(long int)      =      4
sizeof(long long int) =      8
sizeof(short int)     =      2
sizeof(float)         =      4
sizeof(double)        =      4
sizeof(long double)   =      4
sizeof(int*)          =      2
