digraph "source tree" {
    overlap=scale;
    size="8,10";
    ratio="fill";
    fontsize="16";
    fontname="Helvetica";
	clusterrank="local";
	"B.h" -> "A.h"
	"uC.c" -> "A.h"
	"B.c" -> "B.h"
	"uC.c" -> "C.h"
	"uB.c" -> "B.h"
	"uA.c" -> "A.h"
	"C.h" -> "A.h"
	"C.c" -> "C.h"
	"uBC.c" -> "B.h"
	"A.c" -> "A.h"
	"uBC.c" -> "C.h"
}
