EESchema Schematic File Version 4
EELAYER 30 0
EELAYER END
$Descr A4 11693 8268
encoding utf-8
Sheet 3 5
Title ""
Date ""
Rev ""
Comp ""
Comment1 ""
Comment2 ""
Comment3 ""
Comment4 ""
$EndDescr
$Comp
L SJ1-3515-SMT:SJ1-3515-SMT JLeft?
U 1 1 60053927
P 4300 3050
AR Path="/60053927" Ref="JLeft?"  Part="1" 
AR Path="/60051872/60053927" Ref="JLeft1"  Part="1" 
F 0 "JLeft1" H 4407 3517 50  0000 C CNN
F 1 "SJ1-3515-SMT" H 4407 3426 50  0000 C CNN
F 2 "lib:CUI_SJ1-3515-SMT" H 4300 3050 50  0001 L BNN
F 3 "" H 4300 3050 50  0001 L BNN
F 4 "Manufacturer recommendation" H 4300 3050 50  0001 L BNN "STANDARD"
F 5 "CUI" H 4300 3050 50  0001 L BNN "MANUFACTURER"
F 6 "1.05" H 4300 3050 50  0001 L BNN "PARTREV"
	1    4300 3050
	1    0    0    -1  
$EndComp
$Comp
L SJ1-3515-SMT:SJ1-3515-SMT JHeadphones?
U 1 1 60053930
P 6350 3450
AR Path="/60053930" Ref="JHeadphones?"  Part="1" 
AR Path="/60051872/60053930" Ref="JHeadphones1"  Part="1" 
F 0 "JHeadphones1" H 6600 2950 50  0000 L CNN
F 1 "SJ1-3515-SMT" H 6100 3050 50  0000 L CNN
F 2 "lib:CUI_SJ1-3515-SMT" H 6350 3450 50  0001 L BNN
F 3 "" H 6350 3450 50  0001 L BNN
F 4 "Manufacturer recommendation" H 6350 3450 50  0001 L BNN "STANDARD"
F 5 "CUI" H 6350 3450 50  0001 L BNN "MANUFACTURER"
F 6 "1.05" H 6350 3450 50  0001 L BNN "PARTREV"
	1    6350 3450
	-1   0    0    1   
$EndComp
Wire Wire Line
	5000 2850 5200 2850
Wire Wire Line
	5200 2850 5200 3050
Wire Wire Line
	5200 3750 5000 3750
Wire Wire Line
	5000 3050 5200 3050
Connection ~ 5200 3050
Wire Wire Line
	5200 3050 5200 3150
Wire Wire Line
	5200 3150 5000 3150
Connection ~ 5200 3150
Wire Wire Line
	5200 3150 5200 3650
Wire Wire Line
	5000 3950 5200 3950
Wire Wire Line
	5200 3950 5200 3750
Connection ~ 5200 3750
Wire Wire Line
	5000 4050 5200 4050
Wire Wire Line
	5200 4050 5200 3950
Connection ~ 5200 3950
Wire Wire Line
	5650 3650 5200 3650
Connection ~ 5200 3650
Wire Wire Line
	5200 3650 5200 3750
NoConn ~ 5650 3350
NoConn ~ 5650 3450
NoConn ~ 5000 3850
NoConn ~ 5000 2950
Wire Wire Line
	5000 3250 5650 3250
$Comp
L SJ1-3515-SMT:SJ1-3515-SMT JRight?
U 1 1 60053950
P 4300 3950
AR Path="/60053950" Ref="JRight?"  Part="1" 
AR Path="/60051872/60053950" Ref="JRight1"  Part="1" 
F 0 "JRight1" H 4407 4417 50  0000 C CNN
F 1 "SJ1-3515-SMT" H 4407 4326 50  0000 C CNN
F 2 "lib:CUI_SJ1-3515-SMT" H 4300 3950 50  0001 L BNN
F 3 "" H 4300 3950 50  0001 L BNN
F 4 "Manufacturer recommendation" H 4300 3950 50  0001 L BNN "STANDARD"
F 5 "CUI" H 4300 3950 50  0001 L BNN "MANUFACTURER"
F 6 "1.05" H 4300 3950 50  0001 L BNN "PARTREV"
	1    4300 3950
	1    0    0    -1  
$EndComp
Wire Wire Line
	5000 4150 5500 4150
Wire Wire Line
	5500 4150 5500 3550
Wire Wire Line
	5500 3550 5650 3550
$Comp
L power:GND #PWR?
U 1 1 60053959
P 5400 2850
AR Path="/60053959" Ref="#PWR?"  Part="1" 
AR Path="/60051872/60053959" Ref="#PWR0101"  Part="1" 
F 0 "#PWR0101" H 5400 2600 50  0001 C CNN
F 1 "GND" H 5405 2677 50  0000 C CNN
F 2 "" H 5400 2850 50  0001 C CNN
F 3 "" H 5400 2850 50  0001 C CNN
	1    5400 2850
	1    0    0    -1  
$EndComp
Wire Wire Line
	5400 2850 5200 2850
Connection ~ 5200 2850
$EndSCHEMATC
