EESchema Schematic File Version 4
EELAYER 30 0
EELAYER END
$Descr A4 11693 8268
encoding utf-8
Sheet 2 5
Title ""
Date ""
Rev ""
Comp ""
Comment1 ""
Comment2 ""
Comment3 ""
Comment4 ""
$EndDescr
$Comp
L SJ1-3515-SMT:SJ1-3515-SMT JIn1
U 1 1 5FE153C3
P 1100 1050
F 0 "JIn1" H 1207 1517 50  0000 C CNN
F 1 "SJ1-3515-SMT" H 1207 1426 50  0000 C CNN
F 2 "lib:CUI_SJ1-3515-SMT" H 1100 1050 50  0001 L BNN
F 3 "" H 1100 1050 50  0001 L BNN
F 4 "Manufacturer recommendation" H 1100 1050 50  0001 L BNN "STANDARD"
F 5 "CUI" H 1100 1050 50  0001 L BNN "MANUFACTURER"
F 6 "1.05" H 1100 1050 50  0001 L BNN "PARTREV"
	1    1100 1050
	1    0    0    -1  
$EndComp
$Comp
L SJ1-3515-SMT:SJ1-3515-SMT JOut1
U 1 1 5FE16A41
P 3800 1050
F 0 "JOut1" H 3270 1004 50  0000 R CNN
F 1 "SJ1-3515-SMT" H 3270 1095 50  0000 R CNN
F 2 "lib:CUI_SJ1-3515-SMT" H 3800 1050 50  0001 L BNN
F 3 "" H 3800 1050 50  0001 L BNN
F 4 "Manufacturer recommendation" H 3800 1050 50  0001 L BNN "STANDARD"
F 5 "CUI" H 3800 1050 50  0001 L BNN "MANUFACTURER"
F 6 "1.05" H 3800 1050 50  0001 L BNN "PARTREV"
	1    3800 1050
	-1   0    0    1   
$EndComp
$Comp
L power:GND #PWR0102
U 1 1 5FE2C975
P 1900 1350
F 0 "#PWR0102" H 1900 1100 50  0001 C CNN
F 1 "GND" H 1905 1177 50  0000 C CNN
F 2 "" H 1900 1350 50  0001 C CNN
F 3 "" H 1900 1350 50  0001 C CNN
	1    1900 1350
	1    0    0    -1  
$EndComp
$Comp
L power:GND #PWR0103
U 1 1 5FE2CE1D
P 3100 1400
F 0 "#PWR0103" H 3100 1150 50  0001 C CNN
F 1 "GND" H 3105 1227 50  0000 C CNN
F 2 "" H 3100 1400 50  0001 C CNN
F 3 "" H 3100 1400 50  0001 C CNN
	1    3100 1400
	1    0    0    -1  
$EndComp
Wire Wire Line
	3100 1250 3100 1400
$Comp
L Jumper:Jumper_3_Open JP1
U 1 1 5FE42D12
P 1450 2850
F 0 "JP1" V 1404 2937 50  0000 L CNN
F 1 "Jumper_3_Open" V 1495 2937 50  0000 L CNN
F 2 "Connector_PinHeader_2.54mm:PinHeader_1x03_P2.54mm_Vertical" H 1450 2850 50  0001 C CNN
F 3 "~" H 1450 2850 50  0001 C CNN
	1    1450 2850
	0    1    1    0   
$EndComp
Wire Wire Line
	6250 1400 6250 1500
$Comp
L power:+9V #PWR0104
U 1 1 5FE4E976
P 5550 1200
F 0 "#PWR0104" H 5550 1050 50  0001 C CNN
F 1 "+9V" H 5565 1373 50  0000 C CNN
F 2 "" H 5550 1200 50  0001 C CNN
F 3 "" H 5550 1200 50  0001 C CNN
	1    5550 1200
	1    0    0    -1  
$EndComp
$Comp
L power:-9V #PWR0105
U 1 1 5FE4FF3F
P 9200 1200
F 0 "#PWR0105" H 9200 1075 50  0001 C CNN
F 1 "-9V" H 9215 1373 50  0000 C CNN
F 2 "" H 9200 1200 50  0001 C CNN
F 3 "" H 9200 1200 50  0001 C CNN
	1    9200 1200
	1    0    0    -1  
$EndComp
Wire Wire Line
	8650 1200 9200 1200
NoConn ~ 3100 950 
NoConn ~ 3100 1050
$Comp
L Connector:Conn_01x03_Male J1
U 1 1 5FE5D61F
P 1050 5850
F 0 "J1" H 1158 6131 50  0000 C CNN
F 1 "Conn_01x03_Male" H 1158 6040 50  0000 C CNN
F 2 "Connector_Wire:SolderWire-0.1sqmm_1x03_P3.6mm_D0.4mm_OD1mm_Relief" H 1050 5850 50  0001 C CNN
F 3 "~" H 1050 5850 50  0001 C CNN
	1    1050 5850
	1    0    0    -1  
$EndComp
$Comp
L power:GND #PWR0106
U 1 1 5FE5FF34
P 3000 5850
F 0 "#PWR0106" H 3000 5600 50  0001 C CNN
F 1 "GND" H 3005 5677 50  0000 C CNN
F 2 "" H 3000 5850 50  0001 C CNN
F 3 "" H 3000 5850 50  0001 C CNN
	1    3000 5850
	1    0    0    -1  
$EndComp
$Comp
L power:-9V #PWR0107
U 1 1 5FE607C9
P 3000 5500
F 0 "#PWR0107" H 3000 5375 50  0001 C CNN
F 1 "-9V" H 3015 5673 50  0000 C CNN
F 2 "" H 3000 5500 50  0001 C CNN
F 3 "" H 3000 5500 50  0001 C CNN
	1    3000 5500
	1    0    0    -1  
$EndComp
$Comp
L power:+9V #PWR0108
U 1 1 5FE614CE
P 3200 6200
F 0 "#PWR0108" H 3200 6050 50  0001 C CNN
F 1 "+9V" H 3215 6373 50  0000 C CNN
F 2 "" H 3200 6200 50  0001 C CNN
F 3 "" H 3200 6200 50  0001 C CNN
	1    3200 6200
	1    0    0    -1  
$EndComp
$Comp
L Device:C C1
U 1 1 5FE01440
P 3050 2700
F 0 "C1" V 2798 2700 50  0000 C CNN
F 1 "100n" V 2889 2700 50  0000 C CNN
F 2 "Capacitor_SMD:C_1206_3216Metric" H 3088 2550 50  0001 C CNN
F 3 "~" H 3050 2700 50  0001 C CNN
	1    3050 2700
	0    1    1    0   
$EndComp
$Comp
L Device:R R1
U 1 1 5FE028AC
P 3250 2900
F 0 "R1" H 3320 2946 50  0000 L CNN
F 1 "100k" H 3320 2855 50  0000 L CNN
F 2 "Resistor_SMD:R_1206_3216Metric" V 3180 2900 50  0001 C CNN
F 3 "~" H 3250 2900 50  0001 C CNN
	1    3250 2900
	1    0    0    -1  
$EndComp
$Comp
L power:GND #PWR0109
U 1 1 5FE03130
P 3250 3100
F 0 "#PWR0109" H 3250 2850 50  0001 C CNN
F 1 "GND" H 3255 2927 50  0000 C CNN
F 2 "" H 3250 3100 50  0001 C CNN
F 3 "" H 3250 3100 50  0001 C CNN
	1    3250 3100
	1    0    0    -1  
$EndComp
Wire Wire Line
	3250 3050 3250 3100
Wire Wire Line
	3250 2750 3250 2700
Wire Wire Line
	3250 2700 3200 2700
Wire Wire Line
	1800 1150 1900 1150
Wire Wire Line
	1900 1150 1900 950 
Wire Wire Line
	1900 950  1800 950 
Wire Wire Line
	1800 850  1900 850 
Wire Wire Line
	1900 850  1900 950 
Connection ~ 1900 950 
Wire Wire Line
	1900 1350 1900 1150
Connection ~ 1900 1150
Text Label 2100 1250 0    50   ~ 0
J_Left
Text Label 2100 1050 0    50   ~ 0
J_Right
Wire Wire Line
	1800 1050 2100 1050
Wire Wire Line
	1800 1250 2100 1250
$Comp
L Jumper:Jumper_3_Open JP2
U 1 1 5FE2CEB9
P 1450 2200
F 0 "JP2" V 1404 2287 50  0000 L CNN
F 1 "Jumper_3_Open" V 1495 2287 50  0000 L CNN
F 2 "Connector_PinHeader_2.54mm:PinHeader_1x03_P2.54mm_Vertical" H 1450 2200 50  0001 C CNN
F 3 "~" H 1450 2200 50  0001 C CNN
	1    1450 2200
	0    -1   -1   0   
$EndComp
Text Label 3400 2700 0    50   ~ 0
EIN_Left
Wire Wire Line
	3400 2700 3250 2700
Connection ~ 3250 2700
Text Label 2950 850  2    50   ~ 0
Out_Right
Text Label 2950 1150 2    50   ~ 0
Out_Left
Wire Wire Line
	3100 850  2950 850 
Wire Wire Line
	3100 1150 2950 1150
Text Label 1150 2850 2    50   ~ 0
J_Left
Wire Wire Line
	1150 2850 1300 2850
Wire Wire Line
	1450 2600 1450 2450
Text Label 1450 1850 2    50   ~ 0
Buf_Out_Left
Wire Wire Line
	1450 1950 1450 1850
Text Label 1450 3200 2    50   ~ 0
Buf_In_Left
Wire Wire Line
	1450 3200 1450 3100
Wire Wire Line
	6250 1100 6100 1100
Wire Wire Line
	6250 1200 5550 1200
Text Label 8750 1500 0    50   ~ 0
EIN_Left
Text Label 6150 1300 2    50   ~ 0
Buf_In_Right
Text Label 6200 1400 2    50   ~ 0
Buf_Out_Right
Wire Wire Line
	6250 1300 6150 1300
Wire Wire Line
	6250 1400 6200 1400
Text Label 8750 1100 0    50   ~ 0
Out_Right
Text Label 8750 1300 0    50   ~ 0
Out_Left
Text Label 8750 900  0    50   ~ 0
EIN_Right
$Comp
L Jumper:Jumper_3_Open JP4
U 1 1 5FE57ADB
P 1450 4400
F 0 "JP4" V 1404 4487 50  0000 L CNN
F 1 "Jumper_3_Open" V 1495 4487 50  0000 L CNN
F 2 "Connector_PinHeader_2.54mm:PinHeader_1x03_P2.54mm_Vertical" H 1450 4400 50  0001 C CNN
F 3 "~" H 1450 4400 50  0001 C CNN
	1    1450 4400
	0    1    1    0   
$EndComp
$Comp
L Device:C C2
U 1 1 5FE57AE1
P 3050 3500
F 0 "C2" V 2798 3500 50  0000 C CNN
F 1 "100n" V 2889 3500 50  0000 C CNN
F 2 "Capacitor_SMD:C_1206_3216Metric" H 3088 3350 50  0001 C CNN
F 3 "~" H 3050 3500 50  0001 C CNN
	1    3050 3500
	0    1    1    0   
$EndComp
$Comp
L Device:R R2
U 1 1 5FE57AE7
P 3250 3700
F 0 "R2" H 3320 3746 50  0000 L CNN
F 1 "100k" H 3320 3655 50  0000 L CNN
F 2 "Resistor_SMD:R_1206_3216Metric" V 3180 3700 50  0001 C CNN
F 3 "~" H 3250 3700 50  0001 C CNN
	1    3250 3700
	1    0    0    -1  
$EndComp
$Comp
L power:GND #PWR0110
U 1 1 5FE57AED
P 3250 3900
F 0 "#PWR0110" H 3250 3650 50  0001 C CNN
F 1 "GND" H 3255 3727 50  0000 C CNN
F 2 "" H 3250 3900 50  0001 C CNN
F 3 "" H 3250 3900 50  0001 C CNN
	1    3250 3900
	1    0    0    -1  
$EndComp
Wire Wire Line
	3250 3850 3250 3900
Wire Wire Line
	3250 3550 3250 3500
Wire Wire Line
	3250 3500 3200 3500
$Comp
L Jumper:Jumper_3_Open JP3
U 1 1 5FE57AF6
P 1450 3750
F 0 "JP3" V 1404 3837 50  0000 L CNN
F 1 "Jumper_3_Open" V 1495 3837 50  0000 L CNN
F 2 "Connector_PinHeader_2.54mm:PinHeader_1x03_P2.54mm_Vertical" H 1450 3750 50  0001 C CNN
F 3 "~" H 1450 3750 50  0001 C CNN
	1    1450 3750
	0    -1   -1   0   
$EndComp
Text Label 3400 3500 0    50   ~ 0
EIN_Right
Wire Wire Line
	3400 3500 3250 3500
Connection ~ 3250 3500
Text Label 1150 4400 2    50   ~ 0
J_Right
Wire Wire Line
	1150 4400 1300 4400
Wire Wire Line
	1450 4150 1450 4000
Text Label 1450 3400 2    50   ~ 0
Buf_Out_Right
Wire Wire Line
	1450 3500 1450 3400
Text Label 1450 4750 2    50   ~ 0
Buf_In_Right
Wire Wire Line
	1450 4750 1450 4650
Text Label 8750 1400 0    50   ~ 0
EFB_Left
Text Label 8750 1000 0    50   ~ 0
EFB_Right
$Comp
L Device:R R3
U 1 1 5FE65748
P 5650 2150
F 0 "R3" H 5720 2196 50  0000 L CNN
F 1 "10k" H 5720 2105 50  0000 L CNN
F 2 "Resistor_SMD:R_1206_3216Metric" V 5580 2150 50  0001 C CNN
F 3 "~" H 5650 2150 50  0001 C CNN
	1    5650 2150
	1    0    0    -1  
$EndComp
$Comp
L Device:R R4
U 1 1 5FE66416
P 5650 2550
F 0 "R4" H 5720 2596 50  0000 L CNN
F 1 "1k" H 5720 2505 50  0000 L CNN
F 2 "Resistor_SMD:R_1206_3216Metric" V 5580 2550 50  0001 C CNN
F 3 "~" H 5650 2550 50  0001 C CNN
	1    5650 2550
	1    0    0    -1  
$EndComp
$Comp
L power:GND #PWR0111
U 1 1 5FE6732C
P 5650 2800
F 0 "#PWR0111" H 5650 2550 50  0001 C CNN
F 1 "GND" H 5655 2627 50  0000 C CNN
F 2 "" H 5650 2800 50  0001 C CNN
F 3 "" H 5650 2800 50  0001 C CNN
	1    5650 2800
	1    0    0    -1  
$EndComp
Wire Wire Line
	5650 2300 5650 2350
Wire Wire Line
	5650 2700 5650 2800
Text Label 5650 1900 0    50   ~ 0
Out_Left
Text Label 5750 2350 0    50   ~ 0
EFB_Left
Wire Wire Line
	5650 2000 5650 1900
Wire Wire Line
	5750 2350 5650 2350
Connection ~ 5650 2350
Wire Wire Line
	5650 2350 5650 2400
$Comp
L Device:R R5
U 1 1 5FE7057D
P 5650 3450
F 0 "R5" H 5720 3496 50  0000 L CNN
F 1 "10k" H 5720 3405 50  0000 L CNN
F 2 "Resistor_SMD:R_1206_3216Metric" V 5580 3450 50  0001 C CNN
F 3 "~" H 5650 3450 50  0001 C CNN
	1    5650 3450
	1    0    0    -1  
$EndComp
$Comp
L Device:R R6
U 1 1 5FE70583
P 5650 3850
F 0 "R6" H 5720 3896 50  0000 L CNN
F 1 "1k" H 5720 3805 50  0000 L CNN
F 2 "Resistor_SMD:R_1206_3216Metric" V 5580 3850 50  0001 C CNN
F 3 "~" H 5650 3850 50  0001 C CNN
	1    5650 3850
	1    0    0    -1  
$EndComp
$Comp
L power:GND #PWR0112
U 1 1 5FE70589
P 5650 4100
F 0 "#PWR0112" H 5650 3850 50  0001 C CNN
F 1 "GND" H 5655 3927 50  0000 C CNN
F 2 "" H 5650 4100 50  0001 C CNN
F 3 "" H 5650 4100 50  0001 C CNN
	1    5650 4100
	1    0    0    -1  
$EndComp
Wire Wire Line
	5650 3600 5650 3650
Wire Wire Line
	5650 4000 5650 4100
Text Label 5650 3200 0    50   ~ 0
Out_Right
Text Label 5750 3650 0    50   ~ 0
EFB_Right
Wire Wire Line
	5650 3300 5650 3200
Wire Wire Line
	5750 3650 5650 3650
Connection ~ 5650 3650
Wire Wire Line
	5650 3650 5650 3700
$Comp
L Device:R_POT_Dual RV1
U 1 1 5FE83CEC
P 2550 3250
F 0 "RV1" V 2504 3063 50  0000 R CNN
F 1 "10K" V 2595 3063 50  0000 R CNN
F 2 "Connector_Wire:SolderWire-0.1sqmm_1x06_P3.6mm_D0.4mm_OD1mm_Relief" H 2800 3175 50  0001 C CNN
F 3 "~" H 2800 3175 50  0001 C CNN
	1    2550 3250
	0    1    1    0   
$EndComp
$Comp
L power:GND #PWR0113
U 1 1 5FE8CE0A
P 2700 3150
F 0 "#PWR0113" H 2700 2900 50  0001 C CNN
F 1 "GND" H 2705 2977 50  0000 C CNN
F 2 "" H 2700 3150 50  0001 C CNN
F 3 "" H 2700 3150 50  0001 C CNN
	1    2700 3150
	1    0    0    -1  
$EndComp
$Comp
L power:GND #PWR0114
U 1 1 5FE8E5D9
P 2450 3750
F 0 "#PWR0114" H 2450 3500 50  0001 C CNN
F 1 "GND" H 2455 3577 50  0000 C CNN
F 2 "" H 2450 3750 50  0001 C CNN
F 3 "" H 2450 3750 50  0001 C CNN
	1    2450 3750
	1    0    0    -1  
$EndComp
Wire Wire Line
	2700 3150 2450 3150
Wire Wire Line
	2450 3750 2450 3650
Wire Wire Line
	1600 2200 2450 2200
Wire Wire Line
	2450 2200 2450 2850
Wire Wire Line
	1600 3750 1900 3750
Wire Wire Line
	1900 3750 1900 3350
Wire Wire Line
	1900 3350 2450 3350
Wire Wire Line
	2650 3000 2650 2700
Wire Wire Line
	2650 2700 2900 2700
Wire Wire Line
	2650 3500 2900 3500
$Comp
L Device:C C4
U 1 1 5FEB09EA
P 2600 5650
F 0 "C4" H 2715 5696 50  0000 L CNN
F 1 "100n" H 2715 5605 50  0000 L CNN
F 2 "Capacitor_SMD:C_1206_3216Metric" H 2638 5500 50  0001 C CNN
F 3 "~" H 2600 5650 50  0001 C CNN
	1    2600 5650
	1    0    0    -1  
$EndComp
$Comp
L Device:CP C3
U 1 1 5FEB2174
P 2200 5650
F 0 "C3" H 2318 5696 50  0000 L CNN
F 1 "4.7u" H 2318 5605 50  0000 L CNN
F 2 "Capacitor_SMD:CP_Elec_4x4.5" H 2238 5500 50  0001 C CNN
F 3 "~" H 2200 5650 50  0001 C CNN
	1    2200 5650
	1    0    0    -1  
$EndComp
$Comp
L Device:C C6
U 1 1 5FEC463F
P 2600 6050
F 0 "C6" H 2715 6096 50  0000 L CNN
F 1 "100n" H 2715 6005 50  0000 L CNN
F 2 "Capacitor_SMD:C_1206_3216Metric" H 2638 5900 50  0001 C CNN
F 3 "~" H 2600 6050 50  0001 C CNN
	1    2600 6050
	1    0    0    -1  
$EndComp
$Comp
L Device:CP C5
U 1 1 5FEC4645
P 2200 6050
F 0 "C5" H 2318 6096 50  0000 L CNN
F 1 "4.7u" H 2318 6005 50  0000 L CNN
F 2 "Capacitor_SMD:CP_Elec_4x4.5" H 2238 5900 50  0001 C CNN
F 3 "~" H 2200 6050 50  0001 C CNN
	1    2200 6050
	1    0    0    -1  
$EndComp
Wire Wire Line
	2200 5500 2600 5500
Wire Wire Line
	2200 5800 2200 5850
Connection ~ 2200 5850
Wire Wire Line
	2200 5850 2600 5850
Wire Wire Line
	2200 5900 2200 5850
Wire Wire Line
	2600 5800 2600 5850
Connection ~ 2600 5850
Wire Wire Line
	2600 5850 3000 5850
Wire Wire Line
	2600 5900 2600 5850
Wire Wire Line
	2200 6200 2600 6200
Wire Wire Line
	1900 5750 1900 5500
Wire Wire Line
	1900 5500 2200 5500
Connection ~ 2200 5500
Wire Wire Line
	1900 5950 1900 6200
Wire Wire Line
	1900 6200 2200 6200
Connection ~ 2200 6200
Wire Wire Line
	1250 5850 2200 5850
Wire Wire Line
	1250 5750 1900 5750
Wire Wire Line
	1250 5950 1900 5950
Wire Wire Line
	8650 900  8750 900 
Wire Wire Line
	8650 1000 8750 1000
Wire Wire Line
	8650 1100 8750 1100
Wire Wire Line
	8650 1300 8750 1300
Wire Wire Line
	8650 1400 8750 1400
Wire Wire Line
	6250 1000 6150 1000
Text Label 6150 1000 2    50   ~ 0
Buf_Out_Left
Text Label 6100 1100 2    50   ~ 0
Buf_In_Left
Wire Wire Line
	6250 1000 6250 900 
$Comp
L 2020-12-20_03-38-09:lme49740na_NOPB U1
U 1 1 5FE14879
P 6250 1500
F 0 "U1" H 7450 1887 60  0000 C CNN
F 1 "lme49740na_NOPB" H 7450 1781 60  0000 C CNN
F 2 "Package_DIP:DIP-14_W7.62mm_LongPads" H 7450 1740 60  0001 C CNN
F 3 "" H 6250 1500 60  0000 C CNN
	1    6250 1500
	1    0    0    1   
$EndComp
Connection ~ 6250 1000
Connection ~ 6250 1400
Wire Wire Line
	2600 6200 3200 6200
Connection ~ 2600 6200
Wire Wire Line
	2600 5500 3000 5500
Connection ~ 2600 5500
$EndSCHEMATC
