EESchema Schematic File Version 4
EELAYER 30 0
EELAYER END
$Descr A4 11693 8268
encoding utf-8
Sheet 5 5
Title ""
Date ""
Rev ""
Comp ""
Comment1 ""
Comment2 ""
Comment3 ""
Comment4 ""
$EndDescr
$Comp
L TPA6120A2DWPR:TPA6120A2DWPR U?
U 1 1 6005B7F6
P 7600 3500
F 0 "U?" H 7600 5167 50  0000 C CNN
F 1 "TPA6120A2DWPR" H 7600 5076 50  0000 C CNN
F 2 "IC_TPA6120A2DWPR" H 7600 3500 50  0001 L BNN
F 3 "" H 7600 3500 50  0001 L BNN
F 4 "Manufacturer Recommendations" H 7600 3500 50  0001 L BNN "STANDARD"
F 5 "2.65mm" H 7600 3500 50  0001 L BNN "MAXIMUM_PACKAGE_HEIGHT"
F 6 "Texas Instruments" H 7600 3500 50  0001 L BNN "MANUFACTURER"
F 7 "B" H 7600 3500 50  0001 L BNN "PARTREV"
	1    7600 3500
	1    0    0    -1  
$EndComp
$Comp
L Connector:Conn_01x03_Male J?
U 1 1 6005D77D
P 1500 1300
F 0 "J?" H 1608 1581 50  0000 C CNN
F 1 "Conn_01x03_Male" H 1608 1490 50  0000 C CNN
F 2 "" H 1500 1300 50  0001 C CNN
F 3 "~" H 1500 1300 50  0001 C CNN
	1    1500 1300
	1    0    0    -1  
$EndComp
$Comp
L Device:C C1
U 1 1 6005FF51
P 2550 1100
F 0 "C1" H 2665 1146 50  0000 L CNN
F 1 "100n" H 2665 1055 50  0000 L CNN
F 2 "Capacitor_SMD:C_1206_3216Metric" H 2588 950 50  0001 C CNN
F 3 "~" H 2550 1100 50  0001 C CNN
	1    2550 1100
	1    0    0    -1  
$EndComp
$Comp
L Device:C C3
U 1 1 600608D5
P 2550 1500
F 0 "C3" H 2665 1546 50  0000 L CNN
F 1 "100n" H 2665 1455 50  0000 L CNN
F 2 "Capacitor_SMD:C_1206_3216Metric" H 2588 1350 50  0001 C CNN
F 3 "~" H 2550 1500 50  0001 C CNN
	1    2550 1500
	1    0    0    -1  
$EndComp
$Comp
L Device:C C2
U 1 1 60060C6E
P 3000 1100
F 0 "C2" H 3115 1146 50  0000 L CNN
F 1 "100n" H 3115 1055 50  0000 L CNN
F 2 "Capacitor_SMD:C_1206_3216Metric" H 3038 950 50  0001 C CNN
F 3 "~" H 3000 1100 50  0001 C CNN
	1    3000 1100
	1    0    0    -1  
$EndComp
$Comp
L Device:C C4
U 1 1 60060F06
P 3000 1500
F 0 "C4" H 3115 1546 50  0000 L CNN
F 1 "100n" H 3115 1455 50  0000 L CNN
F 2 "Capacitor_SMD:C_1206_3216Metric" H 3038 1350 50  0001 C CNN
F 3 "~" H 3000 1500 50  0001 C CNN
	1    3000 1500
	1    0    0    -1  
$EndComp
$Comp
L Device:CP C5
U 1 1 60065879
P 2150 1100
F 0 "C5" H 2268 1146 50  0000 L CNN
F 1 "4.7u" H 2268 1055 50  0000 L CNN
F 2 "Capacitor_SMD:CP_Elec_4x4.5" H 2188 950 50  0001 C CNN
F 3 "~" H 2150 1100 50  0001 C CNN
	1    2150 1100
	1    0    0    -1  
$EndComp
$Comp
L Device:CP C6
U 1 1 60066427
P 2150 1500
F 0 "C6" H 2268 1546 50  0000 L CNN
F 1 "4.7u" H 2268 1455 50  0000 L CNN
F 2 "Capacitor_SMD:CP_Elec_4x4.5" H 2188 1350 50  0001 C CNN
F 3 "~" H 2150 1500 50  0001 C CNN
	1    2150 1500
	1    0    0    -1  
$EndComp
Wire Wire Line
	1950 950  2150 950 
Connection ~ 2150 950 
Wire Wire Line
	2150 950  2550 950 
Connection ~ 2550 950 
Wire Wire Line
	2550 950  3000 950 
$Comp
L power:GND #PWR?
U 1 1 6006774D
P 3700 1300
F 0 "#PWR?" H 3700 1050 50  0001 C CNN
F 1 "GND" H 3705 1127 50  0000 C CNN
F 2 "" H 3700 1300 50  0001 C CNN
F 3 "" H 3700 1300 50  0001 C CNN
	1    3700 1300
	1    0    0    -1  
$EndComp
Wire Wire Line
	1700 1300 2150 1300
Wire Wire Line
	2150 1250 2150 1300
Connection ~ 2150 1300
Wire Wire Line
	2150 1300 2550 1300
Wire Wire Line
	2150 1300 2150 1350
Wire Wire Line
	2550 1250 2550 1300
Connection ~ 2550 1300
Wire Wire Line
	2550 1300 3000 1300
Wire Wire Line
	2550 1350 2550 1300
Wire Wire Line
	3000 1250 3000 1300
Connection ~ 3000 1300
Wire Wire Line
	3000 1350 3000 1300
Wire Wire Line
	1950 950  1950 1200
Wire Wire Line
	1950 1200 1700 1200
Wire Wire Line
	2150 1650 2550 1650
Connection ~ 2550 1650
Wire Wire Line
	2550 1650 3000 1650
Wire Wire Line
	1700 1400 1950 1400
Wire Wire Line
	1950 1400 1950 1650
Wire Wire Line
	1950 1650 2150 1650
Connection ~ 2150 1650
$Comp
L power:+15V #PWR?
U 1 1 60069A5F
P 3450 950
F 0 "#PWR?" H 3450 800 50  0001 C CNN
F 1 "+15V" H 3465 1123 50  0000 C CNN
F 2 "" H 3450 950 50  0001 C CNN
F 3 "" H 3450 950 50  0001 C CNN
	1    3450 950 
	1    0    0    -1  
$EndComp
$Comp
L power:-15V #PWR?
U 1 1 6006A6EA
P 3450 1650
F 0 "#PWR?" H 3450 1750 50  0001 C CNN
F 1 "-15V" H 3465 1823 50  0000 C CNN
F 2 "" H 3450 1650 50  0001 C CNN
F 3 "" H 3450 1650 50  0001 C CNN
	1    3450 1650
	1    0    0    -1  
$EndComp
Wire Wire Line
	3450 950  3000 950 
Connection ~ 3000 950 
Wire Wire Line
	3000 1650 3450 1650
Connection ~ 3000 1650
Wire Wire Line
	3000 1300 3700 1300
$Comp
L power:+15V #PWR?
U 1 1 6006D4A7
P 6700 2200
F 0 "#PWR?" H 6700 2050 50  0001 C CNN
F 1 "+15V" H 6715 2373 50  0000 C CNN
F 2 "" H 6700 2200 50  0001 C CNN
F 3 "" H 6700 2200 50  0001 C CNN
	1    6700 2200
	1    0    0    -1  
$EndComp
$Comp
L power:+15V #PWR?
U 1 1 6006E50B
P 6700 3000
F 0 "#PWR?" H 6700 2850 50  0001 C CNN
F 1 "+15V" H 6715 3173 50  0000 C CNN
F 2 "" H 6700 3000 50  0001 C CNN
F 3 "" H 6700 3000 50  0001 C CNN
	1    6700 3000
	1    0    0    -1  
$EndComp
$Comp
L power:-15V #PWR?
U 1 1 6006F8BC
P 6500 2800
F 0 "#PWR?" H 6500 2900 50  0001 C CNN
F 1 "-15V" H 6515 2973 50  0000 C CNN
F 2 "" H 6500 2800 50  0001 C CNN
F 3 "" H 6500 2800 50  0001 C CNN
	1    6500 2800
	1    0    0    -1  
$EndComp
$Comp
L power:-15V #PWR?
U 1 1 60070365
P 6700 3600
F 0 "#PWR?" H 6700 3700 50  0001 C CNN
F 1 "-15V" H 6715 3773 50  0000 C CNN
F 2 "" H 6700 3600 50  0001 C CNN
F 3 "" H 6700 3600 50  0001 C CNN
	1    6700 3600
	1    0    0    -1  
$EndComp
Wire Wire Line
	6900 2200 6700 2200
Wire Wire Line
	6900 2800 6500 2800
Wire Wire Line
	6900 3000 6700 3000
Wire Wire Line
	6900 3600 6700 3600
$EndSCHEMATC
