(module N14A_TEX (layer F.Cu)
  (fp_text reference REF** (at 3.81 7.62) (layer F.SilkS)
    (effects (font (size 1 1) (thickness .15)))
  )
  (fp_text value N14A_TEX (at 3.81 7.62) (layer F.SilkS)
    (effects (font (size 1 1) (thickness .15)))
  )
  (fp_text user "Copyright 2016 Accelerated Designs. All rights reserved." (at 0 0) (layer Cmts.User)
    (effects (font (size .127 .127) (thickness .002)))
  )
  (fp_text user "*" (at 0 -1.524) (layer F.SilkS)
    (effects (font (size 1 1) (thickness .15)))
  )
  (fp_text user "*" (at .762 0) (layer F.Fab)
    (effects (font (size 1 1) (thickness .15)))
  )
  (fp_text user "0.1in/2.54mm" (at -3.048 1.27) (layer Dwgs.User)
    (effects (font (size 1 1) (thickness .15)))
  )
  (fp_text user "0.06in/1.524mm" (at 10.668 0) (layer Dwgs.User)
    (effects (font (size 1 1) (thickness .15)))
  )
  (fp_text user "0.3in/7.62mm" (at 3.81 -4.3815) (layer Dwgs.User)
    (effects (font (size 1 1) (thickness .15)))
  )
  (fp_text user "0.06in/1.524mm" (at 0 19.6215) (layer Dwgs.User)
    (effects (font (size 1 1) (thickness .15)))
  )
  (fp_text user "*" (at .762 0) (layer F.Fab)
    (effects (font (size 1 1) (thickness .15)))
  )
  (fp_text user "*" (at 0 -1.524) (layer F.SilkS)
    (effects (font (size 1 1) (thickness .15)))
  )
  (fp_line (start .508 .4572) (end .508 -.4572) (layer F.Fab) (width .1524))
  (fp_line (start .508 -.4572) (end -.4572 -.4572) (layer F.Fab) (width .1524))
  (fp_line (start -.4572 -.4572) (end -.4572 .4572) (layer F.Fab) (width .1524))
  (fp_line (start -.4572 .4572) (end .508 .4572) (layer F.Fab) (width .1524))
  (fp_line (start .508 2.9972) (end .508 2.0828) (layer F.Fab) (width .1524))
  (fp_line (start .508 2.0828) (end -.4572 2.0828) (layer F.Fab) (width .1524))
  (fp_line (start -.4572 2.0828) (end -.4572 2.9972) (layer F.Fab) (width .1524))
  (fp_line (start -.4572 2.9972) (end .508 2.9972) (layer F.Fab) (width .1524))
  (fp_line (start .508 5.5372) (end .508 4.6228) (layer F.Fab) (width .1524))
  (fp_line (start .508 4.6228) (end -.4572 4.6228) (layer F.Fab) (width .1524))
  (fp_line (start -.4572 4.6228) (end -.4572 5.5372) (layer F.Fab) (width .1524))
  (fp_line (start -.4572 5.5372) (end .508 5.5372) (layer F.Fab) (width .1524))
  (fp_line (start .508 8.0772) (end .508 7.1628) (layer F.Fab) (width .1524))
  (fp_line (start .508 7.1628) (end -.4572 7.1628) (layer F.Fab) (width .1524))
  (fp_line (start -.4572 7.1628) (end -.4572 8.0772) (layer F.Fab) (width .1524))
  (fp_line (start -.4572 8.0772) (end .508 8.0772) (layer F.Fab) (width .1524))
  (fp_line (start .508 10.6172) (end .508 9.7028) (layer F.Fab) (width .1524))
  (fp_line (start .508 9.7028) (end -.4572 9.7028) (layer F.Fab) (width .1524))
  (fp_line (start -.4572 9.7028) (end -.4572 10.6172) (layer F.Fab) (width .1524))
  (fp_line (start -.4572 10.6172) (end .508 10.6172) (layer F.Fab) (width .1524))
  (fp_line (start .508 13.1572) (end .508 12.2428) (layer F.Fab) (width .1524))
  (fp_line (start .508 12.2428) (end -.4572 12.2428) (layer F.Fab) (width .1524))
  (fp_line (start -.4572 12.2428) (end -.4572 13.1572) (layer F.Fab) (width .1524))
  (fp_line (start -.4572 13.1572) (end .508 13.1572) (layer F.Fab) (width .1524))
  (fp_line (start .508 15.6972) (end .508 14.7828) (layer F.Fab) (width .1524))
  (fp_line (start .508 14.7828) (end -.4572 14.7828) (layer F.Fab) (width .1524))
  (fp_line (start -.4572 14.7828) (end -.4572 15.6972) (layer F.Fab) (width .1524))
  (fp_line (start -.4572 15.6972) (end .508 15.6972) (layer F.Fab) (width .1524))
  (fp_line (start 7.112 14.7828) (end 7.112 15.6972) (layer F.Fab) (width .1524))
  (fp_line (start 7.112 15.6972) (end 8.0772 15.6972) (layer F.Fab) (width .1524))
  (fp_line (start 8.0772 15.6972) (end 8.0772 14.7828) (layer F.Fab) (width .1524))
  (fp_line (start 8.0772 14.7828) (end 7.112 14.7828) (layer F.Fab) (width .1524))
  (fp_line (start 7.112 12.2428) (end 7.112 13.1572) (layer F.Fab) (width .1524))
  (fp_line (start 7.112 13.1572) (end 8.0772 13.1572) (layer F.Fab) (width .1524))
  (fp_line (start 8.0772 13.1572) (end 8.0772 12.2428) (layer F.Fab) (width .1524))
  (fp_line (start 8.0772 12.2428) (end 7.112 12.2428) (layer F.Fab) (width .1524))
  (fp_line (start 7.112 9.7028) (end 7.112 10.6172) (layer F.Fab) (width .1524))
  (fp_line (start 7.112 10.6172) (end 8.0772 10.6172) (layer F.Fab) (width .1524))
  (fp_line (start 8.0772 10.6172) (end 8.0772 9.7028) (layer F.Fab) (width .1524))
  (fp_line (start 8.0772 9.7028) (end 7.112 9.7028) (layer F.Fab) (width .1524))
  (fp_line (start 7.112 7.1628) (end 7.112 8.0772) (layer F.Fab) (width .1524))
  (fp_line (start 7.112 8.0772) (end 8.0772 8.0772) (layer F.Fab) (width .1524))
  (fp_line (start 8.0772 8.0772) (end 8.0772 7.1628) (layer F.Fab) (width .1524))
  (fp_line (start 8.0772 7.1628) (end 7.112 7.1628) (layer F.Fab) (width .1524))
  (fp_line (start 7.112 4.6228) (end 7.112 5.5372) (layer F.Fab) (width .1524))
  (fp_line (start 7.112 5.5372) (end 8.0772 5.5372) (layer F.Fab) (width .1524))
  (fp_line (start 8.0772 5.5372) (end 8.0772 4.6228) (layer F.Fab) (width .1524))
  (fp_line (start 8.0772 4.6228) (end 7.112 4.6228) (layer F.Fab) (width .1524))
  (fp_line (start 7.112 2.0828) (end 7.112 2.9972) (layer F.Fab) (width .1524))
  (fp_line (start 7.112 2.9972) (end 8.0772 2.9972) (layer F.Fab) (width .1524))
  (fp_line (start 8.0772 2.9972) (end 8.0772 2.0828) (layer F.Fab) (width .1524))
  (fp_line (start 8.0772 2.0828) (end 7.112 2.0828) (layer F.Fab) (width .1524))
  (fp_line (start 7.112 -.4572) (end 7.112 .4572) (layer F.Fab) (width .1524))
  (fp_line (start 7.112 .4572) (end 8.0772 .4572) (layer F.Fab) (width .1524))
  (fp_line (start 8.0772 .4572) (end 8.0772 -.4572) (layer F.Fab) (width .1524))
  (fp_line (start 8.0772 -.4572) (end 7.112 -.4572) (layer F.Fab) (width .1524))
  (fp_line (start .381 17.3355) (end 7.239 17.3355) (layer F.SilkS) (width .1524))
  (fp_line (start 7.239 17.3355) (end 7.239 16.266301) (layer F.SilkS) (width .1524))
  (fp_line (start 7.239 -2.0955) (end .381 -2.0955) (layer F.SilkS) (width .1524))
  (fp_line (start .381 -2.0955) (end .381 -1.09474) (layer F.SilkS) (width .1524))
  (fp_line (start .508 17.2085) (end 7.112 17.2085) (layer F.Fab) (width .1524))
  (fp_line (start 7.112 17.2085) (end 7.112 -1.9685) (layer F.Fab) (width .1524))
  (fp_line (start 7.112 -1.9685) (end .508 -1.9685) (layer F.Fab) (width .1524))
  (fp_line (start .508 -1.9685) (end .508 17.2085) (layer F.Fab) (width .1524))
  (fp_line (start .381 1.09474) (end .381 1.513699) (layer F.SilkS) (width .1524))
  (fp_line (start .381 3.566301) (end .381 4.053699) (layer F.SilkS) (width .1524))
  (fp_line (start .381 6.106301) (end .381 6.593699) (layer F.SilkS) (width .1524))
  (fp_line (start .381 8.646301) (end .381 9.133699) (layer F.SilkS) (width .1524))
  (fp_line (start .381 11.186301) (end .381 11.673699) (layer F.SilkS) (width .1524))
  (fp_line (start .381 13.726301) (end .381 14.213699) (layer F.SilkS) (width .1524))
  (fp_line (start .381 16.266301) (end .381 17.3355) (layer F.SilkS) (width .1524))
  (fp_line (start 7.239 14.213699) (end 7.239 13.726301) (layer F.SilkS) (width .1524))
  (fp_line (start 7.239 11.673699) (end 7.239 11.186301) (layer F.SilkS) (width .1524))
  (fp_line (start 7.239 9.133699) (end 7.239 8.646301) (layer F.SilkS) (width .1524))
  (fp_line (start 7.239 6.593699) (end 7.239 6.106301) (layer F.SilkS) (width .1524))
  (fp_line (start 7.239 4.053699) (end 7.239 3.566301) (layer F.SilkS) (width .1524))
  (fp_line (start 7.239 1.513699) (end 7.239 1.026301) (layer F.SilkS) (width .1524))
  (fp_line (start 7.239 -1.026301) (end 7.239 -2.0955) (layer F.SilkS) (width .1524))
  (fp_line (start 8.636 16.256) (end 8.636 -1.016) (layer F.CrtYd) (width .1524))
  (fp_line (start 8.636 -1.016) (end 7.366 -1.016) (layer F.CrtYd) (width .1524))
  (fp_line (start 7.366 -1.016) (end 7.366 -2.2225) (layer F.CrtYd) (width .1524))
  (fp_line (start 7.366 -2.2225) (end .254 -2.2225) (layer F.CrtYd) (width .1524))
  (fp_line (start .254 -2.2225) (end .254 -1.016) (layer F.CrtYd) (width .1524))
  (fp_line (start .254 -1.016) (end -1.016 -1.016) (layer F.CrtYd) (width .1524))
  (fp_line (start -1.016 -1.016) (end -1.016 16.256) (layer F.CrtYd) (width .1524))
  (fp_line (start -1.016 16.256) (end .254 16.256) (layer F.CrtYd) (width .1524))
  (fp_line (start .254 16.256) (end .254 17.4625) (layer F.CrtYd) (width .1524))
  (fp_line (start .254 17.4625) (end 7.366 17.4625) (layer F.CrtYd) (width .1524))
  (fp_line (start 7.366 17.4625) (end 7.366 16.256) (layer F.CrtYd) (width .1524))
  (fp_line (start 7.366 16.256) (end 8.636 16.256) (layer F.CrtYd) (width .1524))
  (fp_arc (start 3.81 -1.9685) (end 4.1148 -1.9685) (angle 180)(layer F.Fab) (width .1524))
  (pad 1 thru_hole rect (at 0 0) (size 1.524 1.524) (drill .9144) (layers *.Cu *.Mask))
  (pad 2 thru_hole circle (at 0 2.54) (size 1.524 1.524) (drill .9144) (layers *.Cu *.Mask))
  (pad 3 thru_hole circle (at 0 5.08) (size 1.524 1.524) (drill .9144) (layers *.Cu *.Mask))
  (pad 4 thru_hole circle (at 0 7.62) (size 1.524 1.524) (drill .9144) (layers *.Cu *.Mask))
  (pad 5 thru_hole circle (at 0 10.16) (size 1.524 1.524) (drill .9144) (layers *.Cu *.Mask))
  (pad 6 thru_hole circle (at 0 12.7) (size 1.524 1.524) (drill .9144) (layers *.Cu *.Mask))
  (pad 7 thru_hole circle (at 0 15.24) (size 1.524 1.524) (drill .9144) (layers *.Cu *.Mask))
  (pad 8 thru_hole circle (at 7.62 15.24) (size 1.524 1.524) (drill .9144) (layers *.Cu *.Mask))
  (pad 9 thru_hole circle (at 7.62 12.7) (size 1.524 1.524) (drill .9144) (layers *.Cu *.Mask))
  (pad 10 thru_hole circle (at 7.62 10.16) (size 1.524 1.524) (drill .9144) (layers *.Cu *.Mask))
  (pad 11 thru_hole circle (at 7.62 7.62) (size 1.524 1.524) (drill .9144) (layers *.Cu *.Mask))
  (pad 12 thru_hole circle (at 7.62 5.08) (size 1.524 1.524) (drill .9144) (layers *.Cu *.Mask))
  (pad 13 thru_hole circle (at 7.62 2.54) (size 1.524 1.524) (drill .9144) (layers *.Cu *.Mask))
  (pad 14 thru_hole circle (at 7.62 0) (size 1.524 1.524) (drill .9144) (layers *.Cu *.Mask))
)
