G:\ProiectPAO\src\main\java\com\andrei\pao\controller\servlet\EmitereCardServlet.java
G:\ProiectPAO\src\main\java\com\andrei\pao\model\ValidareOpType.java
G:\ProiectPAO\src\main\java\com\andrei\pao\controller\servlet\VerificareCardServlet.java
G:\ProiectPAO\src\main\java\com\andrei\pao\controller\servlet\ValidareCardServlet.java
G:\ProiectPAO\src\main\java\com\andrei\pao\model\CardOpType.java
G:\ProiectPAO\src\main\java\com\andrei\pao\db\dao\CardCRUD.java
G:\ProiectPAO\src\main\java\com\andrei\pao\db\DatabaseConnectionFactory.java
G:\ProiectPAO\src\main\java\com\andrei\pao\db\dbo\Card.java
G:\ProiectPAO\src\main\java\com\andrei\pao\Main.java
G:\ProiectPAO\src\main\java\com\andrei\pao\db\dbo\EntityBuilder.java
G:\ProiectPAO\src\main\java\com\andrei\pao\controller\servlet\StopJettyServlet.java
G:\ProiectPAO\src\main\java\com\andrei\pao\db\dbo\Validare.java
G:\ProiectPAO\src\main\java\com\andrei\pao\db\dao\ValidatCRUD.java
G:\ProiectPAO\src\main\java\com\andrei\pao\utils\LogProvider.java
G:\ProiectPAO\src\main\java\com\andrei\pao\controller\servlet\AdministrareCardServlet.java
G:\ProiectPAO\src\main\java\com\andrei\pao\exceptions\InvalidInputException.java
G:\ProiectPAO\src\main\java\com\andrei\pao\model\CardType.java
G:\ProiectPAO\src\main\java\com\andrei\pao\utils\ServerProperties.java
