127.0.0.1 - admin [31/Mar/2023:10:05:24 +0100] "PUT /manager/text/deploy?path=%2Fjavabank&update=true HTTP/1.1" 200 65
0:0:0:0:0:0:0:1 - - [31/Mar/2023:10:05:30 +0100] "GET /javabank HTTP/1.1" 302 -
0:0:0:0:0:0:0:1 - - [31/Mar/2023:10:05:35 +0100] "GET /javabank/ HTTP/1.1" 200 1102
0:0:0:0:0:0:0:1 - - [31/Mar/2023:10:54:18 +0100] "GET / HTTP/1.1" 200 11230
0:0:0:0:0:0:0:1 - - [31/Mar/2023:10:54:20 +0100] "GET /manager/html HTTP/1.1" 401 2499
0:0:0:0:0:0:0:1 - admin [31/Mar/2023:10:54:21 +0100] "GET /manager/html HTTP/1.1" 200 23785
127.0.0.1 - - [31/Mar/2023:10:57:56 +0100] "PUT /manager/text/deploy?path=%2Fjavabank1 HTTP/1.1" 401 2499
127.0.0.1 - - [31/Mar/2023:10:57:57 +0100] "PUT /manager/text/deploy?path=%2Fjavabank1 HTTP/1.1" 401 2499
127.0.0.1 - - [31/Mar/2023:10:57:58 +0100] "PUT /manager/text/deploy?path=%2Fjavabank1 HTTP/1.1" 401 2499
127.0.0.1 - - [31/Mar/2023:10:57:59 +0100] "PUT /manager/text/deploy?path=%2Fjavabank1 HTTP/1.1" 401 2499
127.0.0.1 - - [31/Mar/2023:10:59:28 +0100] "PUT /manager/text/deploy?path=%2Fjavabank1 HTTP/1.1" 401 2499
127.0.0.1 - - [31/Mar/2023:10:59:29 +0100] "PUT /manager/text/deploy?path=%2Fjavabank1 HTTP/1.1" 401 2499
127.0.0.1 - - [31/Mar/2023:10:59:30 +0100] "PUT /manager/text/deploy?path=%2Fjavabank1 HTTP/1.1" 401 2499
127.0.0.1 - - [31/Mar/2023:10:59:31 +0100] "PUT /manager/text/deploy?path=%2Fjavabank1 HTTP/1.1" 401 2499
0:0:0:0:0:0:0:1 - - [31/Mar/2023:11:00:22 +0100] "GET / HTTP/1.1" 200 11230
0:0:0:0:0:0:0:1 - - [31/Mar/2023:11:00:24 +0100] "GET /manager/html HTTP/1.1" 401 2499
0:0:0:0:0:0:0:1 - - [31/Mar/2023:11:00:25 +0100] "GET /manager/html HTTP/1.1" 401 2499
0:0:0:0:0:0:0:1 - - [31/Mar/2023:11:00:30 +0100] "GET /manager/html HTTP/1.1" 401 2499
0:0:0:0:0:0:0:1 - - [31/Mar/2023:11:00:31 +0100] "GET /manager/html HTTP/1.1" 401 2499
0:0:0:0:0:0:0:1 - - [31/Mar/2023:11:00:34 +0100] "GET /manager/html HTTP/1.1" 401 2499
0:0:0:0:0:0:0:1 - - [31/Mar/2023:11:00:37 +0100] "GET / HTTP/1.1" 200 11230
0:0:0:0:0:0:0:1 - - [31/Mar/2023:11:00:39 +0100] "GET /manager/html HTTP/1.1" 401 2499
0:0:0:0:0:0:0:1 - - [31/Mar/2023:11:00:40 +0100] "GET /manager/html HTTP/1.1" 401 2499
0:0:0:0:0:0:0:1 - - [31/Mar/2023:11:00:41 +0100] "GET /manager/html HTTP/1.1" 401 2499
0:0:0:0:0:0:0:1 - - [31/Mar/2023:11:00:46 +0100] "GET /manager/html HTTP/1.1" 401 2499
0:0:0:0:0:0:0:1 - - [31/Mar/2023:11:00:48 +0100] "GET /manager/html HTTP/1.1" 401 2499
0:0:0:0:0:0:0:1 - - [31/Mar/2023:11:00:48 +0100] "GET /manager/html HTTP/1.1" 401 2499
0:0:0:0:0:0:0:1 - - [31/Mar/2023:11:00:48 +0100] "GET /manager/html HTTP/1.1" 401 2499
0:0:0:0:0:0:0:1 - - [31/Mar/2023:11:00:48 +0100] "GET /manager/html HTTP/1.1" 401 2499
0:0:0:0:0:0:0:1 - - [31/Mar/2023:11:00:49 +0100] "GET /manager/html HTTP/1.1" 401 2499
0:0:0:0:0:0:0:1 - - [31/Mar/2023:11:00:49 +0100] "GET /manager/html HTTP/1.1" 401 2499
0:0:0:0:0:0:0:1 - - [31/Mar/2023:11:00:49 +0100] "GET /manager/html HTTP/1.1" 401 2499
0:0:0:0:0:0:0:1 - - [31/Mar/2023:11:00:49 +0100] "GET /manager/html HTTP/1.1" 401 2499
0:0:0:0:0:0:0:1 - - [31/Mar/2023:11:02:58 +0100] "GET /manager/html HTTP/1.1" 401 2499
0:0:0:0:0:0:0:1 - - [31/Mar/2023:11:03:01 +0100] "GET / HTTP/1.1" 200 11230
0:0:0:0:0:0:0:1 - - [31/Mar/2023:11:03:02 +0100] "GET /manager/html HTTP/1.1" 401 2499
0:0:0:0:0:0:0:1 - admin [31/Mar/2023:11:03:04 +0100] "GET /manager/html HTTP/1.1" 200 21761
127.0.0.1 - admin [31/Mar/2023:11:03:30 +0100] "PUT /manager/text/deploy?path=%2Fjavabank1 HTTP/1.1" 200 66
0:0:0:0:0:0:0:1 - - [31/Mar/2023:11:03:35 +0100] "GET /javabank1 HTTP/1.1" 302 -
0:0:0:0:0:0:0:1 - - [31/Mar/2023:11:03:40 +0100] "GET /javabank1/ HTTP/1.1" 302 -
0:0:0:0:0:0:0:1 - - [31/Mar/2023:11:03:40 +0100] "GET /javabank1/customer/list HTTP/1.1" 200 1739
127.0.0.1 - admin [31/Mar/2023:11:39:56 +0100] "PUT /manager/text/deploy?path=%2Fjavabank1&update=true HTTP/1.1" 200 66
0:0:0:0:0:0:0:1 - - [31/Mar/2023:11:40:09 +0100] "GET /javabank1/customer/list HTTP/1.1" 500 1096
127.0.0.1 - admin [31/Mar/2023:11:41:53 +0100] "PUT /manager/text/deploy?path=%2Fjavabank1&update=true HTTP/1.1" 200 66
0:0:0:0:0:0:0:1 - - [31/Mar/2023:11:42:05 +0100] "GET /javabank1/customer/list HTTP/1.1" 200 1743
127.0.0.1 - admin [31/Mar/2023:12:12:20 +0100] "PUT /manager/text/deploy?path=%2Fjavabank1&update=true HTTP/1.1" 200 66
0:0:0:0:0:0:0:1 - admin [31/Mar/2023:12:12:31 +0100] "GET /manager/html HTTP/1.1" 200 23597
0:0:0:0:0:0:0:1 - - [31/Mar/2023:12:12:39 +0100] "GET /javabank1/ HTTP/1.1" 302 -
0:0:0:0:0:0:0:1 - - [31/Mar/2023:12:12:40 +0100] "GET /javabank1/customer/list HTTP/1.1" 500 1096
0:0:0:0:0:0:0:1 - - [31/Mar/2023:12:12:56 +0100] "GET /javabank1/customer/customerFile HTTP/1.1" 404 790
0:0:0:0:0:0:0:1 - - [31/Mar/2023:12:13:31 +0100] "GET /javabank1/customer/cust HTTP/1.1" 404 782
127.0.0.1 - admin [31/Mar/2023:12:14:37 +0100] "PUT /manager/text/deploy?path=%2Fjavabank1&update=true HTTP/1.1" 200 66
0:0:0:0:0:0:0:1 - - [31/Mar/2023:12:14:46 +0100] "GET /javabank1/customer/list HTTP/1.1" 500 1096
0:0:0:0:0:0:0:1 - - [31/Mar/2023:12:14:50 +0100] "GET /javabank1/customer/customerFile HTTP/1.1" 404 790
0:0:0:0:0:0:0:1 - - [31/Mar/2023:12:15:13 +0100] "GET /javabank1/customer/customerFile/1 HTTP/1.1" 404 796
127.0.0.1 - admin [31/Mar/2023:12:16:11 +0100] "PUT /manager/text/deploy?path=%2Fjavabank1&update=true HTTP/1.1" 200 66
0:0:0:0:0:0:0:1 - - [31/Mar/2023:12:16:19 +0100] "GET /javabank1/customer/customerFile HTTP/1.1" 404 790
0:0:0:0:0:0:0:1 - - [31/Mar/2023:12:16:20 +0100] "GET /javabank1/customer/customerFile/1 HTTP/1.1" 200 790
0:0:0:0:0:0:0:1 - - [31/Mar/2023:12:16:26 +0100] "GET /javabank1/customer/customerFile/1 HTTP/1.1" 200 790
0:0:0:0:0:0:0:1 - - [31/Mar/2023:12:16:52 +0100] "GET /javabank1/customer/customerFile/2 HTTP/1.1" 200 790
0:0:0:0:0:0:0:1 - - [31/Mar/2023:12:16:57 +0100] "GET /javabank1/customer/customerFile/5 HTTP/1.1" 500 3636
0:0:0:0:0:0:0:1 - - [31/Mar/2023:12:17:00 +0100] "GET /javabank1/customer/customerFile/4 HTTP/1.1" 200 790
0:0:0:0:0:0:0:1 - - [31/Mar/2023:12:17:04 +0100] "GET /javabank1/customer/list HTTP/1.1" 500 1096
0:0:0:0:0:0:0:1 - - [31/Mar/2023:12:17:48 +0100] "GET /javabank1/customer/ HTTP/1.1" 500 1096
127.0.0.1 - admin [31/Mar/2023:12:19:31 +0100] "PUT /manager/text/deploy?path=%2Fjavabank1&update=true HTTP/1.1" 200 66
0:0:0:0:0:0:0:1 - - [31/Mar/2023:12:19:40 +0100] "GET /javabank1/customer/ HTTP/1.1" 500 1096
0:0:0:0:0:0:0:1 - - [31/Mar/2023:12:19:44 +0100] "GET /javabank1/customer/customerFile/1 HTTP/1.1" 200 800
0:0:0:0:0:0:0:1 - - [31/Mar/2023:12:19:48 +0100] "GET /javabank1/customer/list HTTP/1.1" 500 1096
127.0.0.1 - admin [31/Mar/2023:12:22:58 +0100] "PUT /manager/text/deploy?path=%2Fjavabank1&update=true HTTP/1.1" 200 66
0:0:0:0:0:0:0:1 - - [31/Mar/2023:12:23:06 +0100] "GET /javabank1/customer/customerFile/1 HTTP/1.1" 200 1326
0:0:0:0:0:0:0:1 - - [31/Mar/2023:12:23:06 +0100] "GET /javabank1/customer/customerFile/1 HTTP/1.1" 200 1326
127.0.0.1 - admin [31/Mar/2023:14:00:56 +0100] "PUT /manager/text/deploy?path=%2Fjavabank1&update=true HTTP/1.1" 200 66
0:0:0:0:0:0:0:1 - - [31/Mar/2023:14:00:59 +0100] "GET /javabank1 HTTP/1.1" 302 -
0:0:0:0:0:0:0:1 - - [31/Mar/2023:14:01:02 +0100] "GET /javabank1/ HTTP/1.1" 302 -
0:0:0:0:0:0:0:1 - - [31/Mar/2023:14:01:03 +0100] "GET /javabank1/customer/list HTTP/1.1" 500 1071
127.0.0.1 - admin [31/Mar/2023:14:06:40 +0100] "PUT /manager/text/deploy?path=%2Fjavabank1&update=true HTTP/1.1" 200 66
0:0:0:0:0:0:0:1 - - [31/Mar/2023:14:06:43 +0100] "GET /javabank1 HTTP/1.1" 302 -
0:0:0:0:0:0:0:1 - - [31/Mar/2023:14:06:46 +0100] "GET /javabank1/ HTTP/1.1" 302 -
0:0:0:0:0:0:0:1 - - [31/Mar/2023:14:06:47 +0100] "GET /javabank1/customer/list HTTP/1.1" 500 1202
127.0.0.1 - admin [31/Mar/2023:14:08:26 +0100] "PUT /manager/text/deploy?path=%2Fjavabank1&update=true HTTP/1.1" 200 66
0:0:0:0:0:0:0:1 - - [31/Mar/2023:14:08:37 +0100] "GET /javabank1/customer/list HTTP/1.1" 500 1264
0:0:0:0:0:0:0:1 - - [31/Mar/2023:14:08:43 +0100] "GET /javabank1/customer/1 HTTP/1.1" 404 779
127.0.0.1 - admin [31/Mar/2023:14:09:25 +0100] "PUT /manager/text/deploy?path=%2Fjavabank1&update=true HTTP/1.1" 200 66
0:0:0:0:0:0:0:1 - - [31/Mar/2023:14:09:30 +0100] "GET /javabank1/customer/list HTTP/1.1" 500 1277
0:0:0:0:0:0:0:1 - - [31/Mar/2023:14:09:32 +0100] "GET /javabank1/customer/customerFile/1 HTTP/1.1" 200 1326
127.0.0.1 - admin [31/Mar/2023:14:13:42 +0100] "PUT /manager/text/deploy?path=%2Fjavabank1&update=true HTTP/1.1" 200 66
0:0:0:0:0:0:0:1 - - [31/Mar/2023:14:14:22 +0100] "GET /javabank1/customer/customerFile/1 HTTP/1.1" 200 1326
0:0:0:0:0:0:0:1 - - [31/Mar/2023:14:14:25 +0100] "GET /javabank1/customer/list HTTP/1.1" 200 2445
0:0:0:0:0:0:0:1 - - [31/Mar/2023:14:14:42 +0100] "GET /javabank1/customer/customerFile/1 HTTP/1.1" 200 1326
0:0:0:0:0:0:0:1 - - [31/Mar/2023:14:14:48 +0100] "GET /javabank1/customer/customerFile/2 HTTP/1.1" 200 1326
0:0:0:0:0:0:0:1 - - [31/Mar/2023:14:14:51 +0100] "GET /javabank1/customer/customerFile/4 HTTP/1.1" 200 1182
0:0:0:0:0:0:0:1 - - [31/Mar/2023:14:18:15 +0100] "GET /javabank1/customer/customerFile/1 HTTP/1.1" 200 1326
127.0.0.1 - admin [31/Mar/2023:14:21:14 +0100] "PUT /manager/text/deploy?path=%2Fjavabank1&update=true HTTP/1.1" 200 66
0:0:0:0:0:0:0:1 - - [31/Mar/2023:14:21:19 +0100] "GET /javabank1 HTTP/1.1" 302 -
0:0:0:0:0:0:0:1 - - [31/Mar/2023:14:21:22 +0100] "GET /javabank1/ HTTP/1.1" 302 -
0:0:0:0:0:0:0:1 - - [31/Mar/2023:14:21:23 +0100] "GET /javabank1/customer/list HTTP/1.1" 500 972
127.0.0.1 - admin [31/Mar/2023:14:21:55 +0100] "PUT /manager/text/deploy?path=%2Fjavabank1&update=true HTTP/1.1" 200 66
0:0:0:0:0:0:0:1 - - [31/Mar/2023:14:22:01 +0100] "GET /javabank1/customer/list HTTP/1.1" 200 2461
0:0:0:0:0:0:0:1 - - [31/Mar/2023:14:23:51 +0100] "GET /javabank1 HTTP/1.1" 404 760
127.0.0.1 - admin [31/Mar/2023:14:23:52 +0100] "PUT /manager/text/deploy?path=%2Fjavabank1&update=true HTTP/1.1" 200 66
0:0:0:0:0:0:0:1 - - [31/Mar/2023:14:23:59 +0100] "GET /javabank1/customer/list HTTP/1.1" 200 2445
0:0:0:0:0:0:0:1 - - [31/Mar/2023:14:24:01 +0100] "GET /javabank1/customer/customerFile/1 HTTP/1.1" 500 655
0:0:0:0:0:0:0:1 - - [31/Mar/2023:14:24:33 +0100] "GET /javabank1 HTTP/1.1" 404 760
127.0.0.1 - admin [31/Mar/2023:14:24:35 +0100] "PUT /manager/text/deploy?path=%2Fjavabank1&update=true HTTP/1.1" 200 66
0:0:0:0:0:0:0:1 - - [31/Mar/2023:14:24:43 +0100] "GET /javabank1/customer/list HTTP/1.1" 200 2445
0:0:0:0:0:0:0:1 - - [31/Mar/2023:14:24:44 +0100] "GET /javabank1/customer/customerFile/1 HTTP/1.1" 200 1280
0:0:0:0:0:0:0:1 - - [31/Mar/2023:14:28:48 +0100] "GET /javabank1/customer/list HTTP/1.1" 200 2445
0:0:0:0:0:0:0:1 - - [31/Mar/2023:14:28:50 +0100] "GET /javabank1/customer/list HTTP/1.1" 404 782
127.0.0.1 - admin [31/Mar/2023:14:28:51 +0100] "PUT /manager/text/deploy?path=%2Fjavabank1&update=true HTTP/1.1" 200 66
0:0:0:0:0:0:0:1 - - [31/Mar/2023:14:28:56 +0100] "GET /javabank1/customer/customerFile/1 HTTP/1.1" 200 1367
127.0.0.1 - admin [31/Mar/2023:14:30:12 +0100] "PUT /manager/text/deploy?path=%2Fjavabank1&update=true HTTP/1.1" 200 66
0:0:0:0:0:0:0:1 - - [31/Mar/2023:14:30:14 +0100] "GET /javabank1 HTTP/1.1" 302 -
0:0:0:0:0:0:0:1 - - [31/Mar/2023:14:30:18 +0100] "GET /javabank1/ HTTP/1.1" 302 -
0:0:0:0:0:0:0:1 - - [31/Mar/2023:14:30:19 +0100] "GET /javabank1/customer/list HTTP/1.1" 200 2445
0:0:0:0:0:0:0:1 - - [31/Mar/2023:14:30:21 +0100] "GET /javabank1/customer/customerFile/1 HTTP/1.1" 200 1353
0:0:0:0:0:0:0:1 - - [31/Mar/2023:14:30:26 +0100] "GET /javabank1/customer/customerFile/2 HTTP/1.1" 200 1356
0:0:0:0:0:0:0:1 - - [31/Mar/2023:14:30:27 +0100] "GET /javabank1/customer/list HTTP/1.1" 200 2445
0:0:0:0:0:0:0:1 - - [31/Mar/2023:14:30:28 +0100] "GET /javabank1/customer/customerFile/4 HTTP/1.1" 200 1189
0:0:0:0:0:0:0:1 - - [31/Mar/2023:14:30:32 +0100] "GET /javabank1/customer/list HTTP/1.1" 200 2445
0:0:0:0:0:0:0:1 - - [31/Mar/2023:14:30:33 +0100] "GET /javabank1/customer/delete/4 HTTP/1.1" 404 790
127.0.0.1 - admin [31/Mar/2023:14:39:56 +0100] "PUT /manager/text/deploy?path=%2Fjavabank1&update=true HTTP/1.1" 200 66
0:0:0:0:0:0:0:1 - - [31/Mar/2023:14:40:00 +0100] "GET /javabank1 HTTP/1.1" 302 -
0:0:0:0:0:0:0:1 - - [31/Mar/2023:14:40:04 +0100] "GET /javabank1/ HTTP/1.1" 302 -
0:0:0:0:0:0:0:1 - - [31/Mar/2023:14:40:04 +0100] "GET /javabank1/customer/list HTTP/1.1" 200 2445
0:0:0:0:0:0:0:1 - - [31/Mar/2023:14:40:07 +0100] "GET /javabank1/customer/delete/4 HTTP/1.1" 404 790
127.0.0.1 - admin [31/Mar/2023:14:40:48 +0100] "PUT /manager/text/deploy?path=%2Fjavabank1&update=true HTTP/1.1" 200 66
0:0:0:0:0:0:0:1 - - [31/Mar/2023:14:40:50 +0100] "GET /javabank1 HTTP/1.1" 302 -
0:0:0:0:0:0:0:1 - - [31/Mar/2023:14:40:53 +0100] "GET /javabank1/ HTTP/1.1" 302 -
0:0:0:0:0:0:0:1 - - [31/Mar/2023:14:40:53 +0100] "GET /javabank1/customer/list HTTP/1.1" 200 2437
0:0:0:0:0:0:0:1 - - [31/Mar/2023:14:40:56 +0100] "GET /javabank1/customer/list/4 HTTP/1.1" 404 788
127.0.0.1 - admin [31/Mar/2023:14:41:26 +0100] "PUT /manager/text/deploy?path=%2Fjavabank1&update=true HTTP/1.1" 200 66
0:0:0:0:0:0:0:1 - - [31/Mar/2023:14:41:28 +0100] "GET /javabank1 HTTP/1.1" 302 -
0:0:0:0:0:0:0:1 - - [31/Mar/2023:14:41:31 +0100] "GET /javabank1/ HTTP/1.1" 302 -
0:0:0:0:0:0:0:1 - - [31/Mar/2023:14:41:32 +0100] "GET /javabank1/customer/list HTTP/1.1" 200 2437
0:0:0:0:0:0:0:1 - - [31/Mar/2023:14:41:34 +0100] "GET /javabank1/customer/list/4 HTTP/1.1" 404 788
127.0.0.1 - admin [31/Mar/2023:14:42:29 +0100] "PUT /manager/text/deploy?path=%2Fjavabank1&update=true HTTP/1.1" 200 66
127.0.0.1 - admin [31/Mar/2023:14:42:41 +0100] "PUT /manager/text/deploy?path=%2Fjavabank1&update=true HTTP/1.1" 200 66
127.0.0.1 - admin [31/Mar/2023:14:43:01 +0100] "PUT /manager/text/deploy?path=%2Fjavabank1&update=true HTTP/1.1" 200 66
0:0:0:0:0:0:0:1 - - [31/Mar/2023:14:43:03 +0100] "GET /javabank1 HTTP/1.1" 302 -
0:0:0:0:0:0:0:1 - - [31/Mar/2023:14:43:07 +0100] "GET /javabank1/ HTTP/1.1" 302 -
0:0:0:0:0:0:0:1 - - [31/Mar/2023:14:43:07 +0100] "GET /javabank1/customer/list HTTP/1.1" 200 2437
0:0:0:0:0:0:0:1 - - [31/Mar/2023:14:43:08 +0100] "GET /javabank1/customer/list/4 HTTP/1.1" 404 788
127.0.0.1 - admin [31/Mar/2023:14:45:40 +0100] "PUT /manager/text/deploy?path=%2Fjavabank1&update=true HTTP/1.1" 200 66
0:0:0:0:0:0:0:1 - - [31/Mar/2023:14:45:45 +0100] "GET /javabank1 HTTP/1.1" 302 -
0:0:0:0:0:0:0:1 - - [31/Mar/2023:14:45:48 +0100] "GET /javabank1/ HTTP/1.1" 302 -
0:0:0:0:0:0:0:1 - - [31/Mar/2023:14:45:49 +0100] "GET /javabank1/customer/list HTTP/1.1" 200 2409
0:0:0:0:0:0:0:1 - - [31/Mar/2023:14:45:51 +0100] "GET /javabank1/delete/4 HTTP/1.1" 404 777
0:0:0:0:0:0:0:1 - - [31/Mar/2023:14:46:14 +0100] "GET /javabank1 HTTP/1.1" 404 760
127.0.0.1 - admin [31/Mar/2023:14:46:15 +0100] "PUT /manager/text/deploy?path=%2Fjavabank1&update=true HTTP/1.1" 200 66
0:0:0:0:0:0:0:1 - - [31/Mar/2023:14:46:27 +0100] "GET /javabank1 HTTP/1.1" 302 -
0:0:0:0:0:0:0:1 - - [31/Mar/2023:14:46:31 +0100] "GET /javabank1/ HTTP/1.1" 302 -
0:0:0:0:0:0:0:1 - - [31/Mar/2023:14:46:31 +0100] "GET /javabank1/customer/list HTTP/1.1" 200 2445
0:0:0:0:0:0:0:1 - - [31/Mar/2023:14:46:33 +0100] "GET /javabank1/customer/delete/4 HTTP/1.1" 302 -
0:0:0:0:0:0:0:1 - - [31/Mar/2023:14:46:33 +0100] "GET /javabank1/customer/list HTTP/1.1" 200 2080
0:0:0:0:0:0:0:1 - - [31/Mar/2023:14:46:34 +0100] "GET /javabank1/customer/customerFile/3 HTTP/1.1" 200 1355
