{
	"info": {
		"_postman_id": "f7e22584-9222-47bd-890b-776691e34c88",
		"name": "EbsPricer",
		"schema": "https://schema.getpostman.com/json/collection/v2.1.0/collection.json"
	},
	"item": [
		{
			"name": "Auth",
			"item": [
				{
					"name": "User register",
					"request": {
						"method": "POST",
						"header": [
							{
								"key": "Content-Type",
								"name": "Content-Type",
								"value": "application/json",
								"type": "text"
							},
							{
								"key": "X-Requested-With",
								"value": "XMLHttpRequest",
								"type": "text"
							},
							{
								"key": "Cookie",
								"value": "XDEBUG_SESSION=PHPSTORM",
								"type": "text"
							}
						],
						"body": {
							"mode": "raw",
							"raw": "{\n    \"name\": \"Andrei Cociug\",\n    \"email\": \"andrei.ntm@gmail.com\",\n    \"password\": \"123456\"\n}"
						},
						"url": {
							"raw": "{{url}}/v1/register",
							"host": [
								"{{url}}"
							],
							"path": [
								"v1",
								"register"
							]
						}
					},
					"response": []
				},
				{
					"name": "User login",
					"request": {
						"method": "POST",
						"header": [
							{
								"key": "Content-Type",
								"name": "Content-Type",
								"value": "application/json",
								"type": "text"
							}
						],
						"body": {
							"mode": "raw",
							"raw": "{\n\t\"email\": \"andrei.ntm4@gmail.com\",\n\t\"password\": \"1234567\"\n}"
						},
						"url": {
							"raw": "{{url}}/v1/login",
							"host": [
								"{{url}}"
							],
							"path": [
								"v1",
								"login"
							]
						}
					},
					"response": []
				}
			]
		},
		{
			"name": "Category",
			"item": [
				{
					"name": "Retrieve collection of categories",
					"request": {
						"method": "GET",
						"header": [
							{
								"key": "Authorization",
								"value": "Bearer {{token}}",
								"type": "text"
							}
						],
						"url": {
							"raw": "{{url}}/v1/categories",
							"host": [
								"{{url}}"
							],
							"path": [
								"v1",
								"categories"
							]
						}
					},
					"response": []
				},
				{
					"name": "Create category",
					"request": {
						"method": "POST",
						"header": [
							{
								"key": "Authorization",
								"value": "Bearer {{token}}",
								"type": "text"
							},
							{
								"key": "Content-Type",
								"name": "Content-Type",
								"value": "application/json",
								"type": "text"
							}
						],
						"body": {
							"mode": "raw",
							"raw": "{\n\t\"title\": \"Test Category\"\n}"
						},
						"url": {
							"raw": "{{url}}/v1/categories",
							"host": [
								"{{url}}"
							],
							"path": [
								"v1",
								"categories"
							]
						}
					},
					"response": []
				}
			]
		},
		{
			"name": "Product",
			"item": [
				{
					"name": "Retreive collection of products",
					"request": {
						"method": "GET",
						"header": [
							{
								"key": "Authorization",
								"value": "Bearer {{token}}",
								"type": "text"
							}
						],
						"url": {
							"raw": "{{url}}/v1/products",
							"host": [
								"{{url}}"
							],
							"path": [
								"v1",
								"products"
							]
						}
					},
					"response": []
				},
				{
					"name": "Create product",
					"request": {
						"method": "POST",
						"header": [
							{
								"key": "Authorization",
								"value": "Bearer {{token}}",
								"type": "text"
							},
							{
								"key": "Content-Type",
								"name": "Content-Type",
								"value": "application/json",
								"type": "text"
							}
						],
						"body": {
							"mode": "raw",
							"raw": "{\n\t\"title\": \"Test prod\",\n\t\"category_id\": 1,\n\t\"price\": 10.2\n}\n"
						},
						"url": {
							"raw": "{{url}}/v1/products",
							"host": [
								"{{url}}"
							],
							"path": [
								"v1",
								"products"
							]
						}
					},
					"response": []
				}
			],
			"event": [
				{
					"listen": "prerequest",
					"script": {
						"id": "edf7e29b-1523-404e-95fe-608981fd89ef",
						"type": "text/javascript",
						"exec": [
							""
						]
					}
				},
				{
					"listen": "test",
					"script": {
						"id": "0f47ead5-0619-449b-ae0e-a4a0256e743a",
						"type": "text/javascript",
						"exec": [
							""
						]
					}
				}
			]
		},
		{
			"name": "Price",
			"item": [
				{
					"name": "Update price by product",
					"request": {
						"method": "PATCH",
						"header": [
							{
								"key": "Authorization",
								"value": "Bearer {{token}}",
								"type": "text"
							},
							{
								"key": "Content-Type",
								"name": "Content-Type",
								"value": "application/json",
								"type": "text"
							}
						],
						"body": {
							"mode": "raw",
							"raw": "{\n\t\"amount\": 10.5,\n\t\"from\": \"2019-08-15\",\n\t\"to\": \"2019-08-18\"\n}"
						},
						"url": {
							"raw": "{{url}}/v1/product-prices/2",
							"host": [
								"{{url}}"
							],
							"path": [
								"v1",
								"product-prices",
								"2"
							]
						}
					},
					"response": []
				},
				{
					"name": "Update price by category",
					"request": {
						"method": "PATCH",
						"header": [
							{
								"key": "Authorization",
								"value": "Bearer {{token}}",
								"type": "text"
							},
							{
								"key": "Content-Type",
								"name": "Content-Type",
								"value": "application/json",
								"type": "text"
							}
						],
						"body": {
							"mode": "raw",
							"raw": "{\n\t\"amount\": 10.5,\n\t\"from\": \"2019-08-15\",\n\t\"to\": \"2019-08-18\"\n}"
						},
						"url": {
							"raw": "{{url}}/v1/category-prices/1",
							"host": [
								"{{url}}"
							],
							"path": [
								"v1",
								"category-prices",
								"1"
							]
						}
					},
					"response": []
				}
			]
		},
		{
			"name": "Statistic",
			"item": [
				{
					"name": "Statistic per product",
					"request": {
						"method": "POST",
						"header": [
							{
								"key": "Authorization",
								"value": "Bearer {{token}}",
								"type": "text"
							},
							{
								"key": "Content-Type",
								"name": "Content-Type",
								"value": "application/json",
								"type": "text"
							},
							{
								"key": "",
								"value": "",
								"type": "text",
								"disabled": true
							}
						],
						"body": {
							"mode": "raw",
							"raw": "{\n\t\"from\": \"2019-08-01\",\n\t\"to\": \"2019-08-23\"\n}"
						},
						"url": {
							"raw": "{{url}}/v1/statistics/price-product/1",
							"host": [
								"{{url}}"
							],
							"path": [
								"v1",
								"statistics",
								"price-product",
								"1"
							]
						}
					},
					"response": []
				},
				{
					"name": "Statistic average price per product",
					"request": {
						"method": "POST",
						"header": [
							{
								"key": "Authorization",
								"value": "Bearer {{token}}",
								"type": "text"
							},
							{
								"key": "Content-Type",
								"name": "Content-Type",
								"value": "application/json",
								"type": "text"
							}
						],
						"body": {
							"mode": "raw",
							"raw": "{\n\t\"type\": \"custom\",\n\t\"from\": \"2019-08-01\",\n\t\"to\": \"2019-08-01\"\n}\n\n//type can be: week(from, to should be null), month (from, to should be null), custom "
						},
						"url": {
							"raw": "{{url}}/v1/statistics/average-price-product/1",
							"host": [
								"{{url}}"
							],
							"path": [
								"v1",
								"statistics",
								"average-price-product",
								"1"
							]
						}
					},
					"response": []
				}
			]
		}
	]
}