20636 830000 509
682705 869363 525
667085 624990 509
485752 444509 444
332846 306596 384
528334 919192 525
289852 83592 443
153866 834827 509
932242 470325 525
24273 612039 470
651434 55606 509
919355 474021 525
541008 89175 470
756873 255023 509
263688 390394 441
42043 201883 383
92104 2586 351
623119 836392 509
64169 305891 443
611609 616685 447
109319 412160 449
216740 913229 525
949979 111406 525
638677 528150 509
902096 625235 525
651407 787385 504
121949 464181 449
340480 445507 449
587921 951453 525
520625 285884 470
42859 315446 443
443102 258124 449
848034 478026 525
914608 212026 525
222095 704783 509
983805 25268 525
22675 409982 443
214462 258610 443
166159 317323 443
109704 767035 509
419206 304910 449
398639 70279 443
547996 962466 525
392554 106485 443
470739 305100 449
218915 139546 386
543450 694681 509
221915 803251 509
953109 149288 525
276591 195654 443
901381 401729 525
728623 695494 504
108896 425683 449
244764 84874 443
98638 397423 443
11306 315411 443
95763 820222 509
392914 713251 509
38941 418216 449
286922 76487 443
634625 755417 504
716042 554805 509
826906 445625 509
897413 109328 525
331473 463018 449
363802 931914 525
79454 256120 443
86943 791214 509
812414 668122 504
239905 837198 509
354104 645275 509
153887 283863 443
438734 477009 444
610859 380955 470
303768 388534 441
925577 316452 525
259824 973471 525
170080 945055 525
619954 59620 470
98903 739474 509
401305 255422 441
77316 669109 509
39004 475586 449
680410 441061 509
342810 747815 509
611098 474851 470
418913 160471 449
923024 291267 525
56713 143105 375
953998 774849 525
804057 235495 509
790229 73188 509
485635 500662 426
668765 173605 509
877860 777540 525
752895 313577 509
987752 658301 525
703964 203923 509
207292 332247 443
982918 748676 525
473700 859837 525
921516 102737 525
397821 109740 443
267384 969332 525
944331 615228 525
945716 618318 525
771689 58727 509
122250 268982 443
757874 30293 509
861851 279317 525
196384 740876 509
830436 34712 509
957337 91547 525
641405 424071 509
963667 449780 525
841834 642269 525
223436 425435 449
59465 264267 443
727739 357031 509
96122 925560 525
520481 84884 470
786360 468980 509
610351 551069 434
102617 40604 351
10956 38991 324
391828 243452 441
804715 453103 509
854470 540061 525
88931 646228 509
448403 377993 449
417726 680953 509
696602 68649 509
860220 309071 525
548710 988684 525
14741 584265 470
637122 385917 509
434804 118940 449
426619 521058 470
949917 566126 525
309269 392380 441
445172 17044 449
864008 807453 525
633925 425630 509
794802 718125 468
961121 30575 525
551775 758334 509
894486 217870 525
558188 366075 470
559754 488614 470
686785 750854 504
402172 917160 525
607018 597320 403
672312 526008 509
59505 713702 509
600664 235552 470
843215 791404 525
989875 879320 507
60721 434035 449
795830 712500 468
859653 621920 525
438153 349922 449
740975 130804 509
317192 522527 470
375545 573121 470
520648 942690 525
172949 689468 509
384807 154124 443
529289 905058 525
352085 319787 441
799711 989769 525
341989 636528 509
25841 447829 449
593181 439564 470
959095 995668 458
71921 827348 509
671739 737752 504
562857 450657 470
623555 947387 525
304362 857913 525
771801 249651 509
678902 828742 504
2522 285201 443
935492 33254 525
95746 516680 470
823187 65572 509
268366 450758 449
613394 250887 470
159563 641853 509
464522 316037 449
347395 961154 525
203082 341413 443
918148 851518 476
786735 373379 509
819486 809427 450
658548 606280 509
281930 926088 525
267324 544156 470
306832 900273 525
845482 912021 476
