1 10 20
100 200 125
201 210 89
900 1000 174
30754 68641 340
6192 29751 308
69069 86182 351
11027 90968 351
27262 52737 340
66036 93510 351
37489 51173 314
16354 90229 351
66000 95139 351
46136 97969 351
34713 60947 340
11868 67997 340
24734 85887 351
15270 98183 351
79566 82286 320
45272 77444 351
36058 49285 314
16165 81273 351
27807 73847 340
53466 55030 322
35043 60698 340
29429 76108 340
33816 40244 324
16400 58645 340
60548 98774 351
29755 42937 324
58950 71907 335
31950 83407 351
47379 97466 351
32038 57354 340
173812 182463 365
403633 497586 449
160013 296063 443
177849 465276 449
186517 382152 443
151424 436249 449
258522 299224 407
335718 425140 449
111608 454393 449
245399 331924 407
257379 457674 449
373705 381729 423
462814 493255 426
412364 464084 444
298909 412872 449
205793 271781 443
150028 455610 449
215375 434768 449
183551 414277 449
273567 443598 449
150444 345252 443
109581 487053 449
187348 472029 449
209678 315516 443
276816 395977 441
477420 484330 413
167044 353488 443
134267 223209 386
187588 491173 449
372896 457657 449
171771 423434 449
198901 222032 386
405458 426004 449
239005 355145 441
119013 387452 443
129828 441700 449
177602 481793 449
266077 484634 449
356979 413289 449
355129 437491 449
782074 963188 525
608367 627759 509
656088 998421 525
864120 955753 507
819264 947838 525
775879 794157 437
658192 807958 504
893835 927207 476
781998 955805 525
717420 728232 411
655568 882186 525
798249 962816 525
925527 931161 476
956605 973194 458
623420 795297 509
729705 833683 468
770758 968870 525
856047 911789 476
718167 721179 411
684998 921085 525
669685 958878 525
622346 837206 509
817361 938500 525
773602 817231 468
631170 812613 504
838765 976667 507
764093 980092 525
754509 947158 525
666927 882622 525
628270 875382 525
