[
    {
        "model": "caringhands.state",
        "pk": 1,
        "fields": {
            "name": "Texas",
            "email": "something@gmail.com",
            "id": 50,
            "poverty": 20,
            "main_img": "http://caringhands.me/img/50",
            "pos_img": "http://caringhands.me/pimg/50",
            "description": "A southern state.",
            "created_at": "2018-02-14 00:00:00"
        }
    },
    {
        "model": "caringhands.volunteer",
        "pk": 2,
        "fields": {
            "name": "virtual",
            "id": 38,
            "created_at": "2018-01-14 00:00:00"
        }
    }
]