digraph "CFG for '_ZN8LogScopeC2EPKc' function" {
	label="CFG for '_ZN8LogScopeC2EPKc' function";

	Node0x55e8d000ab20 [shape=record,label="{%2:\l  %3 = alloca i64, align 8\l  %4 = alloca %\"class.std::__cxx11::basic_string\", align 8\l  %5 = getelementptr inbounds %\"class.std::__cxx11::basic_string\",\l... %\"class.std::__cxx11::basic_string\"* %4, i64 0, i32 2\l  %6 = bitcast %\"class.std::__cxx11::basic_string\"* %4 to %union.anon**\l  store %union.anon* %5, %union.anon** %6, align 8, !tbaa !2\l  %7 = icmp eq i8* %1, null\l  %8 = bitcast %union.anon* %5 to i8*\l  br i1 %7, label %13, label %9\l|{<s0>T|<s1>F}}"];
	Node0x55e8d000ab20:s0 -> Node0x55e8d000ac30;
	Node0x55e8d000ab20:s1 -> Node0x55e8d000af60;
	Node0x55e8d000af60 [shape=record,label="{%9:\l\l  %10 = call i64 @strlen(i8* nonnull %1) #2\l  %11 = bitcast i64* %3 to i8*\l  call void @llvm.lifetime.start.p0i8(i64 8, i8* nonnull %11) #2\l  store i64 %10, i64* %3, align 8, !tbaa !7\l  %12 = icmp ugt i64 %10, 15\l  br i1 %12, label %17, label %15\l|{<s0>T|<s1>F}}"];
	Node0x55e8d000af60:s0 -> Node0x55e8d000b370;
	Node0x55e8d000af60:s1 -> Node0x55e8d000b3c0;
	Node0x55e8d000ac30 [shape=record,label="{%13:\l\l  invoke void @_ZSt19__throw_logic_errorPKc(i8* getelementptr inbounds ([42 x\l... i8], [42 x i8]* @.str.7, i64 0, i64 0)) #11\l          to label %14 unwind label %39\l}"];
	Node0x55e8d000ac30 -> Node0x55e8d000b4e0;
	Node0x55e8d000ac30 -> Node0x55e8d000b530;
	Node0x55e8d000b4e0 [shape=record,label="{%14:\l\l  unreachable\l}"];
	Node0x55e8d000b3c0 [shape=record,label="{%15:\l\l  %16 = getelementptr inbounds %\"class.std::__cxx11::basic_string\",\l... %\"class.std::__cxx11::basic_string\"* %4, i64 0, i32 0, i32 0\l  br label %23\l}"];
	Node0x55e8d000b3c0 -> Node0x55e8d000b770;
	Node0x55e8d000b370 [shape=record,label="{%17:\l\l  %18 = invoke i8*\l... @_ZNSt7__cxx1112basic_stringIcSt11char_traitsIcESaIcEE9_M_createERmm(%\"class.s\l...td::__cxx11::basic_string\"* nonnull %4, i64* nonnull dereferenceable(8) %3,\l... i64 0)\l          to label %19 unwind label %39\l}"];
	Node0x55e8d000b370 -> Node0x55e8d000b870;
	Node0x55e8d000b370 -> Node0x55e8d000b530;
	Node0x55e8d000b870 [shape=record,label="{%19:\l\l  %20 = getelementptr inbounds %\"class.std::__cxx11::basic_string\",\l... %\"class.std::__cxx11::basic_string\"* %4, i64 0, i32 0, i32 0\l  store i8* %18, i8** %20, align 8, !tbaa !9\l  %21 = load i64, i64* %3, align 8, !tbaa !7\l  %22 = getelementptr inbounds %\"class.std::__cxx11::basic_string\",\l... %\"class.std::__cxx11::basic_string\"* %4, i64 0, i32 2, i32 0\l  store i64 %21, i64* %22, align 8, !tbaa !11\l  br label %23\l}"];
	Node0x55e8d000b870 -> Node0x55e8d000b770;
	Node0x55e8d000b770 [shape=record,label="{%23:\l\l  %24 = phi i8** [ %16, %15 ], [ %20, %19 ]\l  %25 = phi i8* [ %8, %15 ], [ %18, %19 ]\l  switch i64 %10, label %28 [\l    i64 1, label %26\l    i64 0, label %29\l  ]\l|{<s0>def|<s1>1|<s2>0}}"];
	Node0x55e8d000b770:s0 -> Node0x55e8d000be20;
	Node0x55e8d000b770:s1 -> Node0x55e8d000be70;
	Node0x55e8d000b770:s2 -> Node0x55e8d000bec0;
	Node0x55e8d000be70 [shape=record,label="{%26:\l\l  %27 = load i8, i8* %1, align 1, !tbaa !11\l  store i8 %27, i8* %25, align 1, !tbaa !11\l  br label %29\l}"];
	Node0x55e8d000be70 -> Node0x55e8d000bec0;
	Node0x55e8d000be20 [shape=record,label="{%28:\l\l  call void @llvm.memcpy.p0i8.p0i8.i64(i8* %25, i8* nonnull %1, i64 %10, i32\l... 1, i1 false) #2\l  br label %29\l}"];
	Node0x55e8d000be20 -> Node0x55e8d000bec0;
	Node0x55e8d000bec0 [shape=record,label="{%29:\l\l  %30 = load i64, i64* %3, align 8, !tbaa !7\l  %31 = getelementptr inbounds %\"class.std::__cxx11::basic_string\",\l... %\"class.std::__cxx11::basic_string\"* %4, i64 0, i32 1\l  store i64 %30, i64* %31, align 8, !tbaa !12\l  %32 = load i8*, i8** %24, align 8, !tbaa !9\l  %33 = getelementptr inbounds i8, i8* %32, i64 %30\l  store i8 0, i8* %33, align 1, !tbaa !11\l  call void @llvm.lifetime.end.p0i8(i64 8, i8* nonnull %11) #2\l  call void\l... @_ZN8LogScopeC2ENSt7__cxx1112basic_stringIcSt11char_traitsIcESaIcEEE(%class.Lo\l...gScope* %0, %\"class.std::__cxx11::basic_string\"* nonnull %4) #2\l  %34 = getelementptr inbounds %\"class.std::__cxx11::basic_string\",\l... %\"class.std::__cxx11::basic_string\"* %4, i64 0, i32 0, i32 0\l  %35 = load i8*, i8** %34, align 8, !tbaa !9\l  %36 = icmp eq i8* %35, %8\l  br i1 %36, label %38, label %37\l|{<s0>T|<s1>F}}"];
	Node0x55e8d000bec0:s0 -> Node0x55e8d000c720;
	Node0x55e8d000bec0:s1 -> Node0x55e8d000ca00;
	Node0x55e8d000ca00 [shape=record,label="{%37:\l\l  call void @_ZdlPv(i8* %35) #2\l  br label %38\l}"];
	Node0x55e8d000ca00 -> Node0x55e8d000c720;
	Node0x55e8d000c720 [shape=record,label="{%38:\l\l  ret void\l}"];
	Node0x55e8d000b530 [shape=record,label="{%39:\l\l  %40 = landingpad \{ i8*, i32 \}\l          catch i8* null\l  %41 = extractvalue \{ i8*, i32 \} %40, 0\l  call void @__clang_call_terminate(i8* %41) #12\l  unreachable\l}"];
}
