digraph "CFG for '_ZN8LogScopeC2ENSt7__cxx1112basic_stringIcSt11char_traitsIcESaIcEEE' function" {
	label="CFG for '_ZN8LogScopeC2ENSt7__cxx1112basic_stringIcSt11char_traitsIcESaIcEEE' function";

	Node0x557cd9e9fbe0 [shape=record,label="{%2:\l  %3 = getelementptr inbounds %class.LogScope, %class.LogScope* %0, i64 0, i32\l... 0\l  %4 = getelementptr inbounds %class.LogScope, %class.LogScope* %0, i64 0, i32\l... 0, i32 2\l  %5 = bitcast %class.LogScope* %0 to %union.anon**\l  store %union.anon* %4, %union.anon** %5, align 8, !tbaa !2\l  %6 = getelementptr inbounds %\"class.std::__cxx11::basic_string\",\l... %\"class.std::__cxx11::basic_string\"* %1, i64 0, i32 0, i32 0\l  %7 = load i8*, i8** %6, align 8, !tbaa !7\l  %8 = getelementptr inbounds %\"class.std::__cxx11::basic_string\",\l... %\"class.std::__cxx11::basic_string\"* %1, i64 0, i32 2\l  %9 = bitcast %union.anon* %8 to i8*\l  %10 = icmp eq i8* %7, %9\l  br i1 %10, label %11, label %13\l|{<s0>T|<s1>F}}"];
	Node0x557cd9e9fbe0:s0 -> Node0x557cd9e9fc30;
	Node0x557cd9e9fbe0:s1 -> Node0x557cd9ea0100;
	Node0x557cd9e9fc30 [shape=record,label="{%11:\l\l  %12 = bitcast %union.anon* %4 to i8*\l  tail call void @llvm.memcpy.p0i8.p0i8.i64(i8* nonnull %12, i8* nonnull %7,\l... i64 16, i32 1, i1 false) #2\l  br label %18\l}"];
	Node0x557cd9e9fc30 -> Node0x557cd9ea03a0;
	Node0x557cd9ea0100 [shape=record,label="{%13:\l\l  %14 = getelementptr inbounds %class.LogScope, %class.LogScope* %0, i64 0,\l... i32 0, i32 0, i32 0\l  store i8* %7, i8** %14, align 8, !tbaa !7\l  %15 = getelementptr inbounds %\"class.std::__cxx11::basic_string\",\l... %\"class.std::__cxx11::basic_string\"* %1, i64 0, i32 2, i32 0\l  %16 = load i64, i64* %15, align 8, !tbaa !10\l  %17 = getelementptr inbounds %class.LogScope, %class.LogScope* %0, i64 0,\l... i32 0, i32 2, i32 0\l  store i64 %16, i64* %17, align 8, !tbaa !10\l  br label %18\l}"];
	Node0x557cd9ea0100 -> Node0x557cd9ea03a0;
	Node0x557cd9ea03a0 [shape=record,label="{%18:\l\l  %19 = getelementptr inbounds %\"class.std::__cxx11::basic_string\",\l... %\"class.std::__cxx11::basic_string\"* %1, i64 0, i32 1\l  %20 = load i64, i64* %19, align 8, !tbaa !11\l  %21 = getelementptr inbounds %class.LogScope, %class.LogScope* %0, i64 0,\l... i32 0, i32 1\l  store i64 %20, i64* %21, align 8, !tbaa !11\l  %22 = bitcast %\"class.std::__cxx11::basic_string\"* %1 to %union.anon**\l  store %union.anon* %8, %union.anon** %22, align 8, !tbaa !7\l  store i64 0, i64* %19, align 8, !tbaa !11\l  store i8 0, i8* %9, align 1, !tbaa !10\l  %23 = invoke dereferenceable(272) %\"class.std::basic_ostream\"*\l... @_ZSt16__ostream_insertIcSt11char_traitsIcEERSt13basic_ostreamIT_T0_ES6_PKS3_l\l...(%\"class.std::basic_ostream\"* nonnull dereferenceable(272) @_ZSt4cout, i8*\l... nonnull getelementptr inbounds ([17 x i8], [17 x i8]* @.str.8, i64 0, i64 0),\l... i64 16)\l          to label %24 unwind label %63\l}"];
	Node0x557cd9ea03a0 -> Node0x557cd9e8db00;
	Node0x557cd9ea03a0 -> Node0x557cd9e8db50;
	Node0x557cd9e8db00 [shape=record,label="{%24:\l\l  %25 = getelementptr inbounds %class.LogScope, %class.LogScope* %0, i64 0,\l... i32 0, i32 0, i32 0\l  %26 = load i8*, i8** %25, align 8, !tbaa !7\l  %27 = load i64, i64* %21, align 8, !tbaa !11\l  %28 = invoke dereferenceable(272) %\"class.std::basic_ostream\"*\l... @_ZSt16__ostream_insertIcSt11char_traitsIcEERSt13basic_ostreamIT_T0_ES6_PKS3_l\l...(%\"class.std::basic_ostream\"* nonnull dereferenceable(272) @_ZSt4cout, i8*\l... %26, i64 %27)\l          to label %29 unwind label %63\l}"];
	Node0x557cd9e8db00 -> Node0x557cd9e8de60;
	Node0x557cd9e8db00 -> Node0x557cd9e8db50;
	Node0x557cd9e8de60 [shape=record,label="{%29:\l\l  %30 = bitcast %\"class.std::basic_ostream\"* %28 to i8**\l  %31 = load i8*, i8** %30, align 8, !tbaa !12\l  %32 = getelementptr i8, i8* %31, i64 -24\l  %33 = bitcast i8* %32 to i64*\l  %34 = load i64, i64* %33, align 8\l  %35 = bitcast %\"class.std::basic_ostream\"* %28 to i8*\l  %36 = getelementptr inbounds i8, i8* %35, i64 %34\l  %37 = getelementptr inbounds i8, i8* %36, i64 240\l  %38 = bitcast i8* %37 to %\"class.std::ctype\"**\l  %39 = load %\"class.std::ctype\"*, %\"class.std::ctype\"** %38, align 8, !tbaa\l... !14\l  %40 = icmp eq %\"class.std::ctype\"* %39, null\l  br i1 %40, label %41, label %43\l|{<s0>T|<s1>F}}"];
	Node0x557cd9e8de60:s0 -> Node0x557cd9e8e410;
	Node0x557cd9e8de60:s1 -> Node0x557cd9e8e460;
	Node0x557cd9e8e410 [shape=record,label="{%41:\l\l  invoke void @_ZSt16__throw_bad_castv() #11\l          to label %42 unwind label %63\l}"];
	Node0x557cd9e8e410 -> Node0x557cd9e8e4f0;
	Node0x557cd9e8e410 -> Node0x557cd9e8db50;
	Node0x557cd9e8e4f0 [shape=record,label="{%42:\l\l  unreachable\l}"];
	Node0x557cd9e8e460 [shape=record,label="{%43:\l\l  %44 = getelementptr inbounds %\"class.std::ctype\", %\"class.std::ctype\"* %39,\l... i64 0, i32 8\l  %45 = load i8, i8* %44, align 8, !tbaa !17\l  %46 = icmp eq i8 %45, 0\l  br i1 %46, label %50, label %47\l|{<s0>T|<s1>F}}"];
	Node0x557cd9e8e460:s0 -> Node0x557cd9e8e7a0;
	Node0x557cd9e8e460:s1 -> Node0x557cd9e8e7f0;
	Node0x557cd9e8e7f0 [shape=record,label="{%47:\l\l  %48 = getelementptr inbounds %\"class.std::ctype\", %\"class.std::ctype\"* %39,\l... i64 0, i32 9, i64 10\l  %49 = load i8, i8* %48, align 1, !tbaa !10\l  br label %57\l}"];
	Node0x557cd9e8e7f0 -> Node0x557cd9e8ea20;
	Node0x557cd9e8e7a0 [shape=record,label="{%50:\l\l  invoke void @_ZNKSt5ctypeIcE13_M_widen_initEv(%\"class.std::ctype\"* nonnull\l... %39)\l          to label %51 unwind label %63\l}"];
	Node0x557cd9e8e7a0 -> Node0x557cd9e8ead0;
	Node0x557cd9e8e7a0 -> Node0x557cd9e8db50;
	Node0x557cd9e8ead0 [shape=record,label="{%51:\l\l  %52 = bitcast %\"class.std::ctype\"* %39 to i8 (%\"class.std::ctype\"*, i8)***\l  %53 = load i8 (%\"class.std::ctype\"*, i8)**, i8 (%\"class.std::ctype\"*, i8)***\l... %52, align 8, !tbaa !12\l  %54 = getelementptr inbounds i8 (%\"class.std::ctype\"*, i8)*, i8\l... (%\"class.std::ctype\"*, i8)** %53, i64 6\l  %55 = load i8 (%\"class.std::ctype\"*, i8)*, i8 (%\"class.std::ctype\"*, i8)**\l... %54, align 8\l  %56 = invoke signext i8 %55(%\"class.std::ctype\"* nonnull %39, i8 signext 10)\l          to label %57 unwind label %63\l}"];
	Node0x557cd9e8ead0 -> Node0x557cd9e8ea20;
	Node0x557cd9e8ead0 -> Node0x557cd9e8db50;
	Node0x557cd9e8ea20 [shape=record,label="{%57:\l\l  %58 = phi i8 [ %49, %47 ], [ %56, %51 ]\l  %59 = invoke dereferenceable(272) %\"class.std::basic_ostream\"*\l... @_ZNSo3putEc(%\"class.std::basic_ostream\"* nonnull %28, i8 signext %58)\l          to label %60 unwind label %63\l}"];
	Node0x557cd9e8ea20 -> Node0x557cd9e8efa0;
	Node0x557cd9e8ea20 -> Node0x557cd9e8db50;
	Node0x557cd9e8efa0 [shape=record,label="{%60:\l\l  %61 = invoke dereferenceable(272) %\"class.std::basic_ostream\"*\l... @_ZNSo5flushEv(%\"class.std::basic_ostream\"* nonnull %59)\l          to label %62 unwind label %63\l}"];
	Node0x557cd9e8efa0 -> Node0x557cd9e8f110;
	Node0x557cd9e8efa0 -> Node0x557cd9e8db50;
	Node0x557cd9e8f110 [shape=record,label="{%62:\l\l  ret void\l}"];
	Node0x557cd9e8db50 [shape=record,label="{%63:\l\l  %64 = landingpad \{ i8*, i32 \}\l          catch i8* null\l  %65 = extractvalue \{ i8*, i32 \} %64, 0\l  tail call void\l... @_ZNSt7__cxx1112basic_stringIcSt11char_traitsIcESaIcEED2Ev(%\"class.std::__cxx1\l...1::basic_string\"* nonnull %3) #2\l  tail call void @__clang_call_terminate(i8* %65) #12\l  unreachable\l}"];
}
