digraph "CFG for '_Z3sumii' function" {
	label="CFG for '_Z3sumii' function";

	Node0x564963f03ea0 [shape=record,label="{%2:\l  %3 = alloca %class.LogScope, align 8\l  %4 = bitcast %class.LogScope* %3 to i8*\l  call void @llvm.lifetime.start.p0i8(i64 32, i8* nonnull %4) #2\l  call void @_ZN8LogScopeC2IiEEPKcT_(%class.LogScope* nonnull %3, i8*\l... getelementptr inbounds ([4 x i8], [4 x i8]* @.str, i64 0, i64 0), i32 %0) #2\l  %5 = icmp slt i32 %0, 1\l  br i1 %5, label %6, label %10\l|{<s0>T|<s1>F}}"];
	Node0x564963f03ea0:s0 -> Node0x564963f05b50;
	Node0x564963f03ea0:s1 -> Node0x564963f05be0;
	Node0x564963f05b50 [shape=record,label="{%6:\l\l  %7 = and i32 %1, 1\l  %8 = icmp eq i32 %7, 0\l  %9 = select i1 %8, i8* getelementptr inbounds ([22 x i8], [22 x i8]*\l... @.str.1, i64 0, i64 0), i8* null\l  br label %19\l}"];
	Node0x564963f05b50 -> Node0x564963f04050;
	Node0x564963f05be0 [shape=record,label="{%10:\l\l  %11 = add nsw i32 %0, -1\l  %12 = add nsw i32 %1, 1\l  %13 = call \{ i32, i8* \} @_Z3sumii(i32 %11, i32 %12) #2\l  %14 = extractvalue \{ i32, i8* \} %13, 0\l  %15 = extractvalue \{ i32, i8* \} %13, 1\l  %16 = icmp eq i8* %15, null\l  %17 = select i1 %16, i32 %0, i32 0\l  %18 = add nsw i32 %17, %14\l  br label %19\l}"];
	Node0x564963f05be0 -> Node0x564963f04050;
	Node0x564963f04050 [shape=record,label="{%19:\l\l  %20 = phi i32 [ 0, %6 ], [ %18, %10 ]\l  %21 = phi i8* [ %9, %6 ], [ %15, %10 ]\l  call void @_ZN8LogScopeD2Ev(%class.LogScope* nonnull %3) #2\l  call void @llvm.lifetime.end.p0i8(i64 32, i8* nonnull %4) #2\l  %22 = insertvalue \{ i32, i8* \} undef, i32 %20, 0\l  %23 = insertvalue \{ i32, i8* \} %22, i8* %21, 1\l  ret \{ i32, i8* \} %23\l}"];
}
