digraph "CFG for 'main' function" {
	label="CFG for 'main' function";

	Node0x564963f23210 [shape=record,label="{%2:\l  %3 = alloca %class.LogScope, align 8\l  %4 = bitcast %class.LogScope* %3 to i8*\l  call void @llvm.lifetime.start.p0i8(i64 32, i8* nonnull %4) #2\l  call void @_ZN8LogScopeC2EPKc(%class.LogScope* nonnull %3, i8* getelementptr\l... inbounds ([5 x i8], [5 x i8]* @.str.5, i64 0, i64 0)) #2\l  %5 = icmp sgt i32 %0, 1\l  br i1 %5, label %6, label %17\l|{<s0>T|<s1>F}}"];
	Node0x564963f23210:s0 -> Node0x564963f23840;
	Node0x564963f23210:s1 -> Node0x564963f23890;
	Node0x564963f23840 [shape=record,label="{%6:\l\l  %7 = getelementptr inbounds i8*, i8** %1, i64 1\l  %8 = load i8*, i8** %7, align 8, !tbaa !2\l  %9 = call i64 @strtol(i8* nocapture nonnull %8, i8** null, i32 10) #2\l  %10 = trunc i64 %9 to i32\l  %11 = call \{ i32, i8* \} @_Z3sumii(i32 %10, i32 0) #2\l  %12 = extractvalue \{ i32, i8* \} %11, 1\l  %13 = icmp eq i8* %12, null\l  br i1 %13, label %14, label %16\l|{<s0>T|<s1>F}}"];
	Node0x564963f23840:s0 -> Node0x564963f24120;
	Node0x564963f23840:s1 -> Node0x564963f241b0;
	Node0x564963f24120 [shape=record,label="{%14:\l\l  %15 = extractvalue \{ i32, i8* \} %11, 0\l  call void @_Z12print_resultii(i32 %10, i32 %15) #2\l  br label %17\l}"];
	Node0x564963f24120 -> Node0x564963f23890;
	Node0x564963f241b0 [shape=record,label="{%16:\l\l  call void @_Z19print_error_messagev() #2\l  br label %17\l}"];
	Node0x564963f241b0 -> Node0x564963f23890;
	Node0x564963f23890 [shape=record,label="{%17:\l\l  call void @_ZN8LogScopeD2Ev(%class.LogScope* nonnull %3) #2\l  call void @llvm.lifetime.end.p0i8(i64 32, i8* nonnull %4) #2\l  ret i32 0\l}"];
}
