digraph "CFG for '_ZN8LogScopeC2IiEEPKcT_' function" {
	label="CFG for '_ZN8LogScopeC2IiEEPKcT_' function";

	Node0x55e8cffed9e0 [shape=record,label="{%3:\l  %4 = alloca i64, align 8\l  %5 = alloca %\"class.std::__cxx11::basic_string\", align 8\l  %6 = alloca %\"class.std::__cxx11::basic_string\", align 8\l  %7 = alloca %\"class.std::__cxx11::basic_string\", align 8\l  %8 = alloca %\"class.std::__cxx11::basic_string\", align 8\l  %9 = alloca %\"class.std::__cxx11::basic_string\", align 8\l  %10 = bitcast %\"class.std::__cxx11::basic_string\"* %6 to i8*\l  call void @llvm.lifetime.start.p0i8(i64 32, i8* nonnull %10) #2\l  %11 = bitcast %\"class.std::__cxx11::basic_string\"* %7 to i8*\l  call void @llvm.lifetime.start.p0i8(i64 32, i8* nonnull %11) #2\l  %12 = bitcast %\"class.std::__cxx11::basic_string\"* %8 to i8*\l  call void @llvm.lifetime.start.p0i8(i64 32, i8* nonnull %12) #2\l  %13 = getelementptr inbounds %\"class.std::__cxx11::basic_string\",\l... %\"class.std::__cxx11::basic_string\"* %8, i64 0, i32 2\l  %14 = bitcast %\"class.std::__cxx11::basic_string\"* %8 to %union.anon**\l  store %union.anon* %13, %union.anon** %14, align 8, !tbaa !2\l  %15 = icmp eq i8* %1, null\l  %16 = bitcast %union.anon* %13 to i8*\l  br i1 %15, label %21, label %17\l|{<s0>T|<s1>F}}"];
	Node0x55e8cffed9e0:s0 -> Node0x55e8cffef410;
	Node0x55e8cffed9e0:s1 -> Node0x55e8cffef460;
	Node0x55e8cffef460 [shape=record,label="{%17:\l\l  %18 = call i64 @strlen(i8* nonnull %1) #2\l  %19 = bitcast i64* %4 to i8*\l  call void @llvm.lifetime.start.p0i8(i64 8, i8* nonnull %19) #2\l  store i64 %18, i64* %4, align 8, !tbaa !7\l  %20 = icmp ugt i64 %18, 15\l  br i1 %20, label %25, label %23\l|{<s0>T|<s1>F}}"];
	Node0x55e8cffef460:s0 -> Node0x55e8cffefa50;
	Node0x55e8cffef460:s1 -> Node0x55e8cffefae0;
	Node0x55e8cffef410 [shape=record,label="{%21:\l\l  invoke void @_ZSt19__throw_logic_errorPKc(i8* getelementptr inbounds ([42 x\l... i8], [42 x i8]* @.str.7, i64 0, i64 0)) #11\l          to label %22 unwind label %172\l}"];
	Node0x55e8cffef410 -> Node0x55e8cffefcb0;
	Node0x55e8cffef410 -> Node0x55e8cffefd00;
	Node0x55e8cffefcb0 [shape=record,label="{%22:\l\l  unreachable\l}"];
	Node0x55e8cffefae0 [shape=record,label="{%23:\l\l  %24 = getelementptr inbounds %\"class.std::__cxx11::basic_string\",\l... %\"class.std::__cxx11::basic_string\"* %8, i64 0, i32 0, i32 0\l  br label %31\l}"];
	Node0x55e8cffefae0 -> Node0x55e8cfff00f0;
	Node0x55e8cffefa50 [shape=record,label="{%25:\l\l  %26 = invoke i8*\l... @_ZNSt7__cxx1112basic_stringIcSt11char_traitsIcESaIcEE9_M_createERmm(%\"class.s\l...td::__cxx11::basic_string\"* nonnull %8, i64* nonnull dereferenceable(8) %4,\l... i64 0)\l          to label %27 unwind label %172\l}"];
	Node0x55e8cffefa50 -> Node0x55e8cfff0220;
	Node0x55e8cffefa50 -> Node0x55e8cffefd00;
	Node0x55e8cfff0220 [shape=record,label="{%27:\l\l  %28 = getelementptr inbounds %\"class.std::__cxx11::basic_string\",\l... %\"class.std::__cxx11::basic_string\"* %8, i64 0, i32 0, i32 0\l  store i8* %26, i8** %28, align 8, !tbaa !9\l  %29 = load i64, i64* %4, align 8, !tbaa !7\l  %30 = getelementptr inbounds %\"class.std::__cxx11::basic_string\",\l... %\"class.std::__cxx11::basic_string\"* %8, i64 0, i32 2, i32 0\l  store i64 %29, i64* %30, align 8, !tbaa !11\l  br label %31\l}"];
	Node0x55e8cfff0220 -> Node0x55e8cfff00f0;
	Node0x55e8cfff00f0 [shape=record,label="{%31:\l\l  %32 = phi i8** [ %24, %23 ], [ %28, %27 ]\l  %33 = phi i8* [ %16, %23 ], [ %26, %27 ]\l  switch i64 %18, label %36 [\l    i64 1, label %34\l    i64 0, label %37\l  ]\l|{<s0>def|<s1>1|<s2>0}}"];
	Node0x55e8cfff00f0:s0 -> Node0x55e8cfff10e0;
	Node0x55e8cfff00f0:s1 -> Node0x55e8cfff1160;
	Node0x55e8cfff00f0:s2 -> Node0x55e8cfff11f0;
	Node0x55e8cfff1160 [shape=record,label="{%34:\l\l  %35 = load i8, i8* %1, align 1, !tbaa !11\l  store i8 %35, i8* %33, align 1, !tbaa !11\l  br label %37\l}"];
	Node0x55e8cfff1160 -> Node0x55e8cfff11f0;
	Node0x55e8cfff10e0 [shape=record,label="{%36:\l\l  call void @llvm.memcpy.p0i8.p0i8.i64(i8* %33, i8* nonnull %1, i64 %18, i32\l... 1, i1 false) #2\l  br label %37\l}"];
	Node0x55e8cfff10e0 -> Node0x55e8cfff11f0;
	Node0x55e8cfff11f0 [shape=record,label="{%37:\l\l  %38 = load i64, i64* %4, align 8, !tbaa !7\l  %39 = getelementptr inbounds %\"class.std::__cxx11::basic_string\",\l... %\"class.std::__cxx11::basic_string\"* %8, i64 0, i32 1\l  store i64 %38, i64* %39, align 8, !tbaa !12\l  %40 = load i8*, i8** %32, align 8, !tbaa !9\l  %41 = getelementptr inbounds i8, i8* %40, i64 %38\l  store i8 0, i8* %41, align 1, !tbaa !11\l  call void @llvm.lifetime.end.p0i8(i64 8, i8* nonnull %19) #2\l  %42 = load i64, i64* %39, align 8, !tbaa !12, !noalias !13\l  %43 = icmp eq i64 %42, 9223372036854775807\l  br i1 %43, label %44, label %46\l|{<s0>T|<s1>F}}"];
	Node0x55e8cfff11f0:s0 -> Node0x55e8cfff31b0;
	Node0x55e8cfff11f0:s1 -> Node0x55e8cfff3240;
	Node0x55e8cfff31b0 [shape=record,label="{%44:\l\l  invoke void @_ZSt20__throw_length_errorPKc(i8* getelementptr inbounds ([21 x\l... i8], [21 x i8]* @.str.11, i64 0, i64 0)) #11\l          to label %45 unwind label %175\l}"];
	Node0x55e8cfff31b0 -> Node0x55e8cfff3410;
	Node0x55e8cfff31b0 -> Node0x55e8cfff3460;
	Node0x55e8cfff3410 [shape=record,label="{%45:\l\l  unreachable\l}"];
	Node0x55e8cfff3240 [shape=record,label="{%46:\l\l  %47 = invoke dereferenceable(32) %\"class.std::__cxx11::basic_string\"*\l... @_ZNSt7__cxx1112basic_stringIcSt11char_traitsIcESaIcEE9_M_appendEPKcm(%\"class.\l...std::__cxx11::basic_string\"* nonnull %8, i8* getelementptr inbounds ([2 x i8],\l... [2 x i8]* @.str.9, i64 0, i64 0), i64 1)\l          to label %48 unwind label %175\l}"];
	Node0x55e8cfff3240 -> Node0x55e8cfff3870;
	Node0x55e8cfff3240 -> Node0x55e8cfff3460;
	Node0x55e8cfff3870 [shape=record,label="{%48:\l\l  %49 = getelementptr inbounds %\"class.std::__cxx11::basic_string\",\l... %\"class.std::__cxx11::basic_string\"* %7, i64 0, i32 2\l  %50 = bitcast %\"class.std::__cxx11::basic_string\"* %7 to %union.anon**\l  store %union.anon* %49, %union.anon** %50, align 8, !tbaa !2, !alias.scope\l... !13\l  %51 = getelementptr inbounds %\"class.std::__cxx11::basic_string\",\l... %\"class.std::__cxx11::basic_string\"* %47, i64 0, i32 0, i32 0\l  %52 = load i8*, i8** %51, align 8, !tbaa !9\l  %53 = getelementptr inbounds %\"class.std::__cxx11::basic_string\",\l... %\"class.std::__cxx11::basic_string\"* %47, i64 0, i32 2\l  %54 = bitcast %union.anon* %53 to i8*\l  %55 = icmp eq i8* %52, %54\l  br i1 %55, label %56, label %58\l|{<s0>T|<s1>F}}"];
	Node0x55e8cfff3870:s0 -> Node0x55e8cfff37a0;
	Node0x55e8cfff3870:s1 -> Node0x55e8cfff4b90;
	Node0x55e8cfff37a0 [shape=record,label="{%56:\l\l  %57 = bitcast %union.anon* %49 to i8*\l  call void @llvm.memcpy.p0i8.p0i8.i64(i8* nonnull %57, i8* nonnull %52, i64\l... 16, i32 1, i1 false) #2\l  br label %63\l}"];
	Node0x55e8cfff37a0 -> Node0x55e8cfff4e30;
	Node0x55e8cfff4b90 [shape=record,label="{%58:\l\l  %59 = getelementptr inbounds %\"class.std::__cxx11::basic_string\",\l... %\"class.std::__cxx11::basic_string\"* %7, i64 0, i32 0, i32 0\l  store i8* %52, i8** %59, align 8, !tbaa !9, !alias.scope !13\l  %60 = getelementptr inbounds %\"class.std::__cxx11::basic_string\",\l... %\"class.std::__cxx11::basic_string\"* %47, i64 0, i32 2, i32 0\l  %61 = load i64, i64* %60, align 8, !tbaa !11\l  %62 = getelementptr inbounds %\"class.std::__cxx11::basic_string\",\l... %\"class.std::__cxx11::basic_string\"* %7, i64 0, i32 2, i32 0\l  store i64 %61, i64* %62, align 8, !tbaa !11, !alias.scope !13\l  br label %63\l}"];
	Node0x55e8cfff4b90 -> Node0x55e8cfff4e30;
	Node0x55e8cfff4e30 [shape=record,label="{%63:\l\l  %64 = getelementptr inbounds %\"class.std::__cxx11::basic_string\",\l... %\"class.std::__cxx11::basic_string\"* %47, i64 0, i32 1\l  %65 = load i64, i64* %64, align 8, !tbaa !12\l  %66 = getelementptr inbounds %\"class.std::__cxx11::basic_string\",\l... %\"class.std::__cxx11::basic_string\"* %7, i64 0, i32 1\l  store i64 %65, i64* %66, align 8, !tbaa !12, !alias.scope !13\l  %67 = bitcast %\"class.std::__cxx11::basic_string\"* %47 to %union.anon**\l  store %union.anon* %53, %union.anon** %67, align 8, !tbaa !9\l  store i64 0, i64* %64, align 8, !tbaa !12\l  store i8 0, i8* %54, align 1, !tbaa !11\l  %68 = bitcast %\"class.std::__cxx11::basic_string\"* %9 to i8*\l  call void @llvm.lifetime.start.p0i8(i64 32, i8* nonnull %68) #2\l  invoke void (%\"class.std::__cxx11::basic_string\"*, i32 (i8*, i64, i8*,\l... %struct.__va_list_tag*)*, i64, i8*, ...)\l... @_ZN9__gnu_cxx12__to_xstringINSt7__cxx1112basic_stringIcSt11char_traitsIcESaIc\l...EEEcEET_PFiPT0_mPKS8_P13__va_list_tagEmSB_z(%\"class.std::__cxx11::basic_string\"\l...* nonnull sret %9, i32 (i8*, i64, i8*, %struct.__va_list_tag*)* nonnull\l... @vsnprintf, i64 16, i8* getelementptr inbounds ([3 x i8], [3 x i8]* @.str.14,\l... i64 0, i64 0), i32 %2)\l          to label %69 unwind label %178\l}"];
	Node0x55e8cfff4e30 -> Node0x55e8cfff5e60;
	Node0x55e8cfff4e30 -> Node0x55e8cfff5eb0;
	Node0x55e8cfff5e60 [shape=record,label="{%69:\l\l  %70 = load i64, i64* %66, align 8, !tbaa !12, !noalias !16\l  %71 = getelementptr inbounds %\"class.std::__cxx11::basic_string\",\l... %\"class.std::__cxx11::basic_string\"* %9, i64 0, i32 1\l  %72 = load i64, i64* %71, align 8, !tbaa !12, !noalias !16\l  %73 = add i64 %72, %70\l  %74 = getelementptr inbounds %\"class.std::__cxx11::basic_string\",\l... %\"class.std::__cxx11::basic_string\"* %7, i64 0, i32 0, i32 0\l  %75 = load i8*, i8** %74, align 8, !tbaa !9, !noalias !16\l  %76 = bitcast %union.anon* %49 to i8*\l  %77 = icmp eq i8* %75, %76\l  %78 = getelementptr inbounds %\"class.std::__cxx11::basic_string\",\l... %\"class.std::__cxx11::basic_string\"* %7, i64 0, i32 2, i32 0\l  %79 = load i64, i64* %78, align 8, !noalias !16\l  %80 = select i1 %77, i64 15, i64 %79\l  %81 = icmp ugt i64 %73, %80\l  %82 = getelementptr inbounds %\"class.std::__cxx11::basic_string\",\l... %\"class.std::__cxx11::basic_string\"* %9, i64 0, i32 0, i32 0\l  %83 = load i8*, i8** %82, align 8, !tbaa !9, !noalias !16\l  br i1 %81, label %84, label %94\l|{<s0>T|<s1>F}}"];
	Node0x55e8cfff5e60:s0 -> Node0x55e8cfff6f00;
	Node0x55e8cfff5e60:s1 -> Node0x55e8cfff6f90;
	Node0x55e8cfff6f00 [shape=record,label="{%84:\l\l  %85 = getelementptr inbounds %\"class.std::__cxx11::basic_string\",\l... %\"class.std::__cxx11::basic_string\"* %9, i64 0, i32 2\l  %86 = bitcast %union.anon* %85 to i8*\l  %87 = icmp eq i8* %83, %86\l  %88 = getelementptr inbounds %\"class.std::__cxx11::basic_string\",\l... %\"class.std::__cxx11::basic_string\"* %9, i64 0, i32 2, i32 0\l  %89 = load i64, i64* %88, align 8, !noalias !16\l  %90 = select i1 %87, i64 15, i64 %89\l  %91 = icmp ugt i64 %73, %90\l  br i1 %91, label %94, label %92\l|{<s0>T|<s1>F}}"];
	Node0x55e8cfff6f00:s0 -> Node0x55e8cfff6f90;
	Node0x55e8cfff6f00:s1 -> Node0x55e8cfff7430;
	Node0x55e8cfff7430 [shape=record,label="{%92:\l\l  %93 = invoke dereferenceable(32) %\"class.std::__cxx11::basic_string\"*\l... @_ZNSt7__cxx1112basic_stringIcSt11char_traitsIcESaIcEE10_M_replaceEmmPKcm(%\"cl\l...ass.std::__cxx11::basic_string\"* nonnull %9, i64 0, i64 0, i8* %75, i64 %70)\l          to label %96 unwind label %183\l}"];
	Node0x55e8cfff7430 -> Node0x55e8cfff7570;
	Node0x55e8cfff7430 -> Node0x55e8cfff75c0;
	Node0x55e8cfff6f90 [shape=record,label="{%94:\l\l  %95 = invoke dereferenceable(32) %\"class.std::__cxx11::basic_string\"*\l... @_ZNSt7__cxx1112basic_stringIcSt11char_traitsIcESaIcEE9_M_appendEPKcm(%\"class.\l...std::__cxx11::basic_string\"* nonnull %7, i8* %83, i64 %72)\l          to label %96 unwind label %183\l}"];
	Node0x55e8cfff6f90 -> Node0x55e8cfff7570;
	Node0x55e8cfff6f90 -> Node0x55e8cfff75c0;
	Node0x55e8cfff7570 [shape=record,label="{%96:\l\l  %97 = phi %\"class.std::__cxx11::basic_string\"* [ %93, %92 ], [ %95, %94 ]\l  %98 = getelementptr inbounds %\"class.std::__cxx11::basic_string\",\l... %\"class.std::__cxx11::basic_string\"* %6, i64 0, i32 2\l  %99 = bitcast %\"class.std::__cxx11::basic_string\"* %6 to %union.anon**\l  store %union.anon* %98, %union.anon** %99, align 8, !tbaa !2, !alias.scope\l... !16\l  %100 = getelementptr inbounds %\"class.std::__cxx11::basic_string\",\l... %\"class.std::__cxx11::basic_string\"* %97, i64 0, i32 0, i32 0\l  %101 = load i8*, i8** %100, align 8, !tbaa !9\l  %102 = getelementptr inbounds %\"class.std::__cxx11::basic_string\",\l... %\"class.std::__cxx11::basic_string\"* %97, i64 0, i32 2\l  %103 = bitcast %union.anon* %102 to i8*\l  %104 = icmp eq i8* %101, %103\l  br i1 %104, label %105, label %107\l|{<s0>T|<s1>F}}"];
	Node0x55e8cfff7570:s0 -> Node0x55e8cfff7ea0;
	Node0x55e8cfff7570:s1 -> Node0x55e8cfff7ef0;
	Node0x55e8cfff7ea0 [shape=record,label="{%105:\l\l  %106 = bitcast %union.anon* %98 to i8*\l  call void @llvm.memcpy.p0i8.p0i8.i64(i8* nonnull %106, i8* nonnull %101, i64\l... 16, i32 1, i1 false) #2\l  br label %112\l}"];
	Node0x55e8cfff7ea0 -> Node0x55e8cfff80d0;
	Node0x55e8cfff7ef0 [shape=record,label="{%107:\l\l  %108 = getelementptr inbounds %\"class.std::__cxx11::basic_string\",\l... %\"class.std::__cxx11::basic_string\"* %6, i64 0, i32 0, i32 0\l  store i8* %101, i8** %108, align 8, !tbaa !9, !alias.scope !16\l  %109 = getelementptr inbounds %\"class.std::__cxx11::basic_string\",\l... %\"class.std::__cxx11::basic_string\"* %97, i64 0, i32 2, i32 0\l  %110 = load i64, i64* %109, align 8, !tbaa !11\l  %111 = getelementptr inbounds %\"class.std::__cxx11::basic_string\",\l... %\"class.std::__cxx11::basic_string\"* %6, i64 0, i32 2, i32 0\l  store i64 %110, i64* %111, align 8, !tbaa !11, !alias.scope !16\l  br label %112\l}"];
	Node0x55e8cfff7ef0 -> Node0x55e8cfff80d0;
	Node0x55e8cfff80d0 [shape=record,label="{%112:\l\l  %113 = getelementptr inbounds %\"class.std::__cxx11::basic_string\",\l... %\"class.std::__cxx11::basic_string\"* %97, i64 0, i32 1\l  %114 = load i64, i64* %113, align 8, !tbaa !12\l  %115 = getelementptr inbounds %\"class.std::__cxx11::basic_string\",\l... %\"class.std::__cxx11::basic_string\"* %6, i64 0, i32 1\l  store i64 %114, i64* %115, align 8, !tbaa !12, !alias.scope !16\l  %116 = bitcast %\"class.std::__cxx11::basic_string\"* %97 to %union.anon**\l  store %union.anon* %102, %union.anon** %116, align 8, !tbaa !9\l  store i64 0, i64* %113, align 8, !tbaa !12\l  store i8 0, i8* %103, align 1, !tbaa !11\l  %117 = load i64, i64* %115, align 8, !tbaa !12, !noalias !19\l  %118 = icmp eq i64 %117, 9223372036854775807\l  br i1 %118, label %119, label %121\l|{<s0>T|<s1>F}}"];
	Node0x55e8cfff80d0:s0 -> Node0x55e8cfff8aa0;
	Node0x55e8cfff80d0:s1 -> Node0x55e8cfff8b30;
	Node0x55e8cfff8aa0 [shape=record,label="{%119:\l\l  invoke void @_ZSt20__throw_length_errorPKc(i8* getelementptr inbounds ([21 x\l... i8], [21 x i8]* @.str.11, i64 0, i64 0)) #11\l          to label %120 unwind label %186\l}"];
	Node0x55e8cfff8aa0 -> Node0x55e8cfff8c50;
	Node0x55e8cfff8aa0 -> Node0x55e8cfff8ca0;
	Node0x55e8cfff8c50 [shape=record,label="{%120:\l\l  unreachable\l}"];
	Node0x55e8cfff8b30 [shape=record,label="{%121:\l\l  %122 = invoke dereferenceable(32) %\"class.std::__cxx11::basic_string\"*\l... @_ZNSt7__cxx1112basic_stringIcSt11char_traitsIcESaIcEE9_M_appendEPKcm(%\"class.\l...std::__cxx11::basic_string\"* nonnull %6, i8* getelementptr inbounds ([2 x i8],\l... [2 x i8]* @.str.10, i64 0, i64 0), i64 1)\l          to label %123 unwind label %186\l}"];
	Node0x55e8cfff8b30 -> Node0x55e8cfff8f20;
	Node0x55e8cfff8b30 -> Node0x55e8cfff8ca0;
	Node0x55e8cfff8f20 [shape=record,label="{%123:\l\l  %124 = getelementptr inbounds %\"class.std::__cxx11::basic_string\",\l... %\"class.std::__cxx11::basic_string\"* %5, i64 0, i32 2\l  %125 = bitcast %\"class.std::__cxx11::basic_string\"* %5 to %union.anon**\l  store %union.anon* %124, %union.anon** %125, align 8, !tbaa !2, !alias.scope\l... !19\l  %126 = getelementptr inbounds %\"class.std::__cxx11::basic_string\",\l... %\"class.std::__cxx11::basic_string\"* %122, i64 0, i32 0, i32 0\l  %127 = load i8*, i8** %126, align 8, !tbaa !9\l  %128 = getelementptr inbounds %\"class.std::__cxx11::basic_string\",\l... %\"class.std::__cxx11::basic_string\"* %122, i64 0, i32 2\l  %129 = bitcast %union.anon* %128 to i8*\l  %130 = icmp eq i8* %127, %129\l  br i1 %130, label %131, label %134\l|{<s0>T|<s1>F}}"];
	Node0x55e8cfff8f20:s0 -> Node0x55e8cfff8e50;
	Node0x55e8cfff8f20:s1 -> Node0x55e8cfffa2e0;
	Node0x55e8cfff8e50 [shape=record,label="{%131:\l\l  %132 = bitcast %union.anon* %124 to i8*\l  call void @llvm.memcpy.p0i8.p0i8.i64(i8* nonnull %132, i8* nonnull %127, i64\l... 16, i32 1, i1 false) #2\l  %133 = getelementptr inbounds %\"class.std::__cxx11::basic_string\",\l... %\"class.std::__cxx11::basic_string\"* %5, i64 0, i32 0, i32 0\l  br label %140\l}"];
	Node0x55e8cfff8e50 -> Node0x55e8cfffa660;
	Node0x55e8cfffa2e0 [shape=record,label="{%134:\l\l  %135 = getelementptr inbounds %\"class.std::__cxx11::basic_string\",\l... %\"class.std::__cxx11::basic_string\"* %5, i64 0, i32 0, i32 0\l  store i8* %127, i8** %135, align 8, !tbaa !9, !alias.scope !19\l  %136 = getelementptr inbounds %\"class.std::__cxx11::basic_string\",\l... %\"class.std::__cxx11::basic_string\"* %122, i64 0, i32 2, i32 0\l  %137 = load i64, i64* %136, align 8, !tbaa !11\l  %138 = getelementptr inbounds %\"class.std::__cxx11::basic_string\",\l... %\"class.std::__cxx11::basic_string\"* %5, i64 0, i32 2, i32 0\l  store i64 %137, i64* %138, align 8, !tbaa !11, !alias.scope !19\l  %139 = bitcast %union.anon* %124 to i8*\l  br label %140\l}"];
	Node0x55e8cfffa2e0 -> Node0x55e8cfffa660;
	Node0x55e8cfffa660 [shape=record,label="{%140:\l\l  %141 = phi i8* [ %139, %134 ], [ %132, %131 ]\l  %142 = phi i8** [ %135, %134 ], [ %133, %131 ]\l  %143 = getelementptr inbounds %\"class.std::__cxx11::basic_string\",\l... %\"class.std::__cxx11::basic_string\"* %122, i64 0, i32 1\l  %144 = load i64, i64* %143, align 8, !tbaa !12\l  %145 = getelementptr inbounds %\"class.std::__cxx11::basic_string\",\l... %\"class.std::__cxx11::basic_string\"* %5, i64 0, i32 1\l  store i64 %144, i64* %145, align 8, !tbaa !12, !alias.scope !19\l  %146 = bitcast %\"class.std::__cxx11::basic_string\"* %122 to %union.anon**\l  store %union.anon* %128, %union.anon** %146, align 8, !tbaa !9\l  store i64 0, i64* %143, align 8, !tbaa !12\l  store i8 0, i8* %129, align 1, !tbaa !11\l  call void\l... @_ZN8LogScopeC2ENSt7__cxx1112basic_stringIcSt11char_traitsIcESaIcEEE(%class.Lo\l...gScope* %0, %\"class.std::__cxx11::basic_string\"* nonnull %5) #2\l  %147 = load i8*, i8** %142, align 8, !tbaa !9\l  %148 = icmp eq i8* %147, %141\l  br i1 %148, label %150, label %149\l|{<s0>T|<s1>F}}"];
	Node0x55e8cfffa660:s0 -> Node0x55e8cffee3b0;
	Node0x55e8cfffa660:s1 -> Node0x55e8cffee780;
	Node0x55e8cffee780 [shape=record,label="{%149:\l\l  call void @_ZdlPv(i8* %147) #2\l  br label %150\l}"];
	Node0x55e8cffee780 -> Node0x55e8cffee3b0;
	Node0x55e8cffee3b0 [shape=record,label="{%150:\l\l  %151 = getelementptr inbounds %\"class.std::__cxx11::basic_string\",\l... %\"class.std::__cxx11::basic_string\"* %6, i64 0, i32 0, i32 0\l  %152 = load i8*, i8** %151, align 8, !tbaa !9\l  %153 = bitcast %union.anon* %98 to i8*\l  %154 = icmp eq i8* %152, %153\l  br i1 %154, label %156, label %155\l|{<s0>T|<s1>F}}"];
	Node0x55e8cffee3b0:s0 -> Node0x55e8cffeec80;
	Node0x55e8cffee3b0:s1 -> Node0x55e8cffeecd0;
	Node0x55e8cffeecd0 [shape=record,label="{%155:\l\l  call void @_ZdlPv(i8* %152) #2\l  br label %156\l}"];
	Node0x55e8cffeecd0 -> Node0x55e8cffeec80;
	Node0x55e8cffeec80 [shape=record,label="{%156:\l\l  %157 = load i8*, i8** %82, align 8, !tbaa !9\l  %158 = getelementptr inbounds %\"class.std::__cxx11::basic_string\",\l... %\"class.std::__cxx11::basic_string\"* %9, i64 0, i32 2\l  %159 = bitcast %union.anon* %158 to i8*\l  %160 = icmp eq i8* %157, %159\l  br i1 %160, label %162, label %161\l|{<s0>T|<s1>F}}"];
	Node0x55e8cffeec80:s0 -> Node0x55e8cffef0d0;
	Node0x55e8cffeec80:s1 -> Node0x55e8cffef120;
	Node0x55e8cffef120 [shape=record,label="{%161:\l\l  call void @_ZdlPv(i8* %157) #2\l  br label %162\l}"];
	Node0x55e8cffef120 -> Node0x55e8cffef0d0;
	Node0x55e8cffef0d0 [shape=record,label="{%162:\l\l  call void @llvm.lifetime.end.p0i8(i64 32, i8* nonnull %68) #2\l  %163 = load i8*, i8** %74, align 8, !tbaa !9\l  %164 = icmp eq i8* %163, %76\l  br i1 %164, label %166, label %165\l|{<s0>T|<s1>F}}"];
	Node0x55e8cffef0d0:s0 -> Node0x55e8cfffd250;
	Node0x55e8cffef0d0:s1 -> Node0x55e8cfffd2a0;
	Node0x55e8cfffd2a0 [shape=record,label="{%165:\l\l  call void @_ZdlPv(i8* %163) #2\l  br label %166\l}"];
	Node0x55e8cfffd2a0 -> Node0x55e8cfffd250;
	Node0x55e8cfffd250 [shape=record,label="{%166:\l\l  %167 = getelementptr inbounds %\"class.std::__cxx11::basic_string\",\l... %\"class.std::__cxx11::basic_string\"* %8, i64 0, i32 0, i32 0\l  %168 = load i8*, i8** %167, align 8, !tbaa !9\l  %169 = icmp eq i8* %168, %16\l  br i1 %169, label %171, label %170\l|{<s0>T|<s1>F}}"];
	Node0x55e8cfffd250:s0 -> Node0x55e8cfffd630;
	Node0x55e8cfffd250:s1 -> Node0x55e8cfffd680;
	Node0x55e8cfffd680 [shape=record,label="{%170:\l\l  call void @_ZdlPv(i8* %168) #2\l  br label %171\l}"];
	Node0x55e8cfffd680 -> Node0x55e8cfffd630;
	Node0x55e8cfffd630 [shape=record,label="{%171:\l\l  call void @llvm.lifetime.end.p0i8(i64 32, i8* nonnull %12) #2\l  call void @llvm.lifetime.end.p0i8(i64 32, i8* nonnull %11) #2\l  call void @llvm.lifetime.end.p0i8(i64 32, i8* nonnull %10) #2\l  ret void\l}"];
	Node0x55e8cffefd00 [shape=record,label="{%172:\l\l  %173 = landingpad \{ i8*, i32 \}\l          catch i8* null\l  %174 = extractvalue \{ i8*, i32 \} %173, 0\l  br label %214\l}"];
	Node0x55e8cffefd00 -> Node0x55e8cfffdcd0;
	Node0x55e8cfff3460 [shape=record,label="{%175:\l\l  %176 = landingpad \{ i8*, i32 \}\l          catch i8* null\l  %177 = extractvalue \{ i8*, i32 \} %176, 0\l  br label %208\l}"];
	Node0x55e8cfff3460 -> Node0x55e8cfffde50;
	Node0x55e8cfff5eb0 [shape=record,label="{%178:\l\l  %179 = landingpad \{ i8*, i32 \}\l          catch i8* null\l  %180 = extractvalue \{ i8*, i32 \} %179, 0\l  %181 = getelementptr inbounds %\"class.std::__cxx11::basic_string\",\l... %\"class.std::__cxx11::basic_string\"* %7, i64 0, i32 0, i32 0\l  %182 = bitcast %union.anon* %49 to i8*\l  br label %201\l}"];
	Node0x55e8cfff5eb0 -> Node0x55e8cfffe120;
	Node0x55e8cfff75c0 [shape=record,label="{%183:\l\l  %184 = landingpad \{ i8*, i32 \}\l          catch i8* null\l  %185 = extractvalue \{ i8*, i32 \} %184, 0\l  br label %194\l}"];
	Node0x55e8cfff75c0 -> Node0x55e8cfffe2e0;
	Node0x55e8cfff8ca0 [shape=record,label="{%186:\l\l  %187 = landingpad \{ i8*, i32 \}\l          catch i8* null\l  %188 = extractvalue \{ i8*, i32 \} %187, 0\l  %189 = getelementptr inbounds %\"class.std::__cxx11::basic_string\",\l... %\"class.std::__cxx11::basic_string\"* %6, i64 0, i32 0, i32 0\l  %190 = load i8*, i8** %189, align 8, !tbaa !9\l  %191 = bitcast %union.anon* %98 to i8*\l  %192 = icmp eq i8* %190, %191\l  br i1 %192, label %194, label %193\l|{<s0>T|<s1>F}}"];
	Node0x55e8cfff8ca0:s0 -> Node0x55e8cfffe2e0;
	Node0x55e8cfff8ca0:s1 -> Node0x55e8cfffe680;
	Node0x55e8cfffe680 [shape=record,label="{%193:\l\l  call void @_ZdlPv(i8* %190) #2\l  br label %194\l}"];
	Node0x55e8cfffe680 -> Node0x55e8cfffe2e0;
	Node0x55e8cfffe2e0 [shape=record,label="{%194:\l\l  %195 = phi i8* [ %185, %183 ], [ %188, %186 ], [ %188, %193 ]\l  %196 = load i8*, i8** %82, align 8, !tbaa !9\l  %197 = getelementptr inbounds %\"class.std::__cxx11::basic_string\",\l... %\"class.std::__cxx11::basic_string\"* %9, i64 0, i32 2\l  %198 = bitcast %union.anon* %197 to i8*\l  %199 = icmp eq i8* %196, %198\l  br i1 %199, label %201, label %200\l|{<s0>T|<s1>F}}"];
	Node0x55e8cfffe2e0:s0 -> Node0x55e8cfffe120;
	Node0x55e8cfffe2e0:s1 -> Node0x55e8cfffeb60;
	Node0x55e8cfffeb60 [shape=record,label="{%200:\l\l  call void @_ZdlPv(i8* %196) #2\l  br label %201\l}"];
	Node0x55e8cfffeb60 -> Node0x55e8cfffe120;
	Node0x55e8cfffe120 [shape=record,label="{%201:\l\l  %202 = phi i8* [ %76, %200 ], [ %76, %194 ], [ %182, %178 ]\l  %203 = phi i8** [ %74, %200 ], [ %74, %194 ], [ %181, %178 ]\l  %204 = phi i8* [ %195, %200 ], [ %195, %194 ], [ %180, %178 ]\l  call void @llvm.lifetime.end.p0i8(i64 32, i8* nonnull %68) #2\l  %205 = load i8*, i8** %203, align 8, !tbaa !9\l  %206 = icmp eq i8* %205, %202\l  br i1 %206, label %208, label %207\l|{<s0>T|<s1>F}}"];
	Node0x55e8cfffe120:s0 -> Node0x55e8cfffde50;
	Node0x55e8cfffe120:s1 -> Node0x55e8cffff1d0;
	Node0x55e8cffff1d0 [shape=record,label="{%207:\l\l  call void @_ZdlPv(i8* %205) #2\l  br label %208\l}"];
	Node0x55e8cffff1d0 -> Node0x55e8cfffde50;
	Node0x55e8cfffde50 [shape=record,label="{%208:\l\l  %209 = phi i8* [ %177, %175 ], [ %204, %201 ], [ %204, %207 ]\l  %210 = getelementptr inbounds %\"class.std::__cxx11::basic_string\",\l... %\"class.std::__cxx11::basic_string\"* %8, i64 0, i32 0, i32 0\l  %211 = load i8*, i8** %210, align 8, !tbaa !9\l  %212 = icmp eq i8* %211, %16\l  br i1 %212, label %214, label %213\l|{<s0>T|<s1>F}}"];
	Node0x55e8cfffde50:s0 -> Node0x55e8cfffdcd0;
	Node0x55e8cfffde50:s1 -> Node0x55e8cffff620;
	Node0x55e8cffff620 [shape=record,label="{%213:\l\l  call void @_ZdlPv(i8* %211) #2\l  br label %214\l}"];
	Node0x55e8cffff620 -> Node0x55e8cfffdcd0;
	Node0x55e8cfffdcd0 [shape=record,label="{%214:\l\l  %215 = phi i8* [ %174, %172 ], [ %209, %208 ], [ %209, %213 ]\l  call void @llvm.lifetime.end.p0i8(i64 32, i8* nonnull %12) #2\l  call void @llvm.lifetime.end.p0i8(i64 32, i8* nonnull %11) #2\l  call void @llvm.lifetime.end.p0i8(i64 32, i8* nonnull %10) #2\l  call void @__clang_call_terminate(i8* %215) #12\l  unreachable\l}"];
}
