digraph "CFG for '_Z3sumii' function" {
	label="CFG for '_Z3sumii' function";

	Node0x55e8cffe9c80 [shape=record,label="{%2:\l  %3 = alloca %class.LogScope, align 8\l  %4 = bitcast %class.LogScope* %3 to i8*\l  call void @llvm.lifetime.start.p0i8(i64 32, i8* nonnull %4) #2\l  call void @_ZN8LogScopeC2IiEEPKcT_(%class.LogScope* nonnull %3, i8*\l... getelementptr inbounds ([4 x i8], [4 x i8]* @.str, i64 0, i64 0), i32 %0) #2\l  %5 = icmp slt i32 %0, 1\l  br i1 %5, label %6, label %21\l|{<s0>T|<s1>F}}"];
	Node0x55e8cffe9c80:s0 -> Node0x55e8cffeaa30;
	Node0x55e8cffe9c80:s1 -> Node0x55e8cffeaac0;
	Node0x55e8cffeaa30 [shape=record,label="{%6:\l\l  %7 = and i32 %1, 1\l  %8 = icmp eq i32 %7, 0\l  br i1 %8, label %9, label %27\l|{<s0>T|<s1>F}}"];
	Node0x55e8cffeaa30:s0 -> Node0x55e8cffe9e30;
	Node0x55e8cffeaa30:s1 -> Node0x55e8cffead50;
	Node0x55e8cffe9e30 [shape=record,label="{%9:\l\l  %10 = call i8* @__cxa_allocate_exception(i64 16) #2\l  %11 = bitcast i8* %10 to %\"class.std::out_of_range\"*\l  invoke void @_ZNSt12out_of_rangeC1EPKc(%\"class.std::out_of_range\"* %11, i8*\l... getelementptr inbounds ([22 x i8], [22 x i8]* @.str.1, i64 0, i64 0))\l          to label %12 unwind label %13\l}"];
	Node0x55e8cffe9e30 -> Node0x55e8cffeb1f0;
	Node0x55e8cffe9e30 -> Node0x55e8cffeb280;
	Node0x55e8cffeb1f0 [shape=record,label="{%12:\l\l  invoke void @__cxa_throw(i8* %10, i8* bitcast (i8** @_ZTISt12out_of_range to\l... i8*), i8* bitcast (void (%\"class.std::out_of_range\"*)*\l... @_ZNSt12out_of_rangeD1Ev to i8*)) #11\l          to label %34 unwind label %17\l}"];
	Node0x55e8cffeb1f0 -> Node0x55e8cffeb770;
	Node0x55e8cffeb1f0 -> Node0x55e8cffeb800;
	Node0x55e8cffeb280 [shape=record,label="{%13:\l\l  %14 = landingpad \{ i8*, i32 \}\l          cleanup\l  %15 = extractvalue \{ i8*, i32 \} %14, 0\l  %16 = extractvalue \{ i8*, i32 \} %14, 1\l  call void @__cxa_free_exception(i8* %10) #2\l  br label %29\l}"];
	Node0x55e8cffeb280 -> Node0x55e8cffebd90;
	Node0x55e8cffeb800 [shape=record,label="{%17:\l\l  %18 = landingpad \{ i8*, i32 \}\l          cleanup\l  %19 = extractvalue \{ i8*, i32 \} %18, 0\l  %20 = extractvalue \{ i8*, i32 \} %18, 1\l  br label %29\l}"];
	Node0x55e8cffeb800 -> Node0x55e8cffebd90;
	Node0x55e8cffeaac0 [shape=record,label="{%21:\l\l  %22 = add nsw i32 %0, -1\l  %23 = add nsw i32 %1, 1\l  %24 = invoke i32 @_Z3sumii(i32 %22, i32 %23)\l          to label %25 unwind label %17\l}"];
	Node0x55e8cffeaac0 -> Node0x55e8cffec0d0;
	Node0x55e8cffeaac0 -> Node0x55e8cffeb800;
	Node0x55e8cffec0d0 [shape=record,label="{%25:\l\l  %26 = add nsw i32 %24, %0\l  br label %27\l}"];
	Node0x55e8cffec0d0 -> Node0x55e8cffead50;
	Node0x55e8cffead50 [shape=record,label="{%27:\l\l  %28 = phi i32 [ %26, %25 ], [ 0, %6 ]\l  call void @_ZN8LogScopeD2Ev(%class.LogScope* nonnull %3) #2\l  call void @llvm.lifetime.end.p0i8(i64 32, i8* nonnull %4) #2\l  ret i32 %28\l}"];
	Node0x55e8cffebd90 [shape=record,label="{%29:\l\l  %30 = phi i8* [ %19, %17 ], [ %15, %13 ]\l  %31 = phi i32 [ %20, %17 ], [ %16, %13 ]\l  call void @_ZN8LogScopeD2Ev(%class.LogScope* nonnull %3) #2\l  call void @llvm.lifetime.end.p0i8(i64 32, i8* nonnull %4) #2\l  %32 = insertvalue \{ i8*, i32 \} undef, i8* %30, 0\l  %33 = insertvalue \{ i8*, i32 \} %32, i32 %31, 1\l  resume \{ i8*, i32 \} %33\l}"];
	Node0x55e8cffeb770 [shape=record,label="{%34:\l\l  unreachable\l}"];
}
