{
  "page": 1,
  "pages_count": 1,
  "rows_count": 10,
  "rows": [
    {
      "_id": "events/498740341",
      "_key": "498740341",
      "_rev": "_guTVnSu---",
      "author": {
        "mo_id": 42,
        "user_id": 40,
        "user_name": "Мельничук М. С."
      },
      "group": "INDICATORS",
      "msg": "Просмотр матрицы",
      "params": {
        "indicator_to_mo_id": 520,
        "period": {
          "end": "2023-10-31",
          "start": "2023-10-01",
          "type_id": 4,
          "type_key": "month"
        },
        "platform": "web"
      },
      "time": "2023-10-06T14:15:11.944268646Z",
      "type": "MATRIX_REQUEST"
    },
    }
}