[
    {
        "Nr. Crt": 1,
        "ID Student": 451145,
        "NUME SI PRENUME": "ABABI I. VLAD",
        "Grupa": "3123a",
        "E-mail": "vlad.ababi@student.usv.ro"
    },
    {
        "Nr. Crt": 2,
        "ID Student": 65164,
        "NUME SI PRENUME": "ADOCHI\u021aEI V. ALEXANDRU",
        "Grupa": "3121a",
        "E-mail": "alexandru.adochitei@student.usv.ro"
    },
    {
        "Nr. Crt": 3,
        "ID Student": 66420,
        "NUME SI PRENUME": "ALBU A.D. EDUARD",
        "Grupa": "3121a",
        "E-mail": "eduard.albu@student.usv.ro"
    },
    {
        "Nr. Crt": 4,
        "ID Student": 65518,
        "NUME SI PRENUME": "ALUCULESEI M. ANDREI-BOGDAN",
        "Grupa": "3121b",
        "E-mail": "andrei.aluculesei@student.usv.ro"
    },
    {
        "Nr. Crt": 5,
        "ID Student": 67506,
        "NUME SI PRENUME": "ANDRIE\u0218 L. GEORGE-\u0218ERBAN",
        "Grupa": "3122a",
        "E-mail": "george.andries@student.usv.ro"
    },
    {
        "Nr. Crt": 6,
        "ID Student": 64962,
        "NUME SI PRENUME": "ANDRONIC V. DELIA-DUMITRI\u021aA",
        "Grupa": "3123a",
        "E-mail": "delia.andronic@student.usv.ro"
    },
    {
        "Nr. Crt": 7,
        "ID Student": 68959,
        "NUME SI PRENUME": "AYDOGAN L. MERT",
        "Grupa": "3121a",
        "E-mail": "mert.aydogan@student.usv.ro"
    },
    {
        "Nr. Crt": 8,
        "ID Student": 457648,
        "NUME SI PRENUME": "BALAN P. VICTOR",
        "Grupa": "3121b",
        "E-mail": "victor.balan@student.usv.ro"
    },
    {
        "Nr. Crt": 9,
        "ID Student": 66062,
        "NUME SI PRENUME": "BAROIU C. CLAUDIU-TEODOR",
        "Grupa": "3122a",
        "E-mail": "claudiu.baroiu@student.usv.ro"
    },
    {
        "Nr. Crt": 10,
        "ID Student": 66221,
        "NUME SI PRENUME": "B\u00ceRGOVAN  G.C. ALEXANDRU-DUMITREL",
        "Grupa": "3121b",
        "E-mail": "alexandru.birgovan@student.usv.ro"
    },
    {
        "Nr. Crt": 11,
        "ID Student": 65833,
        "NUME SI PRENUME": "B\u00ceRSAN D. DORIN-ALEXANDRU",
        "Grupa": "3122a",
        "E-mail": "dorin.birsan@student.usv.ro"
    },
    {
        "Nr. Crt": 12,
        "ID Student": 65925,
        "NUME SI PRENUME": "BOLOHAN V. COSMIN-DUMITRU",
        "Grupa": "3121b",
        "E-mail": "dumitru.bolohan@student.usv.ro"
    },
    {
        "Nr. Crt": 13,
        "ID Student": 66664,
        "NUME SI PRENUME": "BONDAR V. IRINA",
        "Grupa": "3121a",
        "E-mail": "irina.bondar@student.usv.ro"
    },
    {
        "Nr. Crt": 14,
        "ID Student": 453344,
        "NUME SI PRENUME": "BORDEI C. VASILE",
        "Grupa": "3122a",
        "E-mail": "vasile.bordei@student.usv.ro"
    },
    {
        "Nr. Crt": 15,
        "ID Student": 64883,
        "NUME SI PRENUME": "BR\u0102D\u0102\u021aAN M.T. COSMIN-GHEORGHE",
        "Grupa": "3121b",
        "E-mail": "cosmin.bradatan@student.usv.ro"
    },
    {
        "Nr. Crt": 17,
        "ID Student": 453196,
        "NUME SI PRENUME": "CANEVSCHII N. DANIEL",
        "Grupa": "3121b",
        "E-mail": "daniel.canevschii@student.usv.ro"
    },
    {
        "Nr. Crt": 18,
        "ID Student": 67627,
        "NUME SI PRENUME": "CATARGIU \u0218. \u0218TEFAN-ILIU\u021a\u0102",
        "Grupa": "3124a",
        "E-mail": "stefan.catargiu1@student.usv.ro"
    },
    {
        "Nr. Crt": 19,
        "ID Student": 66288,
        "NUME SI PRENUME": "CHISILICIUC I.A. ALINA",
        "Grupa": "3124a",
        "E-mail": "alina.chisiliciuc@student.usv.ro"
    },
    {
        "Nr. Crt": 20,
        "ID Student": 66283,
        "NUME SI PRENUME": "CHISILICIUC I.A. DIANA",
        "Grupa": "3124a",
        "E-mail": "ilinca.enache@student.usv.ro"
    },
    {
        "Nr. Crt": 21,
        "ID Student": 456667,
        "NUME SI PRENUME": "CIOBAN I. BENIAMIN",
        "Grupa": "3122b",
        "E-mail": "beniamin.cioban@student.usv.ro"
    },
    {
        "Nr. Crt": 22,
        "ID Student": 64851,
        "NUME SI PRENUME": "CIOBANU C.I. DRAGO\u0218-ALEXANDRU",
        "Grupa": "3122a",
        "E-mail": "dragos.ciobanu@student.usv.ro"
    },
    {
        "Nr. Crt": 23,
        "ID Student": 453307,
        "NUME SI PRENUME": "CIORNEI M. IONU\u021a-BOGDAN",
        "Grupa": "3123b",
        "E-mail": "bogdan.ciornei@student.usv.ro"
    },
    {
        "Nr. Crt": 24,
        "ID Student": 452639,
        "NUME SI PRENUME": "COCRI\u0218 V. IULIAN",
        "Grupa": "3122a",
        "E-mail": "iulian.cocris@student.usv.ro"
    },
    {
        "Nr. Crt": 25,
        "ID Student": 453830,
        "NUME SI PRENUME": "CONSTANTIN V. \u0218TEFAN",
        "Grupa": "3123a",
        "E-mail": "stefan.constantin3@student.usv.ro"
    },
    {
        "Nr. Crt": 26,
        "ID Student": 65202,
        "NUME SI PRENUME": "CROITORIU C. LUCIAN",
        "Grupa": "3123a",
        "E-mail": "ioan.marincuta@student.usv.ro"
    },
    {
        "Nr. Crt": 27,
        "ID Student": 452886,
        "NUME SI PRENUME": "CROITORU I. IGOR",
        "Grupa": "3122b",
        "E-mail": "igor.croitoru@student.usv.ro"
    },
    {
        "Nr. Crt": 28,
        "ID Student": 66320,
        "NUME SI PRENUME": "CUDLA G. CRISTIAN",
        "Grupa": "3123a",
        "E-mail": "cristian.cudla@student.usv.ro"
    },
    {
        "Nr. Crt": 29,
        "ID Student": 452853,
        "NUME SI PRENUME": "CUSTRIN V. DANY-TEODOR",
        "Grupa": "3121b",
        "E-mail": "dany.custrin@student.usv.ro"
    },
    {
        "Nr. Crt": 30,
        "ID Student": 450740,
        "NUME SI PRENUME": "ECOBOAEA M. DENIS-MIHAI",
        "Grupa": "3123b",
        "E-mail": "denis.ecoboaea@student.usv.ro"
    },
    {
        "Nr. Crt": 31,
        "ID Student": 452878,
        "NUME SI PRENUME": "ENACHE B.G. ILINCA-MARIA",
        "Grupa": "3121b",
        "E-mail": "petru.ghidoarca@student.usv.ro"
    },
    {
        "Nr. Crt": 32,
        "ID Student": 452863,
        "NUME SI PRENUME": "FANARI I. MAXIM",
        "Grupa": "3123b",
        "E-mail": "maxim.fanari@student.usv.ro"
    },
    {
        "Nr. Crt": 33,
        "ID Student": 453220,
        "NUME SI PRENUME": "FRANCIUC C.G. ROBERT-C\u0102T\u0102LIN",
        "Grupa": "3121b",
        "E-mail": "robert.franciuc@student.usv.ro"
    },
    {
        "Nr. Crt": 34,
        "ID Student": 65806,
        "NUME SI PRENUME": "GHERASIMESCU P. EMANUEL",
        "Grupa": "3123b",
        "E-mail": "emanuel.gherasimescu@student.usv.ro"
    },
    {
        "Nr. Crt": 35,
        "ID Student": 65444,
        "NUME SI PRENUME": "GHIDOARCA V. PETRU-CRISTI",
        "Grupa": "3122b",
        "E-mail": "lucian.croitoriu@student.usv.ro"
    },
    {
        "Nr. Crt": 36,
        "ID Student": 452790,
        "NUME SI PRENUME": "GHILESCU M. DUMITRU",
        "Grupa": "3121b",
        "E-mail": "dumitru.ghilescu@student.usv.ro"
    },
    {
        "Nr. Crt": 37,
        "ID Student": 452450,
        "NUME SI PRENUME": "GRATII E. STANISLAV",
        "Grupa": "3123b",
        "E-mail": "stanislav.gratii@student.usv.ro"
    },
    {
        "Nr. Crt": 38,
        "ID Student": 66614,
        "NUME SI PRENUME": "GULA V.C. ROBERT-DUMITRU",
        "Grupa": "3123a",
        "E-mail": "robert.gula@student.usv.ro"
    },
    {
        "Nr. Crt": 39,
        "ID Student": 65215,
        "NUME SI PRENUME": "GULICIUC I.C. DENIS-MARIAN",
        "Grupa": "3121b",
        "E-mail": "denis.guliciuc@student.usv.ro"
    },
    {
        "Nr. Crt": 40,
        "ID Student": 451350,
        "NUME SI PRENUME": "HALEVICI D. DIANA-GEORGIANA",
        "Grupa": "3123a",
        "E-mail": "diana.halevici@student.usv.ro"
    },
    {
        "Nr. Crt": 41,
        "ID Student": 65016,
        "NUME SI PRENUME": "HAPCA V. DANIEL",
        "Grupa": "3124a",
        "E-mail": "daniel.hapca@student.usv.ro"
    },
    {
        "Nr. Crt": 42,
        "ID Student": 64907,
        "NUME SI PRENUME": "HATNEAN C. LAVINIA",
        "Grupa": "3121a",
        "E-mail": "lavinia.hatnean@student.usv.ro"
    },
    {
        "Nr. Crt": 43,
        "ID Student": 66238,
        "NUME SI PRENUME": "HER\u021aANU M.L. R\u0102ZVAN",
        "Grupa": "3123a",
        "E-mail": "razvan.hertanu@student.usv.ro"
    },
    {
        "Nr. Crt": 44,
        "ID Student": 67253,
        "NUME SI PRENUME": "HORGA F. DANIEL",
        "Grupa": "3123b",
        "E-mail": "daniel.horga@student.usv.ro"
    },
    {
        "Nr. Crt": 45,
        "ID Student": 66163,
        "NUME SI PRENUME": "HORJU C.C. ALEXANDRU - LUCIAN",
        "Grupa": "3124a",
        "E-mail": "alexandru.horju@student.usv.ro"
    },
    {
        "Nr. Crt": 46,
        "ID Student": 65021,
        "NUME SI PRENUME": "HRECENIUC C. LARISA",
        "Grupa": "3121a",
        "E-mail": "larisa.hreceniuc@student.usv.ro"
    },
    {
        "Nr. Crt": 47,
        "ID Student": 451546,
        "NUME SI PRENUME": "HU\u0218ANU A. LIVIU",
        "Grupa": "3124a",
        "E-mail": "liviu.husanu@student.usv.ro"
    },
    {
        "Nr. Crt": 48,
        "ID Student": 66227,
        "NUME SI PRENUME": "IB\u0102NESCU V. DRAGO\u0218",
        "Grupa": "3124a",
        "E-mail": "dragos.ibanescu@student.usv.ro"
    },
    {
        "Nr. Crt": 49,
        "ID Student": 64904,
        "NUME SI PRENUME": "ICHIM J.D. ROBERT-CONSTANTIN",
        "Grupa": "3121b",
        "E-mail": "robert.ichim1@student.usv.ro"
    },
    {
        "Nr. Crt": 50,
        "ID Student": 65244,
        "NUME SI PRENUME": "ILCULESEI-MEGLEI C. \u0218TEFAN",
        "Grupa": "3121a",
        "E-mail": "stefan.ilculesei@student.usv.ro"
    },
    {
        "Nr. Crt": 51,
        "ID Student": 66013,
        "NUME SI PRENUME": "ILISEI I.C. CIPRIAN",
        "Grupa": "3122b",
        "E-mail": "ciprian.ilisei@student.usv.ro"
    },
    {
        "Nr. Crt": 52,
        "ID Student": 64679,
        "NUME SI PRENUME": "IROFTEI D.V. DUMITRU-ANDREI",
        "Grupa": "3123a",
        "E-mail": "dumitru.iroftei@student.usv.ro"
    },
    {
        "Nr. Crt": 53,
        "ID Student": 67230,
        "NUME SI PRENUME": "ISTRATE M. MIHAI",
        "Grupa": "3122a",
        "E-mail": "mihai.istrate@student.usv.ro"
    },
    {
        "Nr. Crt": 54,
        "ID Student": 66212,
        "NUME SI PRENUME": "JOROVEANU V. ALEXANDRA",
        "Grupa": "3121a",
        "E-mail": "alexandra.joroveanu@student.usv.ro"
    },
    {
        "Nr. Crt": 55,
        "ID Student": 451187,
        "NUME SI PRENUME": "LAZURC\u0102 L. OVIDIU",
        "Grupa": "3121b",
        "E-mail": "ovidiu.lazurca@student.usv.ro"
    },
    {
        "Nr. Crt": 56,
        "ID Student": 450671,
        "NUME SI PRENUME": "LEAHU V. ARTIOM",
        "Grupa": "3122b",
        "E-mail": "artiom.leahu@student.usv.ro"
    },
    {
        "Nr. Crt": 57,
        "ID Student": 64958,
        "NUME SI PRENUME": "LOBIUC S. ANDRA-EVELINA",
        "Grupa": "3122b",
        "E-mail": "andra.lobiuc@student.usv.ro"
    },
    {
        "Nr. Crt": 58,
        "ID Student": 65765,
        "NUME SI PRENUME": "LUCULESCU T. RAUL",
        "Grupa": "3122a",
        "E-mail": "raul.luculescu@student.usv.ro"
    },
    {
        "Nr. Crt": 59,
        "ID Student": 66641,
        "NUME SI PRENUME": "LUNCANU C. ALEXANDRU-COSMIN",
        "Grupa": "3121a",
        "E-mail": "alexandru.luncanu@student.usv.ro"
    },
    {
        "Nr. Crt": 60,
        "ID Student": 66170,
        "NUME SI PRENUME": "LU\u021aA D.L. GHEORGHE",
        "Grupa": "3121b",
        "E-mail": "gheorghe.luta@student.usv.ro"
    },
    {
        "Nr. Crt": 61,
        "ID Student": 66141,
        "NUME SI PRENUME": "LU\u021aA D.L. SILVIU-VASILIC\u0102",
        "Grupa": "3121b",
        "E-mail": "silviu.luta@student.usv.ro"
    },
    {
        "Nr. Crt": 62,
        "ID Student": 65590,
        "NUME SI PRENUME": "M\u0102RINCU\u021aA P. IOAN",
        "Grupa": "3122a",
        "E-mail": "alexandra.vasilut@student.usv.ro"
    },
    {
        "Nr. Crt": 63,
        "ID Student": 451534,
        "NUME SI PRENUME": "MIHALACHE A. VLAD",
        "Grupa": "3123b",
        "E-mail": "vlad.mihalache@student.usv.ro"
    },
    {
        "Nr. Crt": 64,
        "ID Student": 66183,
        "NUME SI PRENUME": "M\u00ceNDRESCU M. CLAUDIU-DANIEL",
        "Grupa": "3123b",
        "E-mail": "claudiu.mindrescu@student.usv.ro"
    },
    {
        "Nr. Crt": 65,
        "ID Student": 66377,
        "NUME SI PRENUME": "MOSCALIUC V. TIMOTEI",
        "Grupa": "3121a",
        "E-mail": "timotei.moscaliuc@student.usv.ro"
    },
    {
        "Nr. Crt": 66,
        "ID Student": 452453,
        "NUME SI PRENUME": "MUNTEANU I. ALEXANDRU",
        "Grupa": "3121a",
        "E-mail": "alexandru.munteanu6@student.usv.ro"
    },
    {
        "Nr. Crt": 67,
        "ID Student": 65269,
        "NUME SI PRENUME": "NICOLAESCU  D. DAVID-SEBASTIAN",
        "Grupa": "3123b",
        "E-mail": "david.nicolaescu@student.usv.ro"
    },
    {
        "Nr. Crt": 68,
        "ID Student": 66489,
        "NUME SI PRENUME": "NISTOR  G. ELENA-SIMONA",
        "Grupa": "3122b",
        "E-mail": "elena.nistor1@student.usv.ro"
    },
    {
        "Nr. Crt": 69,
        "ID Student": 66329,
        "NUME SI PRENUME": "OLAR D.M. ALEX",
        "Grupa": "3122a",
        "E-mail": "alex.olar@student.usv.ro"
    },
    {
        "Nr. Crt": 70,
        "ID Student": 453921,
        "NUME SI PRENUME": "PAMPARAU C. ROBERT",
        "Grupa": "3124a",
        "E-mail": "robert.pamparau@student.usv.ro"
    },
    {
        "Nr. Crt": 71,
        "ID Student": 459449,
        "NUME SI PRENUME": "PINTILIE D. NICU-VL\u0102DU\u021a",
        "Grupa": "3122b",
        "E-mail": "luis.popescu@student.usv.ro"
    },
    {
        "Nr. Crt": 72,
        "ID Student": 66446,
        "NUME SI PRENUME": "POPESCU L. LUIS",
        "Grupa": "3123a",
        "E-mail": "luis.popescu@student.usv.ro"
    },
    {
        "Nr. Crt": 73,
        "ID Student": 65808,
        "NUME SI PRENUME": "POSMANGIU M.N. IONU\u021a-NICOLAE",
        "Grupa": "3124a",
        "E-mail": "ionut.posmangiu@student.usv.ro"
    },
    {
        "Nr. Crt": 74,
        "ID Student": 449307,
        "NUME SI PRENUME": "PRELIPCEAN V. ADRIAN-VASILE ",
        "Grupa": "3122b",
        "E-mail": null
    },
    {
        "Nr. Crt": 75,
        "ID Student": 65503,
        "NUME SI PRENUME": "PU\u0218CA\u0218U C. DAVID-EDUARD",
        "Grupa": "3123b",
        "E-mail": "david.puscasu@student.usv.ro"
    },
    {
        "Nr. Crt": 76,
        "ID Student": 65274,
        "NUME SI PRENUME": "PU\u0218CA\u0218U D.C. EMANUELE-NICHOLAS",
        "Grupa": "3121a",
        "E-mail": "emanuele.puscasu@student.usv.ro"
    },
    {
        "Nr. Crt": 77,
        "ID Student": 67526,
        "NUME SI PRENUME": "ROMAN C. PETRIC\u0102",
        "Grupa": "3122b",
        "E-mail": "petrica.roman@student.usv.ro"
    },
    {
        "Nr. Crt": 78,
        "ID Student": 66208,
        "NUME SI PRENUME": "RO\u0218CA M. \u0218TEFAN",
        "Grupa": "3123b",
        "E-mail": "stefan.rosca@student.usv.ro"
    },
    {
        "Nr. Crt": 81,
        "ID Student": 66126,
        "NUME SI PRENUME": "\u0218ANDRU M. ALEXANDRU",
        "Grupa": "3124a",
        "E-mail": "alexandru.sandru@student.usv.ro"
    },
    {
        "Nr. Crt": 79,
        "ID Student": 67124,
        "NUME SI PRENUME": "SIMIREA I. ADI-CONSTANTIN",
        "Grupa": "3123b",
        "E-mail": "adi.simirea@student.usv.ro"
    },
    {
        "Nr. Crt": 80,
        "ID Student": 66561,
        "NUME SI PRENUME": "STAMATE M. RALUCA-IOANA",
        "Grupa": "3122a",
        "E-mail": "raluca.stamate@student.usv.ro"
    },
    {
        "Nr. Crt": 82,
        "ID Student": 453488,
        "NUME SI PRENUME": "\u0218TEF\u0102NUC\u0102 N. MONICA",
        "Grupa": "3122a",
        "E-mail": "monica.stefanuca1@student.usv.ro"
    },
    {
        "Nr. Crt": 83,
        "ID Student": 65557,
        "NUME SI PRENUME": "\u0218VEDUNEAC V. IOAN",
        "Grupa": "3123a",
        "E-mail": "ioan.sveduneac@student.usv.ro"
    },
    {
        "Nr. Crt": 90,
        "ID Student": 65861,
        "NUME SI PRENUME": "\u021aIBULEAC  I. BOGDAN-IONU\u021a",
        "Grupa": "3121a",
        "E-mail": "bogdan.tibuleac@student.usv.ro"
    },
    {
        "Nr. Crt": 85,
        "ID Student": 65900,
        "NUME SI PRENUME": "TIMOFICIUC G. ROBERT - MIHAI",
        "Grupa": "3121b",
        "E-mail": "robert.timoficiuc@student.usv.ro"
    },
    {
        "Nr. Crt": 86,
        "ID Student": 65489,
        "NUME SI PRENUME": "TIPRIGAN D. GABRIEL",
        "Grupa": "3121a",
        "E-mail": "gabriel.tiprigan@student.usv.ro"
    },
    {
        "Nr. Crt": 87,
        "ID Student": 452246,
        "NUME SI PRENUME": "TODERA\u0218 C. ALEXANDRU-D\u0102NU\u021a",
        "Grupa": "3121a",
        "E-mail": "alexandru.toderas@student.usv.ro"
    },
    {
        "Nr. Crt": 88,
        "ID Student": 450764,
        "NUME SI PRENUME": "TONU G. CRISTIAN",
        "Grupa": "3123b",
        "E-mail": "cristian.tonu1@student.usv.ro"
    },
    {
        "Nr. Crt": 91,
        "ID Student": 64924,
        "NUME SI PRENUME": "\u021aUGUI N. NICOLAE",
        "Grupa": "3124a",
        "E-mail": "nicolae.tugui@student.usv.ro"
    },
    {
        "Nr. Crt": 89,
        "ID Student": 67755,
        "NUME SI PRENUME": "TURCU E. TUDOR-ROMULUS",
        "Grupa": "3122a",
        "E-mail": "tudor.turcu@student.usv.ro"
    },
    {
        "Nr. Crt": 92,
        "ID Student": 67541,
        "NUME SI PRENUME": "URS\u0102CIUC P. DENIS-ANDREI",
        "Grupa": "3123a",
        "E-mail": "denis.ursaciuc@student.usv.ro"
    },
    {
        "Nr. Crt": 96,
        "ID Student": 66565,
        "NUME SI PRENUME": "V\u0102R\u0102REANU V. VASILE-OLIVIAN",
        "Grupa": "3122b",
        "E-mail": "vasile.varareanu@student.usv.ro"
    },
    {
        "Nr. Crt": 93,
        "ID Student": 65022,
        "NUME SI PRENUME": "VASILOVICI S. ALEXANDRU-CONSTANTIN",
        "Grupa": "3124a",
        "E-mail": "alexandru.vasilovici@student.usv.ro"
    },
    {
        "Nr. Crt": 94,
        "ID Student": 452942,
        "NUME SI PRENUME": "VASILU\u021a S. ALEXANDRA",
        "Grupa": "3123a",
        "E-mail": "diana.chisiliciuc@student.usv.ro"
    },
    {
        "Nr. Crt": 95,
        "ID Student": 66610,
        "NUME SI PRENUME": "VAVRICI C. ANA-ALEXANDRA",
        "Grupa": "3124a",
        "E-mail": "ana.vavrici@student.usv.ro"
    },
    {
        "Nr. Crt": 97,
        "ID Student": 452436,
        "NUME SI PRENUME": "VERHOVE\u021aCHII I. VADIM",
        "Grupa": "3121a",
        "E-mail": "vadim.verhovetchii@student.usv.ro"
    },
    {
        "Nr. Crt": 98,
        "ID Student": 65447,
        "NUME SI PRENUME": "VIZITIU M.I. VALENTIN-IULIAN",
        "Grupa": "3122b",
        "E-mail": "valentin.vizitiu@student.usv.ro"
    },
    {
        "Nr. Crt": 100,
        "ID Student": 452360,
        "NUME SI PRENUME": "ZARA E. DANIEL",
        "Grupa": "3121b",
        "E-mail": "daniel.zara@student.usv.ro"
    },
    {
        "Nr. Crt": 101,
        "ID Student": 64992,
        "NUME SI PRENUME": "ZGHIBAR\u021a\u0102 G. ELENA",
        "Grupa": "3122b",
        "E-mail": "elena.zghibarta@student.usv.ro"
    }
]