pageMaps\objectMaps.class
unittesting\UnitTestClassBase.class
STM_ObjectDescriptors\UFT_TEScreen.class
MigratedClasses\newGroup.class
MigratedClasses\simple.class
MigratedClasses\someExamples.class
unittesting\UnitTestClassBase$2.class
ObjectMaps\ChildWindow1.class
STM_ObjectDescriptors\objectMaps_Descriptors.class
unittesting\UnitTestClassBase$1.class
ObjectMaps\MainWindow.class
