{
    "extends": [
        "tslint:recommended",
        "tslint-react",
        "tslint-config-prettier"
    ],
    "linterOptions": {
        "exclude": [
            "config/**/*.js",
            "node_modules/**/*.ts",
            "coverage/lcov-report/*.js"
        ]
    },
    "rules": {
        "one-variable-per-declaration": false,
        "ordered-imports": false,
        "object-literal-sort-keys": [
            false,
            "ignore-blank-lines",
            "ignore-case",
            "locale-compare",
            "match-declaration-order",
            "shorthand-first"
        ],
        "jsx-boolean-value": false,
        "no-console": false,
        "prefer-for-of": false,
        "jsx-no-lambda": false,
        "jsx-self-close": false,
        "no-shadowed-variable": false,
        "no-string-literal": false,
        "variable-name": {
            "options": [
                "check-format",
                "allow-leading-underscore",
                "allow-pascal-case",
                "allow-snake-case",
                "allow-trailing-underscore",
                "require-const-for-all-caps",
                "ban-keywords"
            ]
        }
    },
    "jsRules": {
        "no-console": false, // disable for JS
        "object-literal-sort-keys": false,
        "no-shadowed-variable": false,
        "no-string-literal": false,
        "one-variable-per-declaration": false,
        "curly": false,
        "no-empty": false,
        "no-duplicate-variable": false,
        "variable-name": [
            false,
            "ban-keywords",
            "check-format",
            "allow-leading-underscore",
            "allow-pascal-case"
        ]
    }
}