Osterferien NRW	03.04.2023 - 15.04.2023
Pfingstferien NRW	30.5.2023 - 30.5.2023
Sommerferien NRW	22.6.2023 - 4.8.2023
Herbstferien NRW	2.10.2023 - 14.10.2023
Weihnachtsferien NRW	21.12.2023 - 5.1.2024
