[
    {
        "name":"Spot",
        "age":3,
        "type":"dog" 
    },
    {
        "name":"PapaDago",
        "age":5,
        "type":"cat" 
    },
    {
        "name":"Natta",
        "age":1,
        "type":"mouse" 
    },
    {
        "name":"Fatti",
        "age":3,
        "type":"cat" 
    },
    {
        "name":"Micco",
        "age":66,
        "type":"dog" 
    },
    {
        "name":"Pelle",
        "age":3,
        "type":"cat" 
    }
]