diversity1	diversity0	analyticity	syntheticity	nclustertokens	nconsonants	popsize	density	area	diameter	clustering
21.52487905	65	442.6786	191.524	73100.23602	32	3100000	12.78376874	242495	5.5266727	7.21E-05
18.69407905	86	430.5066833	151.5341583	96135.92803	25	4345000	17.91789521	242495	5.605216016	5.38E-05
10.82760221	41	469.5504	145.4183	111673.4583	25	4345000	17.91789521	242495	5.605216016	5.38E-05
16.48920645	72	475.8684333	127.1342333	133179.1151	25	4540000	18.72203551	242495	5.615409283	5.18E-05
13.95250441	78	482.5159167	162.13885	148069.4313	25	2550000	10.51568074	242495	5.48111318	8.53E-05
15.07445307	84	479.99715	137.1301	145218.3599	25	2050000	8.453782552	242495	5.430092807	0.000103033
14.53568551	88	460.0227308	141.7121231	150368.4731	25	2020000	8.330068661	242495	5.426642399	0.000104351
16.30743057	81	482.0688495	130.5454533	161364.3856	24	2590000	10.68063259	242495	5.484747255	8.42E-05
18.24192344	81	463.3003469	152.4135135	167806.6204	24	3200000	13.19614837	242495	5.534070084	7.01E-05
17.21404489	79	478.3862379	138.9579757	172892.0789	24	4118483	16.91393311	677643	5.592778445	5.63E-05
17.71492795	78	476.0641353	152.6746436	173524.4487	24	5429848	21.41694135	1153805	5.656920349	4.43E-05
16.40283471	75	459.5513108	158.1507811	131174.5686	24	5716758.4	19.53803052	1672452	5.668848603	4.23E-05
15.16203022	61	473.64206	169.65716	125101.0528	24	7524408.8	15.30121139	1732896	5.732393341	3.33E-05
28.12545777	90	451.9752083	169.5883708	134656.2486	24	20941646	23.23390014	3815044	5.967631205	1.36E-05
28.291023	96	457.4679042	161.8051333	130509.3299	24	62593265.8	34.92930887	5706271	6.216747059	5.15E-06
28.02527876	89	444.11205	178.04865	139044.8832	24	140827280	44.67323521	9018472	6.399643119	2.50E-06
28.11419933	87	444.11205	178.04865	132685.5305	24	245316179.4	50.71852363	9018472	6.524078131	1.52E-06
