"word","r","Rsq","inflection","increasing","stability_3","stability_5","mean_freq","init_freq","final_freq","R0_growth"
"Agent",0.00249350061382685,0.016655208862123,2494.47216215414,0,1,1,0.364790234937957,0.177186555243804,0.941176470588235,1.16611701089314
"Algebra",NA,NA,NA,0,1,0.1,1.28504030755019,1.71779572701889,0.947368421052632,NA
"Alkoven",NA,NA,NA,0,0.5,0.7,0.720194557005237,2.39610298581507,0.75,NA
"Anagramm",0.0527078122170121,0.902311437947265,1995.5008832658,1,1,1,0.197979418268536,0.170758788815971,0.92,4.22677226392548
"Backenhörnchen",NA,NA,NA,0,1,0.7,1.61511380461439,0,0.842105263157895,NA
"Barke",NA,NA,NA,NA,NA,NA,NA,NA,NA,NA
"billigen",NA,NA,NA,NA,NA,NA,NA,NA,NA,NA
"Bleiche",NA,NA,NA,0,1,0.1,1.22077895954855,3.63120978337422,0.888888888888889,NA
"brillanten",0.00568756865637276,0.09767798224656,2355.00879197477,0,1,1,0.412579910911645,0.493380182518183,0.9375,1.37765455878315
"Buche",NA,NA,NA,NA,NA,NA,NA,NA,NA,NA
"Charta",0.109750947208093,0.957651771954772,1947.98054846247,1,0.5,0.9,0.197992987863839,0.0743176861902724,0.8,7.65310241975462
"Concierge",0.0279097633957284,0.845011254190198,1963.05910467529,1,0.5,0.3,0.357681661002625,0,0.866666666666667,2.74966306727821
"Einheit",NA,NA,NA,0,0.5,0.2,0.527722208292589,0.303477991528747,0.941176470588235,NA
"einstellen",NA,NA,NA,1,0.5,0.7,0.782349284003759,0,0.941176470588235,NA
"Eintracht",NA,NA,NA,0,0.5,0.9,2.43479864215354,9.24907239637699,0.92,NA
"Einzahl",NA,NA,NA,0,1,1,2.19211704235456,0,0.947368421052632,NA
"ernstlich",NA,NA,NA,NA,NA,NA,NA,NA,NA,NA
"Farce",0.0300668982708128,0.940730998829075,1985.81596200063,1,0.5,0.9,0.292087682139573,0,0.916666666666667,2.87497177616788
"Fehde",NA,NA,NA,0,0.5,0.2,2.8689949188679,7.60612960666747,0.894736842105263,NA
"Fibel",NA,NA,NA,1,1,0.1,0.649437882488435,0.159811375346651,0.947368421052632,NA
"Finder",NA,NA,NA,NA,NA,NA,NA,NA,NA,NA
"Fischerei",NA,NA,NA,1,1,1,1.40509616894102,0.32068524017131,0.941176470588235,NA
"Fortuna",0.00634121082750063,0.198723903576272,2377.16853059448,0,0.5,0.5,0.521787379910373,0.929553379131904,0.941176470588235,1.39435990136226
"Gericht",NA,NA,NA,0,1,0.1,0.551470864698402,0.611060331755847,0.947368421052632,NA
"Gold",NA,NA,NA,NA,NA,NA,NA,NA,NA,NA
"Hangar",0.0313957187954236,0.964184017316196,1964.29132926786,1,1,1,0.317783301304746,0.102035196256294,0.941176470588235,2.97981402723941
"Hinterland",NA,NA,NA,1,1,1,0.578906564458166,0,0.928571428571429,NA
"Hommage",0.0947569093726122,0.997511678889535,1986.00075459963,1,1,1,0.107719634119018,0.00111461733214832,0.866666666666667,6.89672247025766
"Jade",0.019872336954735,0.622259395650814,1906.46262185251,1,0.5,0.6,0.434350288455391,0.209230553404149,0.714285714285714,2.25593169553925
"Kamel",NA,NA,NA,1,0.5,0.7,0.889192172232221,0,0.947368421052632,NA
"Käseblatt",0.0269807722450071,0.904897082940441,1968.82145525864,1,0.5,0.9,0.265315663129524,0,0.823529411764706,2.75186154186831
"kess",0.012299260854231,0.209908725591276,2166.84745830229,0,1,1,0.269635837480325,0.171652152070839,0.894736842105263,1.79440925857478
"Kesselflicker",NA,NA,NA,1,0.5,0.3,0.647436447905501,0.28141720922521,0.882352941176471,NA
"Kork",NA,NA,NA,0,0.5,0.9,73.4495947288649,98.0410825842156,0.933333333333333,NA
"Lanze",NA,NA,NA,NA,NA,NA,NA,NA,NA,NA
"Latrine",0.0162963395381974,0.83935696905026,2084.91502701734,1,1,1,0.287160841158387,0,0.928571428571429,2.02536568374338
"Lenz",0.0163186662324618,0.808158172261609,2096.97366879313,1,1,1,0.314415615419812,0,0.916666666666667,2.04145727895571
"liften",-0.00385283615550059,0.0316692907306239,1284.14959087731,0,0.5,0.9,0.371639450037892,0.832102083486392,0.9,0.760469176212528
"lossagen",NA,NA,NA,0,1,0.7,22.5060551547043,38.1022050175811,0.928571428571429,NA
"Luftloch",NA,NA,NA,NA,NA,NA,NA,NA,NA,NA
"Macher",0.136703104124553,0.96362915835256,1973.55685052926,1,1,1,0.158042617293789,0.140630746463116,0.944444444444444,9.77360522271383
"Manie",NA,NA,NA,0,0.5,0.3,6.93785826422178,19.2375422666099,0.916666666666667,NA
"Milchbar",NA,NA,NA,1,0.5,0.9,0.362393695352063,0.010968544063077,0.9,NA
"Morast",NA,NA,NA,0,0.5,0.2,1.58205340376445,4.73625361127141,0.928571428571429,NA
"Mutation",NA,NA,NA,1,0.5,0.9,0.905553297566646,0.0284386338096627,0.941176470588235,NA
"Nachrede",NA,NA,NA,0,1,0.6,0.558638748387946,1.13456396567247,0.947368421052632,NA
"Noblesse",0.0105380723341521,0.702712548784161,2077.23579814555,1,1,0.3,0.484718923722912,0.109184664497981,0.8,1.64545693046682
"Obelisk",NA,NA,NA,0,1,1,0.764115816870139,2.60543576392477,0.928571428571429,NA
"Opal",NA,NA,NA,0,1,0.6,3.95568429163892,11.63041547031,0.888888888888889,NA
"Pack",NA,NA,NA,1,0.5,0.1,0.674986117320596,0.367254042171468,0.928571428571429,NA
"Pedant",NA,NA,NA,0,0.5,0.8,7.50498095473381,9.90372167128161,0.9,NA
"Pep",0.0138522995868056,0.358553687703861,2136.7764583226,1,0.5,0.9,0.329916163461334,0.629073107392497,0.884615384615385,1.89250366237789
"Piranha",NA,NA,NA,1,1,0.9,0.346754424838332,1.44292828789128,0.947368421052632,NA
"plappern",NA,NA,NA,0,0.5,0.5,0.624768536896702,1.0754452201591,0.928571428571429,NA
"Pomp",NA,NA,NA,0,0.5,0.8,14.6221843671958,32.9324517951649,0.684210526315789,NA
"Prosa",NA,NA,NA,1,0.5,0.7,0.339522846877988,0.0550390144687387,0.947368421052632,NA
"Python",NA,NA,NA,0,1,0.3,0.973448928316623,1.92554923816268,0.916666666666667,NA
"Quarz",NA,NA,NA,NA,NA,NA,NA,NA,NA,NA
"Quorum",0.0367370305973732,0.512493913182239,2033.15085343595,0,0.5,0.9,0.0944133038151106,0.0556009264440229,0.368421052631579,3.22773353542471
"Rapper",0.0964046787069146,0.769571610196455,2012.30862310945,0,1,0.7,0.1029968085944,0.117425441660823,0.923076923076923,7.08988355391579
"Reiz",NA,NA,NA,NA,NA,NA,NA,NA,NA,NA
"Rekrut",NA,NA,NA,0,0.5,0,1.16525181002841,1.12642654105144,0.944444444444444,NA
"Rune",NA,NA,NA,0,0.5,0.7,0.8508245493103,0.948485411239474,0.944444444444444,NA
"Schaffung",0.0541003870860326,0.989846662806172,1912.67205965143,1,0.5,0.6,0.422076068309121,0,0.916666666666667,4.5630514934861
"Seher",NA,NA,NA,0,0.5,0.7,1.55950848729257,3.54473006610854,0.944444444444444,NA
"Silber",NA,NA,NA,NA,NA,NA,NA,NA,NA,NA
"Sushi",0.178132557666076,0.981122949957427,1996.77508707313,1,1,0.6,0.0880779892071163,0,0.947368421052632,11.9854348312669
"Tratsch",0.023736473486121,0.941716130049488,2054.96229647859,1,1,1,0.238395789835,0,0.944444444444444,2.57776339262246
"Tropf",NA,NA,NA,0,0.5,0.7,2.68497910602062,6.43711395840173,0.9,NA
"Umsicht",NA,NA,NA,NA,NA,NA,NA,NA,NA,NA
"Umtrunk",0.0509908742919861,0.985985740476827,1942.86544194981,1,0.5,0.9,0.303097528607077,0,0.923076923076923,4.18489000827745
"verlegen",NA,NA,NA,NA,NA,NA,NA,NA,NA,NA
"Viola",0.0113991758979517,0.472387382613653,2171.60541032057,1,1,0.7,0.259652505174386,0.244974379888057,0.714285714285714,1.73524684541789
"Viper",NA,NA,NA,0,1,0.5,3.66833875446226,11.8074924729186,0.928571428571429,NA
"Wehr",NA,NA,NA,1,0.5,0.8,0.440499683842264,0.105007654248179,0.925925925925926,NA
"Wonne",NA,NA,NA,NA,NA,NA,NA,NA,NA,NA
"Zitronengras",0.110347208798969,0.868710500151707,1993.10346524127,1,1,0.9,0.120388820046488,0,0.875,7.93090818466322
"Zwist",NA,NA,NA,NA,NA,NA,NA,NA,NA,NA
