"word","X1820s","X1830s","X1840s","X1850s","X1860s","X1870s","X1880s","X1890s","X1900s","X1910s","X1920s","X1930s","X1940s","X1950s","X1960s","X1970s","X1980s","X1990s"
"Agent",1.85331336979289e-06,1.547386727907e-06,2.01076945813838e-06,2.9663782697753e-06,2.79879652680393e-06,2.71996957508236e-06,2.21668872200098e-06,2.33300522722857e-06,1.97661057654841e-06,1.7192428231283e-06,1.67516832334513e-06,1.78368546812635e-06,1.61587684033293e-06,1.96556198943654e-06,2.03384694259512e-06,2.32734596465889e-06,2.47401869728492e-06,3.17240255753859e-06
"Algebra",2.5722986265464e-06,2.53973962571763e-06,1.92587760921015e-06,1.94568531242112e-06,2.04099080747255e-06,2.90007491230426e-06,2.08519390980655e-06,2.68128108018573e-06,2.36705291172257e-06,2.26624164270106e-06,2.02956273369637e-06,1.76443525106151e-06,1.91716416111376e-06,2.53828648055787e-06,2.79293660696567e-06,3.2506571869817e-06,2.8105472210882e-06,2.20997382029964e-06
"Alkoven",4.30951655516765e-07,1.76964555009817e-07,2.10364383690376e-07,2.2463183029231e-07,2.17969852656097e-07,1.47998596133903e-07,1.5598655451754e-07,1.66806054835433e-07,2.09421990859937e-07,1.99270820644415e-07,2.78772856177056e-07,1.88130371725492e-07,3.23793148027107e-07,3.22228282811921e-07,2.59149379644441e-07,2.07611542180075e-07,2.38202736113635e-07,2.36565237798914e-07
"Anagramm",1.2300129945686e-07,6.86174864483747e-08,9.60267815486304e-08,9.78627312520075e-08,1.12801164675602e-07,9.5205409778032e-08,1.07185621800454e-07,9.54485059878607e-08,8.8223855243541e-08,7.37529461503072e-08,9.31014419336406e-08,9.2671989548876e-08,1.00347483211749e-07,1.13783063682149e-07,1.38788833226044e-07,2.24069540877281e-07,2.87560823153399e-07,3.61622070954581e-07
"Backenhörnchen",3.71318487069061e-10,1.69983889186653e-09,1.26548888479405e-08,5.08584221403652e-09,9.88941970536673e-09,5.7570228251258e-09,4.34731888265816e-09,7.13032179411321e-09,6.27886862503147e-09,8.26349224603007e-09,3.19663258641078e-09,6.76470017779707e-09,5.55994355000423e-09,7.57791356331694e-09,6.92951818148657e-09,7.78247758459471e-09,3.41861730035475e-09,3.24682353225469e-09
"Barke",1.48890716218375e-06,1.43990428114193e-06,1.81588161467516e-06,1.78536386101768e-06,1.85742413805201e-06,1.25561091408599e-06,8.60574624539368e-07,6.83126131661993e-07,6.09222257708097e-07,5.98666605355902e-07,7.52326656083824e-07,5.82308322805147e-07,9.1003539068879e-07,7.41426566719383e-07,7.5916983632851e-07,5.90911153608431e-07,5.97276107328071e-07,5.32226417249149e-07
"billigen",1.65913175806054e-05,1.61166227371723e-05,1.38452556711854e-05,1.22676427963597e-05,1.2681686803262e-05,1.17300867714221e-05,1.19429178994324e-05,1.29223551994073e-05,1.2845856781496e-05,1.21012554700428e-05,8.70887952260091e-06,8.80229708855041e-06,7.63725488468481e-06,7.43938076084305e-06,7.133360077205e-06,6.28800353297265e-06,5.80211753913318e-06,5.02736720591201e-06
"Bleiche",8.87944975147547e-07,6.51569001774988e-07,5.91093566981726e-07,6.53826060670326e-07,4.9082680675383e-07,5.19364428441804e-07,4.58507201983594e-07,4.96610979894285e-07,5.3776890069912e-07,5.80539077077447e-07,5.81321447157279e-07,6.74865663086166e-07,7.88006155971744e-07,6.51374085691714e-07,4.90124472207754e-07,4.35748845006856e-07,5.43979382428006e-07,5.46442564086647e-07
"brillanten",5.55852685124591e-07,4.14220843936164e-07,4.84735124928193e-07,5.38563057261854e-07,6.31418606644729e-07,7.15506160986479e-07,4.80135838643037e-07,3.12629184406887e-07,3.08989714881136e-07,2.27196976254618e-07,2.5087423551895e-07,1.76600634915758e-07,2.63811899969824e-07,3.94017874327801e-07,6.65166584212784e-07,7.04287276676041e-07,8.66128777943231e-07,8.97239220876145e-07
"Buche",3.42471135809319e-05,3.74239567463519e-05,3.29785751091549e-05,3.31740651745349e-05,2.98711933282903e-05,3.04870156469406e-05,3.42994950187858e-05,3.32356863509631e-05,3.05726611259161e-05,2.89821226033382e-05,2.954293959192e-05,2.67096929746913e-05,2.2494190307043e-05,1.96575567315449e-05,1.64681137903244e-05,1.10964024315763e-05,8.93678511602048e-06,7.2541017743788e-06
"Charta",8.89225202627131e-07,6.7829816714493e-07,4.95149058110656e-07,4.51481238883389e-07,5.15146962243307e-07,4.09006725021754e-07,4.34089170653351e-07,3.58260467692162e-07,3.29104140917025e-07,3.03867909678956e-07,3.5394431279201e-07,5.2808691464179e-07,2.25791673074127e-06,3.81599625143281e-06,4.07922561862506e-06,6.20171981609019e-06,4.83466587866133e-06,6.60500372759998e-06
"Concierge",1.89206658784968e-08,2.94635738917748e-08,3.8686619774353e-08,5.02690836512443e-08,4.97032733193237e-08,4.93145471125445e-08,3.75424267673452e-08,4.44498898133361e-08,3.29183045266745e-08,5.21452072632656e-08,4.19922217886892e-08,3.84214578375008e-08,1.0146712021708e-07,1.22186723672257e-07,1.46505637843575e-07,1.20416698479175e-07,1.50031602430545e-07,1.43794220974769e-07
"Einheit",6.79107986798044e-05,9.49853136262392e-05,0.000120917508320417,8.00992311269511e-05,7.25213794794399e-05,6.46401807898655e-05,5.29566852492281e-05,4.43830358562991e-05,4.89326605020324e-05,5.46626757568447e-05,8.28316195111256e-05,8.19292050437071e-05,9.33565024752169e-05,0.000101585916127078,0.00011809988936875,0.00012654469392146,0.00011161737202201,0.000117349700303748
"einstellen",3.24098862165556e-06,3.69254505585559e-06,4.08356722800818e-06,4.18197653289098e-06,4.49554650003847e-06,5.11910593559151e-06,5.55382912352798e-06,6.96250954206334e-06,7.92345881563961e-06,9.45843166846316e-06,9.6721629233798e-06,8.8820246674004e-06,8.37442348711193e-06,8.29688824524055e-06,7.5123255555809e-06,7.02619495314138e-06,7.00039863659185e-06,7.27893693692749e-06
"Eintracht",9.84467324087745e-06,8.06776070021442e-06,8.16473475424573e-06,6.36342842881277e-06,6.0334192312439e-06,4.04387967591902e-06,3.71074088434398e-06,2.83676554317935e-06,2.22485814447282e-06,2.31348287798028e-06,2.44945374561212e-06,2.12620352613158e-06,2.88407850348449e-06,2.67735413217452e-06,2.7107927508041e-06,2.77763203939685e-06,2.72212328127352e-06,2.89395534309733e-06
"Einzahl",1.39783387353987e-07,1.99268393075158e-07,3.11342371617229e-07,3.00242369632997e-07,4.0440028641342e-07,4.79481082038546e-07,7.53609549519752e-07,9.60483555445535e-07,8.92645539352089e-07,8.9896981307902e-07,9.66515904110565e-07,9.29244419012321e-07,8.7785998630352e-07,8.99612234661617e-07,7.21689946203696e-07,4.85177312725682e-07,3.83757645749938e-07,3.42187345836464e-07
"ernstlich",1.26104425362428e-05,1.25449445476988e-05,1.54338790707697e-05,1.52516704474692e-05,1.49046814840403e-05,1.38079710268357e-05,1.28160125314025e-05,1.16319414701138e-05,1.09092917227827e-05,1.04373100839439e-05,1.09090364276199e-05,9.43375853239559e-06,9.85825508905692e-06,9.57498141360702e-06,8.77150378073566e-06,6.53212637189427e-06,5.00488295074319e-06,3.79176233309408e-06
"Farce",3.08781460489627e-07,3.29648955244011e-07,3.65307597860465e-07,3.37097594638181e-07,3.26850870635553e-07,3.58134730049642e-07,6.46141580773474e-07,4.96125889526411e-07,6.92378591793385e-07,6.37365778288768e-07,6.49430279509033e-07,5.46271797929876e-07,1.12284743636337e-06,8.82622452991199e-07,1.3056418083579e-06,1.6565071405239e-06,1.92291003031642e-06,1.85766062941184e-06
"Fehde",5.5754939239705e-06,5.96404679527041e-06,4.76389043342351e-06,4.71102157462156e-06,4.66959299956216e-06,3.91002674859919e-06,4.54906376035069e-06,3.49438300872862e-06,2.60506969880225e-06,2.31891465318767e-06,2.31734081808099e-06,2.17873399606106e-06,2.16886709267783e-06,2.51598000886588e-06,2.71544763563725e-06,2.70202215233439e-06,2.43944518842909e-06,2.56960106526094e-06
"Fibel",4.89453051955025e-07,2.47691791344096e-07,2.86726496767642e-07,3.74752949028334e-07,4.53982006831666e-07,9.77429971271704e-07,1.15473587811721e-06,1.29584041133057e-06,1.24429857919495e-06,1.15836237455369e-06,1.23313378139755e-06,1.91885371805256e-06,1.69792448900807e-06,1.69704363770506e-06,1.92470241699993e-06,2.15676139987409e-06,2.15024856515811e-06,1.68086251051136e-06
"Finder",1.2853446776262e-06,1.02010418459031e-06,8.29039436212041e-07,1.41525557069144e-06,1.06679069631355e-06,8.97301873692414e-07,9.66393309909107e-07,1.06180754073648e-06,1.0043745078292e-06,9.93163536122667e-07,7.52146036120394e-07,7.80943429390391e-07,6.48109292455956e-07,6.92594477413877e-07,6.10463405337214e-07,5.60003419991517e-07,6.03943186661127e-07,5.37381691856353e-07
"Fischerei",2.93334181833416e-06,2.89150123080617e-06,2.17267977404845e-06,2.93993782634061e-06,3.4081030435118e-06,4.0497809777662e-06,6.11367772762606e-06,6.47121723886812e-06,6.00441658207274e-06,5.43092269253975e-06,6.98133003425028e-06,8.91779845915152e-06,6.20335604253341e-06,1.00037991160207e-05,8.62482497723249e-06,6.1387324876705e-06,5.40939754500869e-06,4.40514054389496e-06
"Fortuna",2.36271802123156e-06,1.30477438915477e-06,1.70480935821615e-06,1.75380462223984e-06,1.59752227091303e-06,1.58070228053475e-06,1.22358904945941e-06,1.05838556692106e-06,9.76184628598275e-07,7.76095998844539e-07,1.11902352841753e-06,1.5538245861535e-06,1.79858926685483e-06,2.04018160729902e-06,2.26915444727638e-06,2.39543680891074e-06,2.10354450018713e-06,2.38255706790369e-06
"Gericht",4.02292331273202e-05,3.92489408113761e-05,4.48084261734039e-05,5.00571819429752e-05,4.49346392997541e-05,3.46573206115863e-05,3.41942988598021e-05,3.39154652465368e-05,3.39917274686741e-05,3.07604990666732e-05,2.65159407717874e-05,3.12209573166911e-05,3.71205373085104e-05,4.34585763287032e-05,4.2744642632897e-05,4.18065144913271e-05,4.26133978180587e-05,4.77765912364703e-05
"Gold",5.44888094736962e-05,5.14742165250937e-05,4.47242691734573e-05,5.15601772349328e-05,4.77077934192493e-05,4.54980901849922e-05,3.9645651486353e-05,3.93479771446437e-05,3.48146593751153e-05,3.41549606673652e-05,3.87062114896253e-05,3.50658319803188e-05,3.71096770322765e-05,3.11152052745456e-05,2.97464148388826e-05,2.55158363870578e-05,2.63913158050855e-05,2.38738788539195e-05
"Hangar",1.8464502993254e-08,8.58933293379494e-09,5.37047784021638e-09,1.10664748032008e-08,1.90715065739866e-08,1.21341757697291e-08,1.28157882528512e-08,2.24780128732505e-08,2.49222588344367e-08,4.57033424439146e-08,2.27102304073412e-08,5.33697939175681e-08,6.84561413777373e-08,6.35636141055329e-08,9.1888353992431e-08,1.11032824534618e-07,1.12933374651902e-07,1.26150256107849e-07
"Hinterland",2.55814768479468e-08,4.67391400915673e-08,1.08296068823677e-07,2.50591968864455e-07,3.52325528751862e-07,3.7698181927226e-07,6.84701811337618e-07,1.27971710526254e-06,1.60896644274544e-06,2.60384599641839e-06,2.40832431472881e-06,3.88922562706284e-06,3.53530824668269e-06,3.70781783658458e-06,3.67804123015958e-06,3.42126363648276e-06,3.29041361055715e-06,3.04197899367864e-06
"Hommage",1.19291332367766e-08,9.53478711540612e-09,5.18843064067909e-08,1.27296077678807e-08,1.05526353433305e-08,2.23765536766507e-08,1.65755936532008e-08,1.76679235686095e-08,2.00066716971037e-08,2.15568354278162e-08,3.27069168193361e-08,6.8418663090597e-08,8.12815699191559e-08,1.18241680979736e-07,1.99258327882035e-07,5.78946139739855e-07,1.19183843594328e-06,1.87124993544785e-06
"Jade",2.53325845278596e-07,1.47891652346743e-07,1.03971997589269e-07,2.26769617484024e-07,3.15753466395563e-07,5.75585437445625e-07,4.7378490819483e-07,2.68907832889909e-07,2.80613652137163e-07,2.56216155491984e-07,3.61600407927653e-07,6.46134273551979e-07,6.05634249950527e-07,6.0261840246767e-07,5.35924993982917e-07,5.39214775585606e-07,6.44597830046223e-07,6.13846478358937e-07
"Kamel",2.99082654464655e-07,4.59118581375151e-07,3.88826607888859e-07,1.73314728471041e-06,3.49229458151967e-07,5.6915225030707e-07,8.86316985315716e-07,8.11428014912962e-07,1.0267427967392e-06,1.11381271494793e-06,1.45683050050138e-06,1.44845657814585e-06,1.45780463753908e-06,1.58022168079697e-06,1.20643690024735e-06,1.02617589163856e-06,1.08153457176741e-06,1.04209442497449e-06
"Käseblatt",0,0,2.49951082054167e-10,0,0,6.43233066810467e-10,1.1943080635568e-09,1.68638673025967e-09,3.07723856396436e-09,5.78482990398754e-09,7.53303348588474e-09,6.18166235977213e-09,6.19276738778041e-09,4.2171222680576e-09,1.08807960863544e-08,1.17321121262392e-08,1.13030012904858e-08,1.4727197061859e-08
"kess",8.55474717731397e-09,4.07753770748087e-09,1.36715994081271e-08,9.37608138906754e-09,2.49958968190356e-08,7.22309875245131e-09,6.84909171599913e-09,7.11508776340963e-09,7.05394332389807e-09,7.94633950862433e-09,6.45609437022188e-09,8.0974638327902e-09,1.06595492543882e-08,7.96905113009672e-09,1.07688000294814e-08,1.15920281817949e-08,2.01668648003306e-08,2.74149920542755e-08
"Kesselflicker",7.89214087859592e-08,6.58236277928382e-08,9.31787617730607e-08,1.07037158514345e-07,8.57746499605128e-08,1.01874100622012e-07,8.69768975064745e-08,9.47584442911875e-08,8.7025738793045e-08,8.44221812457135e-08,1.08026158329722e-07,7.72332963805411e-08,1.28660364140387e-07,9.02595751028912e-08,1.21267982677864e-07,9.05521112315455e-08,1.18538857662998e-07,1.06890290396677e-07
"Kork",2.98369570828072e-06,3.52637273408618e-06,3.27920129166159e-06,3.71822798115318e-06,3.66932079032267e-06,3.53169896243344e-06,3.59178409325977e-06,3.30992384078854e-06,2.80157994438923e-06,2.48976043621951e-06,2.35794896070729e-06,1.71166834661563e-06,1.48920175888634e-06,1.59987728238775e-06,7.96624379972855e-07,5.14501434167869e-07,4.6124872881137e-07,4.8526196678722e-07
"Lanze",5.97059124629596e-06,4.55715112366306e-06,4.79015297969454e-06,5.79927827857318e-06,5.23728763255349e-06,5.28345458405965e-06,5.07704016854404e-06,3.89996614558186e-06,3.22846383369324e-06,3.06528893361246e-06,3.02790017485677e-06,2.92417071250384e-06,3.50308257566212e-06,3.23940168982517e-06,3.2424033861389e-06,2.89387712655298e-06,2.81679604086094e-06,2.6946095204039e-06
"Latrine",1.41820401644566e-08,1.57307095571824e-08,6.18121300810515e-08,3.94095780009707e-08,5.76822550613087e-08,9.22708313311205e-08,1.19126675457437e-07,1.25883902768465e-07,8.69174101580938e-08,1.28673140409319e-07,9.91888192913848e-08,1.46443044712896e-07,2.7761344369992e-07,1.77114337418516e-07,1.91692608098037e-07,2.09720813870717e-07,2.66800132919798e-07,4.23503442448236e-07
"Lenz",2.7596937115959e-06,2.90157752260711e-06,3.16279274557019e-06,3.49269769230887e-06,4.5945030706207e-06,4.93948205075867e-06,6.27939061814686e-06,5.29125545654097e-06,4.77014016269095e-06,5.46498085896019e-06,6.52108610665891e-06,5.74816131120315e-06,5.64887884593191e-06,4.96667084917135e-06,6.29762826065417e-06,8.16782285255613e-06,1.10887572191132e-05,1.14919910629396e-05
"liften",2.92047698025044e-08,2.18758602121838e-08,2.53184502696513e-08,1.70200595395187e-08,1.26055379467971e-08,9.03652548345235e-09,1.08093808126597e-08,1.17552361178497e-08,1.40023630912367e-08,1.98110951643571e-08,1.08230720829994e-08,6.39169414062835e-09,6.21267838285533e-09,4.99852008672974e-09,8.15269601828205e-09,2.28612836217224e-08,2.25152513522175e-08,3.11799528418533e-08
"lossagen",6.10715559901109e-07,8.64449714299553e-07,1.07717441437671e-06,7.3783234597613e-07,6.9476679982472e-07,5.47916357618305e-07,4.63387124227665e-07,3.68676273865276e-07,3.03231652765135e-07,2.72595195838221e-07,3.6174774322717e-07,2.80962893839387e-07,3.34939574031523e-07,3.32372530920111e-07,3.53149889065207e-07,3.33550735831522e-07,2.83361399056048e-07,2.808353727346e-07
"Luftloch",1.5601206726501e-07,2.67540181653203e-07,1.62497744327084e-07,1.41190462699115e-07,1.1235041554869e-07,1.29264369519433e-07,1.21864848523501e-07,8.6614471683788e-08,8.90334810321747e-08,1.4235133463103e-07,9.43545565235126e-08,8.85581513898615e-08,9.18097281754626e-08,5.73596302899659e-08,6.89073619497549e-08,5.21530090225042e-08,7.08374592761629e-08,4.80595542029505e-08
"Macher",3.75639756100554e-07,1.82866481424071e-07,2.51875501078303e-07,2.55225529599557e-07,2.10440730086248e-07,2.6400670236626e-07,1.9378661590963e-07,2.24417094329965e-07,2.59543335801027e-07,2.75799658311371e-07,2.40572367715686e-07,2.07084670478252e-07,2.30986466931427e-07,2.86378927683017e-07,3.17662710358491e-07,7.55083277681479e-07,1.18227736720655e-06,1.47748841072826e-06
"Manie",4.04666654958419e-06,4.60462458704569e-06,3.90252714623784e-06,2.60496639157282e-06,2.20010607563381e-06,2.35096858887118e-06,2.28330630989149e-06,1.96959480263104e-06,1.89242673513945e-06,1.52368044155082e-06,1.15286729851505e-06,6.81895073739724e-07,6.7925973041838e-07,6.37188827568025e-07,8.03921591341349e-07,7.49858890003452e-07,7.18681593525616e-07,7.9965004715632e-07
"Milchbar",5.80620351797734e-10,0,5.47533463013395e-10,1.27212063105731e-10,4.38960945370326e-10,1.86801712986906e-10,9.35539201663005e-11,1.57926599575475e-10,6.03270836063708e-10,9.2474927715358e-11,4.69571614925002e-10,3.90880368072999e-09,5.3675253131047e-09,1.08818728961069e-07,6.79419553506477e-08,5.21689404564541e-08,5.61544464261488e-08,4.76415387140605e-08
"Morast",1.26159317233032e-06,9.23237604411043e-07,8.80446049222883e-07,9.01025725852378e-07,8.34454596088108e-07,7.03509647337341e-07,6.03958983447228e-07,4.93808502710635e-07,3.95754076976118e-07,5.05466792333209e-07,5.23007523156593e-07,5.76507270011462e-07,8.70970961841522e-07,5.94341616988458e-07,5.80385579951326e-07,5.14509449089928e-07,6.00989500298965e-07,5.65507116334629e-07
"Mutation",1.25766150915751e-07,8.87024051543506e-08,1.43234377958379e-07,2.27812513742265e-07,1.81659157050262e-07,2.49868287482968e-07,2.59997814566759e-07,2.01491438645007e-07,1.09689597991291e-06,2.62497414951213e-06,2.55548118275328e-06,3.29724025505129e-06,2.89864156002295e-06,2.89079546291759e-06,2.0518037445072e-06,1.47328656794343e-06,1.15721568363369e-06,1.31532692080327e-06
"Nachrede",8.36477352095244e-07,7.94370123458065e-07,8.08614879588277e-07,7.44083723702715e-07,7.32571919570546e-07,6.49539367714169e-07,6.5725793092497e-07,6.31158860642245e-07,5.79697882585606e-07,5.11557291815734e-07,6.29828434739465e-07,5.6655849505205e-07,5.54246355477517e-07,6.62732946921096e-07,6.40283246866602e-07,6.05830479116776e-07,7.00079823445776e-07,7.82867692805667e-07
"Noblesse",2.13261303372292e-07,1.59200325811071e-07,2.78101958883781e-07,3.28755689338323e-07,4.34751584066362e-07,4.16043894801987e-07,4.21660891447573e-07,2.77306696716551e-07,3.49794675003068e-07,3.097141174635e-07,3.84236284389772e-07,3.13847850463844e-07,4.72038007615083e-07,4.95548388812495e-07,5.87218417535951e-07,5.94829378997019e-07,5.93999118336796e-07,5.55307070726485e-07
"Obelisk",1.23745295468325e-06,9.03204744417963e-07,8.41811402096937e-07,7.76772589006214e-07,6.48060759544933e-07,6.27221189120064e-07,5.91595988908011e-07,4.49314632078312e-07,4.15279870935592e-07,3.20933850161964e-07,3.66150635500162e-07,3.06989207388142e-07,3.68412480611369e-07,4.28757661552481e-07,4.55416235922712e-07,4.75249137821265e-07,5.86492308229936e-07,6.38604387859232e-07
"Opal",1.36325043058605e-06,9.13429414595157e-07,9.29031187979489e-07,1.00505594105016e-06,8.16937975400833e-07,6.4010268090442e-07,5.4222956009653e-07,5.56677625240809e-07,5.98453857492132e-07,5.68022466040929e-07,5.24388278222432e-07,5.98728422573913e-07,4.70826475407193e-07,4.94971430953228e-07,4.16193645946805e-07,2.50165990678397e-07,2.93676079365923e-07,3.3523675995184e-07
"Pack",1.10773871142555e-06,1.06161849089403e-06,1.19567048386671e-06,1.16649133587998e-06,1.15937348823536e-06,1.14199932568226e-06,1.47376961763257e-06,1.00221145657997e-06,9.75799571278913e-07,1.02250919553626e-06,1.24763797657579e-06,1.16930705189588e-06,1.49515054772564e-06,1.35164453922698e-06,1.36794795935202e-06,1.3024866007072e-06,1.37854029844675e-06,1.30939675955233e-06
"Pedant",3.48701327368417e-07,3.41287569938231e-07,3.84329868552413e-07,3.44553643571999e-07,3.77160455400371e-07,3.17419178941236e-07,3.48698438301653e-07,3.20709433765387e-07,3.15012513851798e-07,3.2860182557215e-07,3.49318524683895e-07,2.14589113056718e-07,3.23768995258433e-07,2.82129884965343e-07,3.24303027809947e-07,2.71242012672701e-07,2.73331457378845e-07,2.2677655096004e-07
"Pep",6.93419216268865e-08,2.50117662581317e-08,2.64979101549656e-08,2.45976746526821e-08,2.57371715051136e-08,5.55840587779244e-08,5.11564387295494e-08,4.46656661878819e-08,4.44379143260676e-08,4.88122799069401e-08,5.75793297485916e-08,3.73744667214737e-08,3.15227031144616e-08,3.01885314968331e-08,3.85086165621828e-08,7.72449855190871e-08,8.93673586688238e-08,8.75179438253326e-08
"Piranha",5.27409362405251e-08,5.15181832749789e-09,3.21084314691688e-09,4.31635245323747e-09,7.4629355806266e-09,3.81720619557768e-09,8.24807344645961e-09,3.75712657652016e-09,1.54391255891007e-09,1.5341411419012e-09,1.426295306306e-08,7.98905677168449e-09,8.57813735599677e-09,2.49225419857169e-08,1.15075741824455e-08,2.52453045579415e-08,2.96730262583367e-08,3.51544541032922e-08
"plappern",1.1631343852514e-07,9.12469012348538e-08,1.01202606117567e-07,1.03396783401877e-07,8.13181479486502e-08,8.74547339435595e-08,8.06858533763943e-08,6.74430729930009e-08,7.00070422965382e-08,8.76515223069418e-08,1.0240290322372e-07,7.85979214157351e-08,1.25197933442678e-07,9.58689817309732e-08,1.11952865466947e-07,9.82367744484236e-08,1.16391634463753e-07,1.09639201895106e-07
"Pomp",2.40009353547066e-06,2.86351186105094e-06,2.20801642853985e-06,2.08581063816382e-06,2.24332193283772e-06,2.06922355800998e-06,1.90390328498324e-06,1.33310242063089e-06,1.03860458011695e-06,9.64854746143827e-07,1.32154406173868e-06,1.31970839447604e-06,1.48555144505735e-06,1.19174839028347e-06,1.29957501258105e-06,1.05228603501928e-06,1.06242187030148e-06,9.94673524701284e-07
"Prosa",8.11034201433358e-06,8.93079263732943e-06,1.03796164694359e-05,8.29403261377593e-06,7.45372385608789e-06,1.02777859865455e-05,1.0536469926592e-05,8.64325024849677e-06,8.29301779958769e-06,7.90005924500292e-06,9.43719473980309e-06,8.78837645359454e-06,1.19693553187972e-05,1.3222219877207e-05,1.59386680024909e-05,1.97995968846954e-05,2.03460891498253e-05,1.87558758625528e-05
"Python",5.15024214564619e-07,6.2441300201499e-07,5.06809499256633e-07,5.04623929487025e-07,3.68180080556613e-07,3.88962294550765e-07,3.85896640864303e-07,5.31455665964131e-07,2.78641300610616e-07,1.97960147119147e-07,2.41841455306258e-07,2.69873866898251e-07,2.62819506247069e-07,2.41481599516646e-07,2.02397620796546e-07,1.75558548676236e-07,2.16015727971808e-07,3.37162757091391e-07
"Quarz",1.57739375936217e-05,1.15797451144317e-05,1.45244142913725e-05,1.83103483323066e-05,1.66831590831862e-05,1.45203734064126e-05,1.26811793052184e-05,1.43031417792372e-05,1.19916258881858e-05,1.3383763962338e-05,1.38228076139057e-05,1.7429916169931e-05,1.68828583809955e-05,1.3606219090434e-05,1.04917399767146e-05,5.96162235524389e-06,4.54450550932961e-06,3.4559313689897e-06
"Quorum",1.69423115892187e-07,1.9171069070012e-07,2.14743238302617e-07,1.88287271640775e-07,2.14379384999575e-07,2.05737552505525e-07,1.95781387901661e-07,1.77593998529346e-07,1.57484990381817e-07,1.37231756980327e-07,1.13571391580081e-07,1.50784185848352e-07,1.19381679297703e-07,2.00113144188663e-07,2.28987134676117e-07,3.1087379852579e-07,2.91651146255845e-07,4.83654272898093e-07
"Rapper",2.12693795464958e-08,1.31505430545076e-08,1.24919541377722e-08,1.75520464162915e-08,1.74692301513346e-08,1.48883173345382e-08,2.07319082345947e-08,1.20681836968117e-08,8.76659347337493e-09,9.6197108279128e-09,4.57455781033289e-09,4.82308912808094e-09,9.2018507480418e-09,6.97181835596084e-09,2.74931351573748e-09,5.38723484710956e-09,1.18365488521732e-08,1.48334846983289e-07
"Reiz",2.19958214074722e-05,2.16815536987269e-05,2.18216386201675e-05,1.83058735274244e-05,1.93395857422729e-05,2.12151533560245e-05,2.02346889636829e-05,2.11575645153062e-05,2.57062849414069e-05,2.57945130215376e-05,2.83761795799364e-05,1.842138099164e-05,1.79677603227901e-05,1.64249288900464e-05,1.41406704642577e-05,1.17824595690763e-05,1.08689991066058e-05,9.57947877395782e-06
"Rekrut",2.69628486648799e-07,2.0436778740418e-07,2.34534650189744e-07,2.48726944107603e-07,2.89266816366762e-07,2.39360845455394e-07,2.96553010059597e-07,2.72434729708948e-07,2.68195134367488e-07,3.05346752327296e-07,2.18431827647691e-07,2.63820210477661e-07,4.34908218949204e-07,2.76851083924612e-07,2.5593905235155e-07,2.73584055321407e-07,2.82766876580354e-07,2.59085163634154e-07
"Rune",5.10627025107624e-07,1.44036658866753e-07,1.68576860914982e-07,8.61598975632205e-07,4.82789285172202e-07,1.70084426542871e-07,4.01703501040629e-07,2.6655380338525e-07,2.12531750776179e-07,3.11774157069067e-07,7.40286584743898e-07,9.95299848227659e-07,9.29558103734962e-07,5.27697531538252e-07,5.13731124840433e-07,4.20159511804741e-07,3.45784098954027e-07,5.09065188225577e-07
"Schaffung",1.86770695620453e-07,2.44864595799754e-07,3.95733550817567e-07,5.83087427230566e-07,1.1649225768906e-06,2.11712687132604e-06,3.33411812789564e-06,6.60553137095121e-06,1.16979256745253e-05,1.65661374012416e-05,1.70645279467863e-05,2.17888289625989e-05,2.26586667849915e-05,2.77369445029763e-05,2.6352970598964e-05,3.11591265926836e-05,2.97943684927304e-05,2.98623179332935e-05
"Seher",2.85108524167299e-06,2.59946425558155e-06,2.65862272499362e-06,2.53268776759796e-06,2.09106025295114e-06,1.52019762253986e-06,1.61903702746713e-06,1.35239148448818e-06,1.33590936002292e-06,1.3236720178611e-06,1.93799999124167e-06,1.7745700120031e-06,2.73981023610759e-06,2.41083730543323e-06,2.0823756358368e-06,1.69820700648415e-06,1.66331109312523e-06,1.73063020838526e-06
"Silber",5.03974919411121e-05,5.23804788826965e-05,4.3925390127697e-05,5.05120311572682e-05,5.00022691994673e-05,4.71071758511243e-05,3.61164689820725e-05,3.41445327649126e-05,2.82482887996593e-05,2.41066190938e-05,2.44393466346082e-05,2.21470208998653e-05,2.12543993256986e-05,1.78109052285436e-05,1.59418952534907e-05,1.36747804390325e-05,1.42058179335436e-05,1.28040650452022e-05
"Sushi",0,6.67999766612581e-10,2.02845873431556e-10,1.10701187105988e-09,1.3405339283068e-09,1.50221611816548e-09,1.86547953751059e-09,1.7575161104233e-09,2.44040805064127e-09,3.23132559598704e-09,2.80093685467442e-09,1.70076073224834e-09,4.25549424587502e-09,5.3808735023253e-09,5.25683046537217e-09,5.19060945336492e-09,1.62051429164478e-08,8.15255667419023e-08
"Tratsch",9.1739096319543e-10,1.17128999832516e-09,5.17778460107365e-09,3.15094166314367e-09,1.13063584827877e-08,1.07791325643092e-08,2.12229957163856e-08,3.4376082069798e-08,5.13057571538411e-08,6.66366677393171e-08,1.02717305594524e-07,9.13836792904022e-08,1.56039556742371e-07,1.10025052890705e-07,1.3590639369454e-07,1.58613528356e-07,2.48528945689941e-07,3.37773221303905e-07
"Tropf",9.06332127215137e-07,1.09914866470717e-06,6.64112991444199e-07,4.48217321036281e-07,4.22592017912393e-07,3.8004267537417e-07,4.51725969696781e-07,3.74630624833117e-07,5.11656264734484e-07,6.37776787471012e-07,7.84940635867315e-07,5.71339415955663e-07,9.2493818328876e-07,6.33351027090612e-07,5.92765465512457e-07,4.06465164815017e-07,4.76341932653668e-07,4.48970050115349e-07
"Umsicht",9.24068053791416e-06,9.99550920823822e-06,8.33632429930731e-06,7.29291823517997e-06,6.00934886278992e-06,5.02574289384938e-06,4.60616774944356e-06,3.66793422017508e-06,2.92310585336964e-06,2.5067833803405e-06,2.2728095018465e-06,2.39358680573787e-06,2.54902888627839e-06,2.47409534495091e-06,2.45533528868691e-06,2.01652034093058e-06,1.86565029025587e-06,1.56458988840313e-06
"Umtrunk",1.28870945026449e-09,8.19711793997869e-09,4.7681047554704e-09,1.69852494291689e-09,5.83911516915947e-09,1.13168308502054e-08,6.874074087726e-09,1.55265600376708e-08,1.65512727967609e-08,2.15095317557257e-08,3.89566603864466e-08,6.86322053411459e-08,1.04596930583511e-07,1.00452174933707e-07,1.27770811531036e-07,1.3709597652678e-07,1.72045189117398e-07,1.68527921573514e-07
"verlegen",6.78176265864749e-06,6.59468801131879e-06,7.19785070941725e-06,7.99495314822707e-06,8.97394843377697e-06,9.42403075896436e-06,9.32698203541804e-06,9.45839237829205e-06,9.35220550672966e-06,9.14614147404791e-06,9.70593537203968e-06,8.30990802569431e-06,1.03826542726893e-05,8.86873422132339e-06,8.62735855662322e-06,6.97246628078574e-06,7.04469257470919e-06,6.17226810391003e-06
"Viola",2.35201864597911e-06,1.98019255321924e-06,1.73103219367476e-06,2.11186747947067e-06,2.11465468282768e-06,2.26756111487703e-06,2.83145252524264e-06,2.26787041128773e-06,2.68701262484683e-06,1.79792367589471e-06,1.99268805545216e-06,2.15956470128731e-06,2.48584933615348e-06,2.48259274258089e-06,2.57301309147806e-06,2.38193641735051e-06,3.24716511386214e-06,3.54167766545288e-06
"Viper",4.88987477353931e-07,4.72735737844232e-07,2.9664558951481e-07,3.04582539456533e-07,2.65280982603144e-07,2.8799356783793e-07,2.21930923771652e-07,2.30770207565456e-07,2.2089462703434e-07,1.59861790649529e-07,2.03824861699786e-07,1.45534026785299e-07,1.83981919121834e-07,1.69507097069754e-07,1.71589779540682e-07,1.19740916204592e-07,1.27603104260743e-07,1.48779410835686e-07
"Wehr",2.7357288672647e-06,2.41727362890742e-06,2.43995593791624e-06,2.50820796736662e-06,2.79372031855018e-06,2.5316845267298e-06,3.06080635255057e-06,2.65538888015726e-06,2.65265682628524e-06,3.84516135909507e-06,3.5642361808641e-06,5.57061603103648e-06,5.97202943026787e-06,4.66914725620882e-06,4.57883120361657e-06,4.93978695885744e-06,5.39652710358496e-06,5.22531618116773e-06
"Wonne",8.20854356788914e-06,5.34041396349494e-06,5.81361637159716e-06,5.58561305297189e-06,4.69598685413075e-06,3.31207174895099e-06,3.47746383795311e-06,3.04009454339394e-06,3.08654423406551e-06,3.04375910218369e-06,3.88748831028352e-06,2.20413239730988e-06,4.19614327711315e-06,2.94306280466117e-06,3.17654355512786e-06,2.30236927336591e-06,2.23248869133386e-06,1.86088805094187e-06
"Zitronengras",0,2.44323845599581e-09,0,0,0,0,0,0,7.13142866981542e-10,8.43557299012865e-10,7.76858355422405e-11,1.19395794362376e-09,1.77918195731763e-09,6.13201445176515e-10,1.0315529430649e-09,9.84739761955567e-10,4.43203819200377e-09,9.55748564734904e-09
"Zwist",3.53929674474785e-06,3.4456878211131e-06,3.12349420710234e-06,2.49063602950628e-06,2.10078831059945e-06,1.7783745079214e-06,1.98150188452928e-06,1.57857191425137e-06,1.36892574573721e-06,1.34813427621339e-06,1.63892983664482e-06,1.34814021066632e-06,1.72716148654217e-06,1.42305841563939e-06,1.48636499943677e-06,1.18426355584233e-06,1.04702686485325e-06,1.00449454976115e-06
