**Dimensions**,
cbed_position_x,Number of probe positions in x direction
cbed_position_y,Number of probe positions in y direction
cbed_k_x,Number of k grid in k_x direction
cbed_k_y,Number of k grid in k_y direction
cbed_defocus,Number of stored defoci (1 when averaged over defoci)
cbed_phonon,Number of stored frozen phonon configuration (1 when averaged over configurations)
cbed_slice,Number of stored slices
**Variables**,
cbed_intensities,cbed intensities of each pixel ``[fraction of beam]``
cbed_probe_x_grid,Position vector of the probe in x direction ``[nm]``
cbed_probe_y_grid,Position vector of the probe in y direction ``[nm]``
cbed_x_grid,Angles of k_x grid ``[mrad]``
cbed_y_grid,Angles of k_y grid ``[mrad]``
cbed_slice_coords,Coordinates of the stored slices ``[nm]``
