**Attributes**,
Conventions,"String ""AMBER"" (required for AMBER)"
ConventionVersion,Version of the AMBER spec.
program,"Program name (""STEMsalabim"")"
programVersion,STEMsalabim's version
title,Simulation title (Param ``simulation.title``)
**Dimensions**,
atom,Number of atoms
elements,Number of different elements
spatial,Number of spatial dimensions (3)
cell_spatial,Number of spatial dimensions (3)
cell_angular,Number of spatial dimensions (3)
label,Character String for element names (6)
frame,Number of frozen phonon configurations * number of defoci
slices,Number of slices in the multi-slice approximation
grid_x,Number of simulation grid points in x direction
grid_y,Number of simulation grid points in y direction
**Variables**,
spatial,"Names of the spatial dimensions (""x,y,z"")"
cell_spatial,"Names of the spatial cell parameters (""a,b,c"")"
cell_angular,"Names of the cell angles (""alpha,beta,gamma"")"
coordinates,Coordinates of the atoms ``[nm]``
lattice_coordinates,Equilibrium coordinates of the atoms (i.e. lattice positions without displacements) ``[nm]``
cell_lengths,Cell lengths (Same for each frame) ``[nm]``
cell_angles,"Cell angles (Same for each frame, always ""90, 90, 90"") ``[degree]``"
radius,Radii of each atom ``[nm]``
msd,Mean square displacement of each atom ``[nm^2]``
slice,Slice id of each atom
slice_coordinates,z-Coordinate of each slice ``[nm]``
element,Element id of each atom (see ``atom_types``)
system_lengths,Cell lengths ``[nm]``
system_angles,Cell angles ``[degree]``
atom_types,Description of atom types
