{
  "npmScope": "myorg",
  "affected": {
    "defaultBase": "master"
  },
  "implicitDependencies": {
    "package.json": {
      "dependencies": "*",
      "devDependencies": "*"
    },
    ".eslintrc.json": "*"
  },
  "tasksRunnerOptions": {
    "default": {
      "runner": "@nrwl/nx-cloud",
      "options": {
        "cacheableOperations": [
          "build",
          "lint",
          "test",
          "e2e"
        ],
        "accessToken": "MmIzMWRlMDUtZTcyNy00MzE5LWFlMjgtZDcwYmMwNmNlNDA3fHJlYWQtd3JpdGU="
      }
    }
  },
  "targetDependencies": {
    "build": [
      {
        "target": "build",
        "projects": "dependencies"
      }
    ]
  },
  "projects": {
    "api": {
      "tags": []
    },
    "data": {
      "tags": []
    },
    "todos": {
      "tags": []
    },
    "todos-e2e": {
      "tags": [],
      "implicitDependencies": [
        "todos"
      ]
    },
    "ui": {
      "tags": []
    }
  }
}
