<?xml version="1.0" standalone="no"?>
<svg
  width="600"
  height="600"
  viewBox="0 0 600 600"
  xmlns="http://www.w3.org/2000/svg"
>
  <g transform="translate(300,300)">
    <path d="M86.6,-150.5C96.5,-128.5,77.8,-77.7,87,-43.8C96.2,-9.8,133.2,7.3,144.5,30.2C155.8,53,141.4,81.5,116.9,90.7C92.4,99.9,57.9,89.8,35.7,75.1C13.4,60.4,3.5,41.3,-21.6,46.3C-46.6,51.4,-86.8,80.7,-127.3,83C-167.8,85.3,-208.6,60.6,-212.8,30.7C-216.9,0.8,-184.4,-34.3,-148,-48.3C-111.5,-62.2,-71.2,-55.1,-45.9,-70C-20.5,-85,-10.3,-122,14.1,-143.9C38.4,-165.7,76.8,-172.5,86.6,-150.5Z" fill="#1b193b" />
  </g>
</svg>
  