<?xml version="1.0" standalone="no"?>
<svg
  width="600"
  height="600"
  viewBox="0 0 600 600"
  xmlns="http://www.w3.org/2000/svg"
>
  <g transform="translate(300,300)">
    <path d="M92.7,-146.3C126.9,-122.1,166.2,-108,174.9,-82C183.6,-55.9,161.6,-17.9,148.2,15.8C134.9,49.6,130.2,79.2,119.1,117.4C108.1,155.6,90.7,202.5,59.1,220.7C27.5,238.9,-18.2,228.4,-45.7,200C-73.1,171.6,-82.3,125.4,-109.6,94.6C-136.9,63.7,-182.3,48.2,-209.5,15.6C-236.7,-17,-245.7,-66.6,-231.9,-109.7C-218.1,-152.7,-181.5,-189.1,-139,-209.5C-96.6,-230,-48.3,-234.5,-9.6,-219.6C29.2,-204.8,58.4,-170.5,92.7,-146.3Z" fill="#ff6900" />
  </g>
</svg>
  