<?xml version="1.0" standalone="no"?>
<svg
  width="600"
  height="600"
  viewBox="0 0 600 600"
  xmlns="http://www.w3.org/2000/svg"
>
  <g transform="translate(300,300)">
    <path d="M137.1,-205.5C170.8,-191.7,186.3,-142,190.7,-97.4C195,-52.8,188.1,-13.4,171.8,17.1C155.5,47.5,129.9,68.9,111.3,103.9C92.6,138.9,81,187.5,57.1,194.6C33.2,201.8,-3,167.6,-37.1,147.8C-71.2,128,-103.2,122.6,-125.6,104.5C-147.9,86.4,-160.6,55.7,-160,26.1C-159.4,-3.5,-145.7,-31.9,-125.3,-49.2C-104.9,-66.5,-77.8,-72.8,-55.9,-91.9C-33.9,-111.1,-16.9,-143,17.4,-170.1C51.7,-197.1,103.4,-219.3,137.1,-205.5Z" fill="#1b193b" />
  </g>
</svg>
  