# Fdb version 3
["dvips"] 0 "samplepaper.dvi" "samplepaper.ps" "samplepaper" 0
  "samplepaper.dvi" 0 -1 0 "latex"
  (generated)
  "samplepaper.ps"
["latex"] 1655384746 "samplepaper.tex" "samplepaper.dvi" "samplepaper" 1655384746
  "/usr/share/texmf-dist/fonts/map/fontname/texfonts.map" 1650183167 3524 cb3e574dea2d1052e39280babc910dc8 ""
  "/usr/share/texmf-dist/fonts/tfm/jknappen/ec/ecrm1000.tfm" 1650183167 3584 adb004a0c8e7c46ee66cad73671f37b4 ""
  "/usr/share/texmf-dist/tex/latex/base/article.cls" 1650183167 20144 8a7de377ae7a11ee924a7499611f5a9d ""
  "/usr/share/texmf-dist/tex/latex/base/fontenc.sty" 1650183167 4946 461cc78f6f26901410d9f1d725079cc6 ""
  "/usr/share/texmf-dist/tex/latex/base/size10.clo" 1650183167 8448 96f18c76bf608a36ee6fbf021ac1dd32 ""
  "/usr/share/texmf-dist/tex/latex/graphics-cfg/graphics.cfg" 1650183167 1224 978390e9c2234eab29404bc21b268d1e ""
  "/usr/share/texmf-dist/tex/latex/graphics-def/dvips.def" 1650183167 5895 4b59bd0c17e1116fd6b6e7c683dea655 ""
  "/usr/share/texmf-dist/tex/latex/graphics/graphics.sty" 1650183167 18399 7e40f80366dffb22c0e7b70517db5cb4 ""
  "/usr/share/texmf-dist/tex/latex/graphics/graphicx.sty" 1650183167 7996 a8fb260d598dcaf305a7ae7b9c3e3229 ""
  "/usr/share/texmf-dist/tex/latex/graphics/keyval.sty" 1650183167 2671 4de6781a30211fe0ea4c672e4a2a8166 ""
  "/usr/share/texmf-dist/tex/latex/graphics/trig.sty" 1650183167 4009 187ea2dc3194cd5a76cd99a8d7a6c4d0 ""
  "/usr/share/texmf-dist/tex/latex/l3backend/l3backend-dvips.def" 1650183167 36419 cbb8189400f363593dc2cb0242f4644d ""
  "/usr/share/texmf-dist/tex/latex/oberdiek/aliascnt.sty" 1650183167 2652 813491e2bc95c1dafbb39cd7c54b380b ""
  "/usr/share/texmf-dist/tex/latex/tools/multicol.sty" 1650183167 32262 2bb622a0aa56c4a7a5cbdfe9d122c15a ""
  "/usr/share/texmf-dist/web2c/texmf.cnf" 1650183167 39911 2da6c67557ec033436fe5418a70a8a61 ""
  "/var/lib/texmf/web2c/pdftex/latex.fmt" 1651379716 2927645 97e5023e0da3935151df47818bb9a540 ""
  "llncs.cls" 1642680864 43512 637b96de164501a449212e7b2cf4d19d ""
  "samplepaper.aux" 1655384745 8 a94a2480d3289e625eea47cd1b285758 "latex"
  "samplepaper.tex" 1655384734 15190 2e794eee42b63d7e07e6b97e56ab5f6f ""
  (generated)
  "samplepaper.aux"
  "samplepaper.dvi"
  "samplepaper.log"
["ps2pdf"] 0 "samplepaper.ps" "samplepaper.pdf" "samplepaper" 0
  "samplepaper.ps" 0 -1 0 "dvips"
  (generated)
  "samplepaper.pdf"
