%!PS-Adobe-2.0 EPSF-1.2
%%Creator: MATLAB, The MathWorks, Inc. Version 7.14.0.739 (R2012a). Operating System: Linux 3.13.0-53-generic #88-Ubuntu SMP Wed May 13 18:10:29 UTC 2015 x86_64.
%%Title: ./7__PSD_009269772.pow.eps
%%CreationDate: 05/23/2015  14:03:26
%%DocumentNeededFonts: Helvetica
%%DocumentProcessColors: Cyan Magenta Yellow Black
%%Extensions: CMYK
%%Pages: 1
%%BoundingBox:    49   281   577   546
%%EndComments

%%BeginProlog
% MathWorks dictionary
/MathWorks 160 dict begin
% definition operators
/bdef {bind def} bind def
/ldef {load def} bind def
/xdef {exch def} bdef
/xstore {exch store} bdef
% operator abbreviations
/c  /clip ldef
/cc /concat ldef
/cp /closepath ldef
/gr /grestore ldef
/gs /gsave ldef
/mt /moveto ldef
/np /newpath ldef
/cm /currentmatrix ldef
/sm /setmatrix ldef
/rm /rmoveto ldef
/rl /rlineto ldef
/s {show newpath} bdef
/sc {setcmykcolor} bdef
/sr /setrgbcolor ldef
/sg /setgray ldef
/w /setlinewidth ldef
/j /setlinejoin ldef
/cap /setlinecap ldef
/rc {rectclip} bdef
/rf {rectfill} bdef
% page state control
/pgsv () def
/bpage {/pgsv save def} bdef
/epage {pgsv restore} bdef
/bplot /gsave ldef
/eplot {stroke grestore} bdef
% orientation switch
/portraitMode 0 def /landscapeMode 1 def /rotateMode 2 def
% coordinate system mappings
/dpi2point 0 def
% font control
/FontSize 0 def
/FMS {/FontSize xstore findfont [FontSize 0 0 FontSize neg 0 0]
  makefont setfont} bdef
/reencode {exch dup where {pop load} {pop StandardEncoding} ifelse
  exch dup 3 1 roll findfont dup length dict begin
  { 1 index /FID ne {def}{pop pop} ifelse } forall
  /Encoding exch def currentdict end definefont pop} bdef
/isroman {findfont /CharStrings get /Agrave known} bdef
/FMSR {3 1 roll 1 index dup isroman {reencode} {pop pop} ifelse
  exch FMS} bdef
/csm {1 dpi2point div -1 dpi2point div scale neg translate
 dup landscapeMode eq {pop -90 rotate}
  {rotateMode eq {90 rotate} if} ifelse} bdef
% line types: solid, dotted, dashed, dotdash
/SO { [] 0 setdash } bdef
/DO { [.5 dpi2point mul 4 dpi2point mul] 0 setdash } bdef
/DA { [6 dpi2point mul] 0 setdash } bdef
/DD { [.5 dpi2point mul 4 dpi2point mul 6 dpi2point mul 4
  dpi2point mul] 0 setdash } bdef
% macros for lines and objects
/L {lineto stroke} bdef
/MP {3 1 roll moveto 1 sub {rlineto} repeat} bdef
/AP {{rlineto} repeat} bdef
/PDlw -1 def
/W {/PDlw currentlinewidth def setlinewidth} def
/PP {closepath eofill} bdef
/DP {closepath stroke} bdef
/MR {4 -2 roll moveto dup  0 exch rlineto exch 0 rlineto
  neg 0 exch rlineto closepath} bdef
/FR {MR stroke} bdef
/PR {MR fill} bdef
/L1i {{currentfile picstr readhexstring pop} image} bdef
/tMatrix matrix def
/MakeOval {newpath tMatrix currentmatrix pop translate scale
0 0 1 0 360 arc tMatrix setmatrix} bdef
/FO {MakeOval stroke} bdef
/PO {MakeOval fill} bdef
/PD {currentlinewidth 2 div 0 360 arc fill
   PDlw -1 eq not {PDlw w /PDlw -1 def} if} def
/FA {newpath tMatrix currentmatrix pop translate scale
  0 0 1 5 -2 roll arc tMatrix setmatrix stroke} bdef
/PA {newpath tMatrix currentmatrix pop	translate 0 0 moveto scale
  0 0 1 5 -2 roll arc closepath tMatrix setmatrix fill} bdef
/FAn {newpath tMatrix currentmatrix pop translate scale
  0 0 1 5 -2 roll arcn tMatrix setmatrix stroke} bdef
/PAn {newpath tMatrix currentmatrix pop translate 0 0 moveto scale
  0 0 1 5 -2 roll arcn closepath tMatrix setmatrix fill} bdef
/vradius 0 def /hradius 0 def /lry 0 def
/lrx 0 def /uly 0 def /ulx 0 def /rad 0 def
/MRR {/vradius xdef /hradius xdef /lry xdef /lrx xdef /uly xdef
  /ulx xdef newpath tMatrix currentmatrix pop ulx hradius add uly
  vradius add translate hradius vradius scale 0 0 1 180 270 arc 
  tMatrix setmatrix lrx hradius sub uly vradius add translate
  hradius vradius scale 0 0 1 270 360 arc tMatrix setmatrix
  lrx hradius sub lry vradius sub translate hradius vradius scale
  0 0 1 0 90 arc tMatrix setmatrix ulx hradius add lry vradius sub
  translate hradius vradius scale 0 0 1 90 180 arc tMatrix setmatrix
  closepath} bdef
/FRR {MRR stroke } bdef
/PRR {MRR fill } bdef
/MlrRR {/lry xdef /lrx xdef /uly xdef /ulx xdef /rad lry uly sub 2 div def
  newpath tMatrix currentmatrix pop ulx rad add uly rad add translate
  rad rad scale 0 0 1 90 270 arc tMatrix setmatrix lrx rad sub lry rad
  sub translate rad rad scale 0 0 1 270 90 arc tMatrix setmatrix
  closepath} bdef
/FlrRR {MlrRR stroke } bdef
/PlrRR {MlrRR fill } bdef
/MtbRR {/lry xdef /lrx xdef /uly xdef /ulx xdef /rad lrx ulx sub 2 div def
  newpath tMatrix currentmatrix pop ulx rad add uly rad add translate
  rad rad scale 0 0 1 180 360 arc tMatrix setmatrix lrx rad sub lry rad
  sub translate rad rad scale 0 0 1 0 180 arc tMatrix setmatrix
  closepath} bdef
/FtbRR {MtbRR stroke } bdef
/PtbRR {MtbRR fill } bdef
/stri 6 array def /dtri 6 array def
/smat 6 array def /dmat 6 array def
/tmat1 6 array def /tmat2 6 array def /dif 3 array def
/asub {/ind2 exch def /ind1 exch def dup dup
  ind1 get exch ind2 get sub exch } bdef
/tri_to_matrix {
  2 0 asub 3 1 asub 4 0 asub 5 1 asub
  dup 0 get exch 1 get 7 -1 roll astore } bdef
/compute_transform {
  dmat dtri tri_to_matrix tmat1 invertmatrix 
  smat stri tri_to_matrix tmat2 concatmatrix } bdef
/ds {stri astore pop} bdef
/dt {dtri astore pop} bdef
/db {2 copy /cols xdef /rows xdef mul dup 3 mul string
  currentfile exch readhexstring pop
  dup 0 3 index getinterval /rbmap xdef
  dup 2 index dup getinterval /gbmap xdef
  1 index dup 2 mul exch getinterval /bbmap xdef pop pop}bdef
/it {gs np dtri aload pop moveto lineto lineto cp c
  cols rows 8 compute_transform 
  rbmap gbmap bbmap true 3 colorimage gr}bdef
/il {newpath moveto lineto stroke}bdef
currentdict end def
%%EndProlog

%%BeginSetup
MathWorks begin

0 cap

end
%%EndSetup

%%Page: 1 1
%%BeginPageSetup
%%PageBoundingBox:    49   281   577   546
MathWorks begin
bpage
%%EndPageSetup

%%BeginObject: obj1
bplot

/dpi2point 12 def
portraitMode 0216 7344 csm

  372   787  6343  3183 MR c np
27 dict begin %Colortable dictionary
/c0 { 0.000000 0.000000 0.000000 sr} bdef
/c1 { 1.000000 1.000000 1.000000 sr} bdef
/c2 { 0.900000 0.000000 0.000000 sr} bdef
/c3 { 0.000000 0.820000 0.000000 sr} bdef
/c4 { 0.000000 0.000000 0.800000 sr} bdef
/c5 { 0.910000 0.820000 0.320000 sr} bdef
/c6 { 1.000000 0.260000 0.820000 sr} bdef
/c7 { 0.000000 0.820000 0.820000 sr} bdef
c0
1 j
1 sg
   0    0 6913 5186 PR
6 w
0 2593 5875 0 0 -2593 691 3630 4 MP
PP
-5875 0 0 2593 5875 0 0 -2593 691 3630 5 MP stroke
gs 691 1037 5876 2594 MR c np
/c8 { 0.909091 0.000000 0.090909 sr} bdef
c8
1 0 1 -1 1 0 1 4 1 -3 1 -1 1 5 1 3 
0 1 1 -4 1 -3 1 -1 1 -1 0 2 1 -1 1 5 
1 -4 0 1 1 -3 1 3 1 -3 1 0 1 18 1 -17 
1 -1 0 2 1 0 1 2 1 0 0 -2 1 6 1 -8 
1 2 1 -1 0 -1 1 3 1 1 1 -3 1 5 1 0 
1 -6 0 6 1 -4 1 -1 1 3 1 -2 0 9 1 -7 
1 -1 1 -1 0 2 1 -1 1 -3 1 5 1 2 1 15 
1 -18 1 -3 0 -1 1 9 1 -9 1 5 0 -2 1 -3 
1 3 1 -3 1 0 0 3 1 3 1 -2 1 -4 0 1 
1 1 1 -1 1 0 1 -1 0 4 1 -2 1 2 1 -2 
0 -1 1 1 1 5 1 -6 0 -1 1 2 1 -1 1 1 
1 3 0 -5 1 6 1 -2 1 2 0 -5 1 3 1 -3 
1 3 1 1 0 9 6487 3615 100 MP stroke
1 -12 1 0 1 -1 1 -1 1 1 1 2 0 -1 1 -2 
1 0 1 3 1 4 0 -6 1 2 1 -3 1 2 0 -2 
1 2 1 9 1 -8 1 1 0 -3 1 -1 1 3 1 9 
0 -12 1 5 1 -2 1 0 -1 0 2 -3 1 6 1 -3 
1 -2 1 -1 1 1 1 1 0 1 1 1 1 0 1 -3 
1 1 0 5 1 1 1 -8 1 3 1 0 1 2 1 -5 
1 9 1 0 1 -7 1 0 0 3 1 0 1 2 1 -7 
0 3 1 -2 1 3 1 -3 1 1 1 -1 1 2 1 -2 
0 3 1 1 1 -2 1 -2 1 -1 1 0 1 2 1 -2 
0 6 1 -2 1 -4 1 3 0 -2 1 6 1 -6 1 -1 
1 1 0 2 1 0 1 -3 1 1 0 1 1 3 1 -5 
1 2 1 4 0 -6 1 0 1 2 1 2 0 2 1 -3 
1 -2 1 0 1 7 6405 3621 100 MP stroke
1 -7 1 -1 1 8 0 2 1 -5 1 -4 1 1 1 1 
1 14 1 -12 1 -5 0 5 1 -5 1 1 1 -1 0 1 
1 3 1 -4 1 5 0 -5 1 4 1 -2 1 2 1 1 
0 -5 1 0 1 0 1 0 -1 0 2 0 1 0 1 0 
1 8 0 -8 1 0 1 1 1 0 -1 0 2 0 1 5 
1 -1 0 -4 1 8 1 -7 1 -2 1 6 0 -5 1 -1 
1 5 1 -5 0 1 1 -1 1 0 1 2 1 2 1 -2 
1 0 1 -1 0 4 1 6 1 -9 1 6 0 -8 1 4 
1 -4 1 1 1 1 0 2 1 -3 1 8 1 -4 0 -4 
1 -1 1 0 1 1 1 -1 0 3 1 0 1 2 1 0 
0 5 1 -5 1 -3 1 -2 0 4 1 -4 1 2 1 -2 
1 1 1 1 1 -2 1 0 0 2 1 6 1 -4 1 -1 
1 5 0 -3 1 -2 6326 3626 100 MP stroke
1 5 1 -2 0 -6 1 0 1 6 1 -6 1 0 1 5 
1 7 1 -9 1 1 1 -4 1 4 0 -3 1 3 1 -3 
1 0 1 0 0 33 1 -32 1 -1 1 1 0 -2 1 4 
1 4 1 -4 0 -3 1 -1 1 2 1 8 1 -9 0 -1 
1 7 1 -6 1 0 0 2 1 0 1 3 1 -6 1 3 
0 -3 1 2 1 -1 1 -1 0 5 1 0 1 -3 1 -1 
0 1 1 3 1 5 1 12 1 -21 1 -1 1 0 1 6 
0 -5 1 -1 1 1 1 -1 1 1 0 -1 1 1 1 0 
1 -1 1 3 1 0 1 2 1 -4 1 2 1 -1 1 1 
0 -1 1 1 1 -2 1 3 0 3 1 -6 1 1 1 -1 
1 3 0 -2 1 -2 1 2 1 4 0 -4 1 6 1 -8 
1 7 0 -4 1 -1 1 -1 1 6 1 -3 0 -2 1 -2 
1 3 1 2 0 2 6246 3622 100 MP stroke
1 0 1 -4 1 -2 1 1 0 1 1 -2 1 1 1 0 
0 -2 1 1 1 3 1 1 1 -5 0 1 1 4 1 -5 
1 6 0 -6 1 2 1 3 1 0 -1 0 2 -5 1 2 
1 -1 1 2 1 3 1 -4 1 -2 1 7 1 -4 1 0 
1 -3 0 5 1 -2 1 2 1 3 0 -7 1 8 1 -7 
1 -2 0 17 1 -15 1 1 1 9 1 -12 0 10 1 -9 
1 2 1 0 0 -2 1 4 1 -4 1 13 1 -14 0 7 
1 -6 1 0 1 2 0 -2 1 -1 1 6 1 -5 1 9 
1 -9 1 -1 1 0 -1 0 2 11 1 -6 1 0 1 5 
1 -8 1 2 1 7 1 -6 1 -3 1 -2 0 11 1 -11 
1 9 1 -5 0 -1 1 -2 1 0 1 12 1 -13 0 4 
1 11 1 -12 1 5 0 -7 1 0 1 2 1 -2 1 6 
0 1 1 -6 1 0 6165 3627 100 MP stroke
1 -2 0 1 1 1 1 1 1 -3 0 3 1 0 1 3 
1 -5 1 -1 0 9 1 -9 1 4 1 -2 0 4 1 8 
1 -13 1 3 1 -4 0 3 1 3 1 -1 1 -3 0 7 
1 -5 1 1 1 8 0 -1 1 -9 1 -3 1 4 1 -4 
0 3 1 -3 1 5 1 -3 1 -1 1 2 1 -1 1 -1 
0 5 1 -5 1 5 1 -6 0 9 1 -8 1 0 1 0 
1 1 1 7 1 -9 1 8 0 -6 1 3 1 3 1 -5 
0 12 1 -1 1 -14 1 0 1 1 0 6 1 -6 1 12 
1 -12 0 -1 1 5 1 9 1 -9 0 -3 1 -2 1 1 
1 7 1 -6 0 3 1 -2 1 4 1 -7 0 5 1 -5 
1 17 1 -16 1 3 0 -1 1 -3 1 3 1 -3 0 1 
1 -1 1 7 1 -2 0 1 1 -1 1 2 1 -6 1 -1 
0 1 1 1 1 0 6087 3627 100 MP stroke
1 2 0 9 1 -5 1 -8 1 0 1 6 0 -3 1 -1 
1 -2 1 3 0 8 1 -11 1 2 1 9 1 -11 0 4 
1 -4 1 1 1 -1 1 0 1 6 1 -2 0 -4 1 14 
1 -11 1 1 1 -4 0 3 1 -3 1 16 1 -15 0 5 
1 -4 1 2 1 -2 1 12 0 -7 1 -3 1 4 1 -3 
0 -4 1 -1 1 3 1 -1 0 -2 1 3 1 -1 1 6 
1 2 0 -3 1 29 1 -35 1 10 0 -10 1 2 1 0 
1 8 1 -7 0 -3 1 -1 1 1 1 0 1 18 1 -19 
1 1 1 3 1 2 1 -6 1 2 0 -2 1 1 1 -1 
1 2 0 6 1 -8 1 0 1 3 1 9 0 -11 1 0 
1 0 1 -1 1 0 1 2 1 -2 0 3 1 -3 1 4 
1 6 1 -10 0 7 1 -7 1 0 1 0 -1 0 2 0 
1 3 1 -2 1 19 6007 3609 100 MP stroke
0 -16 1 -4 1 10 1 -2 0 -8 1 3 1 -3 1 4 
0 -4 1 1 1 8 1 -9 1 3 0 2 1 -5 1 8 
1 -8 0 10 1 -3 1 -7 1 2 1 -1 0 5 1 -6 
1 2 1 -1 0 1 1 10 1 -10 1 0 1 15 1 -16 
1 0 1 4 0 -5 1 14 1 -13 1 10 0 -10 1 5 
1 -1 1 -5 1 6 0 2 1 3 1 -10 1 -1 0 5 
1 -2 1 -1 1 -2 0 1 1 -1 1 10 1 -8 1 0 
0 2 1 1 1 -4 1 16 0 -13 1 2 1 -5 1 -1 
1 6 0 -2 1 24 1 -28 1 3 0 -1 1 1 1 3 
1 -4 0 -2 1 2 1 6 1 -8 1 3 0 20 1 -18 
1 -2 1 -3 0 2 1 -2 1 0 1 0 1 1 0 1 
1 -2 1 8 1 -7 0 -1 1 11 1 -1 1 -8 0 11 
1 -3 1 -7 1 0 5930 3626 100 MP stroke
1 2 0 -2 1 -2 1 11 1 -10 0 8 1 -1 1 -5 
1 4 1 -2 0 -3 1 -3 1 1 1 5 1 -6 1 1 
1 -1 1 2 0 -1 1 -1 1 0 1 10 0 -3 1 -5 
1 -2 1 0 0 3 1 2 1 0 1 -4 1 1 0 4 
1 0 1 -5 1 -1 0 10 1 -10 1 13 1 11 1 -19 
0 -1 1 -2 1 -1 1 2 0 -3 1 1 1 0 1 -1 
0 1 1 3 1 0 1 -2 1 -1 0 -1 1 2 1 0 
1 0 -1 0 2 7 1 -4 1 1 1 -2 0 -2 1 -2 
1 1 1 3 0 4 1 -3 1 4 1 -6 0 1 1 -2 
1 10 1 -5 1 0 0 -6 1 1 1 6 1 -7 0 -1 
1 1 1 3 1 -4 1 4 1 -3 1 2 1 0 0 -3 
1 8 1 -4 1 -2 0 -1 1 -1 1 7 1 -7 1 5 
0 -5 1 8 1 1 5852 3620 100 MP stroke
1 -9 0 1 1 4 1 -4 1 0 1 1 0 3 1 1 
1 -6 1 1 0 5 1 1 1 -7 1 1 1 13 1 -3 
1 -5 1 -2 0 27 1 -31 1 6 1 -2 0 3 1 0 
1 -4 1 3 1 -4 0 23 1 -17 1 -8 1 3 1 1 
1 -2 1 4 0 -5 1 23 1 -22 1 10 1 -2 0 -1 
1 -7 1 2 1 -2 0 3 1 -5 1 1 1 2 1 1 
0 2 1 5 1 -9 1 -1 0 11 1 -9 1 0 1 6 
0 -6 1 3 1 -5 1 1 1 1 0 -2 1 -1 1 0 
1 0 0 3 1 -2 1 10 1 -11 1 3 0 4 1 6 
1 -13 1 3 0 -3 1 9 1 -4 1 -2 0 11 1 -5 
1 -2 1 -1 1 -6 0 1 1 2 1 -2 1 -1 0 8 
1 -6 1 -1 1 14 1 -7 0 -8 1 6 1 -6 1 4 
0 10 1 -14 1 7 5774 3622 100 MP stroke
1 -6 0 14 1 -7 1 -6 1 -2 1 9 0 -6 1 -3 
1 5 1 -5 0 13 1 -11 1 9 1 6 1 -13 0 -3 
1 -1 1 0 1 2 0 -2 1 0 1 1 1 -1 0 7 
1 7 1 -14 1 5 1 -2 0 -3 1 1 1 1 1 7 
0 -3 1 -6 1 1 1 4 1 -5 0 9 1 -2 1 -6 
1 7 0 -4 1 0 1 3 1 -2 1 -5 0 25 1 -13 
1 -3 1 -3 0 -3 1 7 1 -9 1 1 0 -1 1 6 
1 -7 1 5 1 -3 0 3 1 2 1 -7 1 11 0 -5 
1 -5 1 8 1 -9 1 4 0 -3 1 5 1 -3 1 -3 
1 1 1 4 1 3 0 -8 1 0 1 2 1 2 1 -1 
0 2 1 1 1 -5 1 9 1 2 1 -11 1 0 1 -1 
0 2 1 0 1 14 1 -14 1 7 1 -7 1 8 0 -5 
1 -4 1 11 1 -11 5695 3628 100 MP stroke
1 10 0 -6 1 -4 1 -1 1 1 0 3 1 -2 1 0 
1 19 1 -19 0 6 1 -8 1 4 1 1 0 -4 1 -1 
1 1 1 9 0 6 1 -14 1 -2 1 0 1 5 0 -4 
1 0 1 -1 1 3 0 -2 1 0 1 -1 1 7 1 -7 
0 8 1 -8 1 1 1 0 0 11 1 -12 1 0 1 2 
0 2 1 -3 1 1 1 6 1 -8 0 1 1 -1 1 4 
1 14 0 -16 1 -2 1 3 1 1 1 -3 1 0 1 3 
1 -3 0 8 1 -6 1 19 1 -19 0 1 1 -4 1 14 
1 -12 1 1 0 -3 1 16 1 -2 1 -14 0 2 1 -2 
1 5 1 9 1 4 0 -18 1 7 1 -7 1 0 -1 0 
2 3 1 -2 1 -1 0 2 1 -2 1 2 1 0 1 -1 
0 3 1 -3 1 8 1 3 0 -8 1 7 1 -3 1 -1 
1 -1 0 -6 1 2 5618 3627 100 MP stroke
1 -1 1 5 0 10 1 -12 1 -2 1 1 0 2 1 -1 
1 1 1 -5 1 2 1 -2 1 9 1 -7 0 28 1 -27 
1 -3 1 7 1 1 0 -7 1 0 1 3 1 3 0 -7 
1 16 1 -15 1 2 0 -1 1 6 1 -7 1 5 1 -1 
1 -4 1 7 1 2 0 1 1 -10 1 7 1 6 1 -10 
0 23 1 -27 1 12 1 -9 0 -2 1 3 1 -2 1 7 
1 -5 0 4 1 -6 1 5 1 0 -1 0 2 4 1 -10 
1 4 0 -5 1 30 1 -27 1 -3 1 3 0 -1 1 1 
1 0 1 1 0 5 1 -3 1 -4 1 7 1 -9 0 1 
1 1 1 3 1 -2 0 3 1 -2 1 -1 1 10 0 -11 
1 3 1 -5 1 5 1 6 0 -7 1 -4 1 3 1 -1 
0 1 1 -2 1 1 1 -1 1 16 0 -17 1 12 1 -12 
1 0 0 15 1 -13 5540 3627 100 MP stroke
1 -1 1 0 0 9 1 -6 1 -1 1 3 1 -3 0 -1 
1 6 1 -7 1 2 0 18 1 -21 1 0 1 1 1 15 
0 -14 1 9 1 -8 1 -3 0 9 1 -2 1 3 1 1 
0 -7 1 7 1 -11 1 2 1 -1 0 6 1 -6 1 4 
1 -3 0 1 1 7 1 -2 1 -6 1 0 0 -2 1 1 
1 5 1 -4 0 1 1 -2 1 0 1 0 0 3 1 -2 
1 13 1 -11 1 2 1 -1 1 -1 1 17 0 -15 1 -5 
1 2 1 -1 1 3 0 -2 1 -1 1 11 1 -10 0 1 
1 -4 1 3 1 -3 0 18 1 -18 1 3 1 9 1 1 
0 -11 1 0 1 10 1 -10 0 4 1 -5 1 12 1 -13 
1 0 0 4 1 -3 1 4 1 15 0 -19 1 1 1 -2 
1 0 0 18 1 -18 1 0 1 5 1 -5 0 5 1 13 
1 -18 1 16 0 -13 5463 3626 100 MP stroke
1 -2 1 0 1 0 1 0 0 7 1 0 1 0 1 -8 
0 10 1 -10 1 4 1 -2 0 7 1 -5 1 -4 1 1 
1 30 0 -29 1 0 1 -1 1 3 0 4 1 -7 1 1 
1 -1 1 4 0 7 1 -11 1 22 1 -22 0 11 1 -7 
1 -3 1 10 0 5 1 -16 1 6 1 8 1 -11 0 -3 
1 27 1 -28 1 2 0 6 1 7 1 -15 1 7 1 -7 
0 13 1 -10 1 -3 1 6 0 5 1 2 1 -12 1 5 
1 -1 0 -5 1 9 1 -8 1 9 0 -2 1 11 1 -9 
1 -10 0 1 1 6 1 6 1 -11 1 -2 0 7 1 3 
1 -7 1 -3 0 6 1 -6 1 6 1 -6 1 1 0 10 
1 -3 1 7 1 18 0 -31 1 0 1 0 1 12 0 -14 
1 6 1 3 1 12 1 -19 0 46 1 -43 1 -2 1 4 
0 -6 1 7 1 8 5386 3613 100 MP stroke
1 -14 1 2 1 3 1 -1 1 -6 0 7 1 -6 1 -1 
1 1 0 29 1 -30 1 0 1 11 1 1 0 -6 1 -4 
1 1 1 -3 0 5 1 -3 1 15 1 -12 1 -5 0 5 
1 -4 1 8 1 6 0 -12 1 2 1 1 1 10 0 -15 
1 2 1 1 1 0 1 8 0 1 1 7 1 -11 1 3 
0 -10 1 -2 1 10 1 -5 1 -4 0 1 1 2 1 -2 
1 7 0 -6 1 -2 1 6 1 -6 0 12 1 -5 1 -3 
1 5 1 -5 0 3 1 -6 1 1 1 4 0 -4 1 13 
1 -8 1 2 1 -9 0 1 1 -1 1 0 1 0 -1 0 
2 3 1 4 1 -2 0 -5 1 3 1 -3 1 7 1 -4 
0 3 1 -7 1 14 1 -12 0 5 1 -4 1 -2 1 11 
1 -11 0 8 1 3 1 -9 1 1 0 15 1 -13 1 2 
1 -8 0 1 1 22 5309 3606 100 MP stroke
1 -19 1 8 1 -7 0 -1 1 -2 1 7 1 10 0 -12 
1 -5 1 5 1 -6 1 14 0 -15 1 7 1 0 1 -3 
0 -4 1 3 1 -3 1 1 0 10 1 -1 1 -8 1 5 
1 -5 0 22 1 -15 1 -9 1 10 1 -8 1 9 1 -8 
1 -3 0 5 1 3 1 -7 1 -1 0 8 1 -7 1 -1 
1 3 0 3 1 -1 1 -5 1 15 1 -13 0 -2 1 6 
1 4 1 -6 0 -3 1 -1 1 1 1 6 1 -6 0 1 
1 -2 1 16 1 -10 0 -3 1 7 1 -3 1 18 0 -22 
1 4 1 2 1 -9 1 1 0 14 1 15 1 -23 1 0 
0 -7 1 2 1 0 1 -2 1 11 0 25 1 -31 1 -5 
1 4 0 -2 1 0 1 7 1 -7 1 2 0 -3 1 1 
1 27 1 -26 0 1 1 12 1 -8 1 14 0 -22 1 4 
1 3 1 2 1 -3 5231 3623 100 MP stroke
0 -2 1 13 1 -16 1 20 0 -4 1 -6 1 -2 1 0 
1 -3 0 -2 1 3 1 -7 1 14 0 -8 1 -3 1 -2 
1 4 0 -5 1 26 1 5 1 -30 1 15 0 9 1 -14 
1 -7 1 13 0 -14 1 -3 1 2 1 0 1 27 0 -4 
1 -23 1 1 1 14 0 -15 1 7 1 -8 1 5 0 -5 
1 -1 1 1 1 7 1 -6 0 15 1 -17 1 2 1 1 
0 -3 1 7 1 15 1 -4 1 1 0 -16 1 -3 1 3 
1 6 0 2 1 -10 1 9 1 -7 0 5 1 -7 1 24 
1 -24 1 18 0 -18 1 5 1 -3 1 0 0 21 1 -23 
1 3 1 3 1 -5 0 -2 1 2 1 18 1 9 0 -29 
1 4 1 19 1 -5 0 -17 1 0 1 0 1 8 1 -5 
0 16 1 -16 1 -3 1 1 1 2 1 0 1 4 1 -6 
0 3 1 0 1 0 5154 3624 100 MP stroke
1 0 0 3 1 -6 1 2 1 -4 0 3 1 -1 1 7 
1 -9 1 23 0 -17 1 -2 1 -4 1 1 0 9 1 -4 
1 -3 1 2 1 -1 0 -3 1 0 1 4 1 -1 0 4 
1 11 1 3 1 -22 0 2 1 -1 1 0 1 4 1 -2 
0 20 1 -23 1 1 1 -1 0 4 1 -3 1 7 1 -8 
1 2 1 1 1 11 1 -10 0 4 1 -8 1 16 1 -16 
0 1 1 7 1 -7 1 6 1 0 0 -2 1 3 1 -6 
1 16 0 -17 1 17 1 -14 1 -3 1 16 0 -14 1 -3 
1 6 1 4 0 -7 1 1 1 -4 1 1 1 6 1 3 
1 -5 1 9 0 -2 1 -12 1 6 1 11 0 -17 1 5 
1 1 1 7 1 -7 0 -3 1 18 1 -19 1 0 0 11 
1 23 1 -35 1 7 1 -4 0 -2 1 0 1 -1 1 5 
0 -4 1 5 1 -5 5076 3627 100 MP stroke
1 0 0 3 1 -4 1 11 1 6 1 -18 0 5 1 -5 
1 0 1 22 0 -14 1 -6 1 5 1 10 1 -13 0 -3 
1 14 1 -11 1 4 0 -8 1 0 1 10 1 -8 0 32 
1 -8 1 -26 1 7 1 5 0 -4 1 -2 1 1 1 15 
0 -17 1 -3 1 15 1 -1 1 -6 0 -7 1 2 1 0 
1 0 0 5 1 -9 1 45 1 -45 0 8 1 13 1 8 
1 -7 1 1 0 17 1 -30 1 -9 1 5 0 1 1 -6 
1 33 1 -34 1 57 0 -58 1 16 1 -10 1 12 0 -15 
1 8 1 -9 1 7 0 2 1 0 1 -9 1 0 1 -2 
0 1 1 6 1 -4 1 2 0 16 1 2 1 -20 1 3 
1 0 0 -6 1 1 1 16 1 -15 0 -2 1 1 1 21 
1 18 0 -31 1 16 1 -16 1 0 1 22 0 -24 1 -7 
1 14 1 -11 0 31 5000 3595 100 MP stroke
1 -15 1 -15 1 2 1 -4 0 4 1 -1 1 1 1 7 
0 2 1 -15 1 4 1 -2 0 -1 1 2 1 0 1 7 
1 29 0 -30 1 -9 1 0 1 0 0 28 1 -23 1 -3 
1 36 1 -16 0 10 1 -32 1 1 1 0 -1 0 2 0 
1 3 1 -3 1 0 1 -1 1 21 1 -21 1 17 1 -7 
1 -10 0 12 1 -5 1 4 1 -10 1 16 0 -16 1 -1 
1 2 1 14 0 -14 1 4 1 -3 1 1 0 41 1 -43 
1 3 1 16 1 -19 0 2 1 0 1 7 1 0 0 -2 
1 -5 1 4 1 -4 1 -1 0 2 1 12 1 1 1 20 
0 -23 1 -12 1 6 1 -9 0 13 1 16 1 0 1 -27 
1 -1 0 25 1 -24 1 4 1 4 0 -8 1 0 1 -1 
1 1 1 5 0 -7 1 14 1 -4 1 0 0 -10 1 2 
1 -2 1 1 0 9 4922 3619 100 MP stroke
1 4 1 -9 1 3 1 -8 0 17 1 -15 1 5 1 7 
0 -13 1 22 1 -22 1 9 1 -10 0 4 1 9 1 -3 
1 -1 0 21 1 -15 1 16 1 -19 1 10 0 -13 1 -9 
1 48 1 -43 1 1 1 -6 1 10 0 -9 1 0 1 -1 
1 12 1 4 0 1 1 -5 1 -2 1 32 0 -35 1 -6 
1 16 1 27 1 -27 0 -7 1 0 1 -2 1 3 0 -5 
1 3 1 21 1 -30 0 17 1 -12 1 -2 1 -2 1 3 
0 7 1 19 1 -22 1 16 0 -12 1 0 1 -9 1 14 
1 -5 0 4 1 -3 1 -5 1 2 0 -5 1 -4 1 19 
1 21 0 -34 1 3 1 6 1 -9 1 -2 0 2 1 5 
1 -7 1 4 0 -4 1 27 1 -22 1 -8 1 16 0 2 
1 -8 1 32 1 -32 1 1 1 8 1 9 0 -14 1 -16 
1 1 1 2 1 -1 4843 3627 100 MP stroke
0 1 1 18 1 4 1 -20 0 -4 1 15 1 -2 1 -9 
1 3 0 -5 1 11 1 -7 1 -7 0 4 1 24 1 -28 
1 5 0 3 1 -6 1 -1 1 10 1 -11 0 11 1 -3 
1 2 1 -6 0 14 1 -18 1 27 1 -20 1 4 0 -6 
1 1 1 2 1 -7 0 21 1 -17 1 -3 1 2 0 5 
1 -8 1 2 1 -2 1 9 0 -8 1 11 1 -7 1 -5 
0 3 1 1 1 2 1 0 1 -6 1 2 1 -2 1 5 
0 -6 1 14 1 -12 1 17 0 -18 1 0 1 2 1 11 
1 -10 0 18 1 -16 1 -5 1 0 0 2 1 -1 1 0 
1 6 1 -8 1 7 1 -2 1 0 0 -2 1 6 1 -9 
1 3 0 -3 1 6 1 3 1 -4 1 9 0 -4 1 0 
1 30 1 6 0 -38 1 -2 1 5 1 -7 1 0 0 7 
1 22 1 -4 1 -24 4765 3624 100 MP stroke
0 -1 1 8 1 0 1 40 0 -48 1 4 1 -7 1 -1 
1 2 0 -2 1 11 1 -3 1 -8 0 2 1 6 1 3 
1 -10 1 4 0 -4 1 2 1 12 1 38 0 -47 1 -1 
1 9 1 -11 1 1 0 37 1 -30 1 9 1 -4 0 -3 
1 -12 1 28 1 -27 0 -2 1 1 1 10 1 24 1 -27 
0 2 1 12 1 -20 1 8 0 -4 1 -6 1 11 1 -6 
1 13 0 -6 1 3 1 -15 1 21 0 -18 1 11 1 -9 
1 -1 0 -3 1 4 1 5 1 24 1 -15 0 -19 1 2 
1 4 1 -6 0 5 1 -5 1 7 1 17 1 -17 0 -1 
1 4 1 24 1 -30 0 -2 1 4 1 45 1 -22 0 -18 
1 -1 1 -6 1 21 1 -7 0 1 1 -16 1 24 1 -27 
0 2 1 -2 1 4 1 6 1 -6 0 1 1 -1 1 43 
1 -38 0 8 1 -17 4689 3629 100 MP stroke
1 1 1 13 0 -14 1 9 1 6 1 55 1 -70 0 20 
1 -13 1 -7 1 1 0 60 1 -60 1 19 1 41 1 -52 
0 -9 1 2 1 23 1 35 0 11 1 -60 1 -2 1 10 
0 3 1 -20 1 11 1 4 1 27 0 -39 1 30 1 -32 
1 16 0 -4 1 -15 1 4 1 -4 1 11 0 36 1 -40 
1 11 1 -18 0 26 1 -21 1 11 1 10 0 20 1 -22 
1 -17 1 14 1 -12 0 60 1 -66 1 4 1 27 0 -14 
1 36 1 -17 1 -28 1 32 0 25 1 -60 1 -8 1 77 
0 -75 1 9 1 39 1 21 0 -49 1 -22 1 20 1 -20 
1 40 0 -37 1 -3 1 8 1 47 0 -52 1 21 1 -24 
1 3 1 29 0 -4 1 -28 1 4 1 21 0 -20 1 -2 
1 60 1 -48 0 25 1 -17 1 -9 1 -4 1 0 -1 0 
2 -3 1 -3 1 -3 4612 3628 100 MP stroke
0 29 1 -3 1 -26 1 20 1 -10 0 -3 1 9 1 -5 
1 10 0 -14 1 -6 1 -1 1 14 0 -1 1 -11 1 9 
1 3 1 9 0 -24 1 0 1 20 1 5 0 -25 1 24 
1 -7 1 -6 1 1 0 -7 1 -2 1 29 1 -30 0 10 
1 17 1 -22 1 5 1 -11 0 15 1 -9 1 -3 1 0 
0 3 1 30 1 -26 1 -7 0 -3 1 1 1 3 1 13 
1 5 0 -17 1 36 1 -12 1 -20 0 33 1 -39 1 7 
1 -11 1 0 0 37 1 -32 1 5 1 -9 0 16 1 -14 
1 2 1 1 0 1 1 7 1 -4 1 -3 1 3 0 5 
1 2 1 29 1 -44 0 16 1 -18 1 5 1 5 1 1 
0 -5 1 17 1 5 1 1 0 -15 1 -3 1 -3 1 18 
0 40 1 -45 1 49 1 -68 1 105 0 -102 1 14 1 -5 
1 -7 0 -6 1 80 4536 3548 100 MP stroke
1 -69 1 5 1 -12 0 -1 1 78 1 -78 1 13 0 56 
1 -63 1 60 1 49 0 -105 1 -8 1 29 1 11 1 -20 
0 4 1 -30 1 3 1 44 0 -44 1 72 1 -47 1 -28 
1 68 0 -49 1 32 1 -21 1 -18 0 -2 1 -2 1 44 
1 -7 0 55 1 -89 1 11 1 -15 1 86 0 -92 1 30 
1 28 1 -53 0 -5 1 6 1 11 1 0 1 -7 0 -9 
1 27 1 -25 1 27 0 32 1 -46 1 -7 1 -1 0 12 
1 3 1 -6 1 -12 1 74 0 -63 1 13 1 -26 1 53 
0 -55 1 15 1 22 1 17 1 -54 0 35 1 -32 1 -5 
1 21 1 -21 1 34 1 -32 0 6 1 4 1 -7 1 1 
1 22 0 -5 1 -21 1 29 1 -4 0 5 1 -23 1 -2 
1 17 1 -18 0 -1 1 -3 1 11 1 -4 0 6 1 1 
1 -13 1 -3 0 16 4459 3613 100 MP stroke
1 -13 1 26 1 -11 1 -5 0 -7 1 -3 1 7 1 -1 
0 -3 1 17 1 -22 1 37 1 12 0 -25 1 -7 1 -6 
1 -1 0 -11 1 1 1 6 1 -3 0 -1 1 7 1 -8 
1 75 1 -76 0 8 1 12 1 -14 1 0 0 3 1 10 
1 -6 1 -13 1 28 0 -17 1 -7 1 -2 1 7 0 -8 
1 5 1 18 1 4 0 -27 1 37 1 -20 1 -11 1 9 
0 -10 1 18 1 -14 1 -8 0 5 1 7 1 -5 1 4 
1 -8 0 2 1 -2 1 -3 1 40 0 -43 1 95 1 -68 
1 -5 1 -8 0 5 1 11 1 -16 1 0 0 4 1 -6 
1 -8 1 28 0 2 1 -6 1 -27 1 30 1 -24 0 10 
1 4 1 -16 1 -4 0 7 1 7 1 1 1 -16 1 23 
0 -19 1 14 1 -7 1 -6 0 5 1 1 1 24 1 -29 
0 6 1 -6 1 4 4382 3619 100 MP stroke
1 -10 1 2 0 1 1 3 1 14 1 -16 0 -2 1 -1 
1 5 1 11 1 -5 0 -6 1 1 1 19 1 -1 0 20 
1 -37 1 -5 1 4 0 3 1 14 1 -22 1 10 1 -11 
0 1 1 4 1 -6 1 1 0 15 1 -6 1 -3 1 7 
1 -6 0 2 1 6 1 -2 1 -4 0 10 1 -8 1 -8 
1 -2 0 17 1 -19 1 11 1 77 1 -85 1 16 1 61 
1 -40 0 -40 1 12 1 2 1 -6 1 -2 0 4 1 65 
1 0 1 -31 0 -10 1 30 1 25 1 -69 0 19 1 0 
1 70 1 -33 1 11 0 -47 1 9 1 -41 1 5 0 -11 
1 13 1 134 1 -91 1 1 0 -40 1 -9 1 192 1 -92 
0 -11 1 -61 1 -21 1 99 0 -27 1 -89 1 37 1 -1 
1 -35 0 4 1 46 1 -13 1 -34 0 18 1 28 1 -27 
1 -2 1 -15 0 34 4305 3589 100 MP stroke
1 -7 1 -1 1 19 0 3 1 -48 1 2 1 37 0 -19 
1 -23 1 28 1 72 1 2 0 -100 1 46 1 -16 1 -4 
0 -25 1 19 1 14 1 26 1 -57 0 46 1 -4 1 -28 
1 0 0 357 1 -362 1 -13 1 35 0 35 1 -45 1 -29 
1 4 1 2 0 14 1 21 1 -29 1 9 0 -7 1 -4 
1 -5 1 27 1 20 0 -24 1 -23 1 30 1 -30 0 67 
1 -48 1 94 1 -57 0 -41 1 5 1 -10 1 21 1 -26 
0 -9 1 -1 1 20 1 -13 0 -7 1 15 1 15 1 -24 
1 -5 0 12 1 -10 1 63 1 -54 0 32 1 -29 1 -4 
1 3 1 -14 0 7 1 2 1 -5 1 21 0 -18 1 -6 
1 5 1 29 0 -26 1 16 1 -24 1 19 1 4 0 -11 
1 20 1 -13 1 -18 0 -1 1 12 1 -4 1 0 1 -3 
0 -6 1 25 1 -21 4228 3625 100 MP stroke
1 -1 0 8 1 -2 1 11 1 -4 0 -8 1 10 1 -5 
1 18 1 -20 0 -2 1 5 1 6 1 -18 0 21 1 -22 
1 7 1 -4 1 2 0 7 1 -12 1 25 1 -19 0 -4 
1 0 1 1 1 31 0 -20 1 123 1 -89 1 -37 1 -2 
0 40 1 -3 1 16 1 -59 0 3 1 -7 1 112 1 -90 
1 -16 0 7 1 23 1 -22 1 -5 0 -7 1 1 1 84 
1 -82 0 -4 1 44 1 4 1 -45 1 21 0 -8 1 40 
1 -41 1 -9 0 29 1 -13 1 -16 1 -6 1 17 0 -17 
1 5 1 -1 1 71 0 -34 1 -38 1 47 1 -47 0 244 
1 -212 1 28 1 290 1 6 0 -148 1 -13 1 -198 1 70 
0 -59 1 -11 1 8 1 -1 1 41 0 -38 1 20 1 -7 
1 192 0 -201 1 20 1 282 1 -158 0 -29 1 650 1 -769 
1 125 1 53 0 -174 4152 3614 100 MP stroke
1 3 1 14 1 -16 0 19 1 -30 1 36 1 34 1 -75 
0 11 1 19 1 -23 1 54 0 23 1 230 1 -286 1 114 
0 -112 1 40 1 -60 1 42 1 3 0 -38 1 28 1 -25 
1 12 0 -27 1 -1 1 42 1 -38 1 -5 0 18 1 29 
1 -15 1 7 0 165 1 -199 1 30 1 -18 0 -17 1 -2 
1 7 1 16 1 -24 0 15 1 -8 1 23 1 -12 0 -5 
1 -4 1 -7 1 8 1 -1 0 5 1 -7 1 9 1 7 
0 -23 1 4 1 28 1 52 0 -51 1 -7 1 -6 1 -1 
1 -17 1 1 1 13 1 -11 0 -5 1 16 1 -1 1 3 
1 -15 0 8 1 -11 1 6 1 -5 0 1 1 9 1 30 
1 -37 1 -4 0 17 1 8 1 -7 1 -10 0 6 1 -13 
1 11 1 -1 0 -5 1 10 1 -13 1 -2 1 25 0 -9 
1 6 1 -17 1 -5 4074 3628 100 MP stroke
0 39 1 -40 1 13 1 7 1 -16 0 30 1 -15 1 -16 
1 12 0 -11 1 14 1 -11 1 3 0 -10 1 3 1 3 
1 2 1 1 1 9 1 -16 1 16 0 -17 1 50 1 34 
1 -77 1 -1 0 21 1 -5 1 -16 1 10 0 9 1 1 
1 -8 1 12 0 -27 1 15 1 -5 1 -13 1 35 0 -25 
1 -7 1 6 1 -1 0 -7 1 78 1 -61 1 0 1 -3 
0 1 1 9 1 -12 1 21 0 -18 1 -5 1 -8 1 -3 
1 3 1 4 1 26 1 -4 0 -18 1 5 1 8 1 14 
0 -34 1 -5 1 4 1 1 1 1 0 47 1 -46 1 -4 
1 0 0 -2 1 13 1 -11 1 -3 0 1 1 33 1 -11 
1 -20 1 17 0 -16 1 35 1 -24 1 -6 0 -8 1 1 
1 -1 1 0 1 4 1 -5 1 19 1 0 0 9 1 -22 
1 4 1 5 0 -7 3996 3621 100 MP stroke
1 67 1 -51 1 11 1 -32 0 9 1 42 1 -30 1 9 
0 -28 1 -5 1 84 1 -84 1 81 0 -63 1 -11 1 6 
1 24 0 16 1 -52 1 104 1 -93 0 119 1 -117 1 125 
1 -130 1 4 0 141 1 -138 1 -16 1 73 0 86 1 45 
1 -44 1 -28 1 -20 0 109 1 278 1 -379 1 133 0 114 
1 -24 1 388 1 -680 0 -28 1 210 1 508 1 -735 1 -4 
0 38 1 159 1 -156 1 31 0 -9 1 -30 1 -4 1 -1 
1 -23 0 7 1 29 1 -36 1 4 0 -1 1 4 1 6 
1 -16 0 -4 1 6 1 22 1 -18 1 27 0 -5 1 -19 
1 15 1 -14 0 -12 1 16 1 2 1 18 1 4 0 7 
1 104 1 -54 1 -45 0 29 1 32 1 -15 1 -78 0 25 
1 26 1 715 1 -678 1 56 0 13 1 -28 1 74 1 9 
0 -59 1 193 1 223 3919 3038 100 MP stroke
1 -460 1 246 0 -365 1 39 1 -15 1 -8 0 1 1 99 
1 -60 1 -33 1 -3 0 41 1 -35 1 -25 1 -2 0 39 
1 33 1 -59 1 -6 0 25 1 -38 1 11 1 44 1 -40 
0 6 1 -3 1 -23 1 17 0 -3 1 53 1 -51 1 20 
1 -34 0 45 1 -12 1 -23 1 -11 0 -1 1 8 1 -7 
1 5 0 20 1 9 1 -24 1 -8 1 101 0 -64 1 -30 
1 -7 1 13 0 5 1 -8 1 35 1 -20 1 30 0 -54 
1 22 1 5 1 -22 0 25 1 -26 1 73 1 -77 0 -4 
1 11 1 55 1 -30 1 -31 0 5 1 -7 1 38 1 -41 
0 18 1 8 1 -18 1 106 1 -114 1 2 1 -1 1 27 
0 -28 1 75 1 -73 1 29 0 -4 1 -9 1 -5 1 -10 
1 0 0 7 1 49 1 -47 1 -1 1 11 1 -6 1 -15 
1 2 0 11 1 -5 3841 3620 100 MP stroke
1 25 1 -14 0 -18 1 13 1 -2 1 33 0 -13 1 -14 
1 26 1 15 1 598 0 -654 1 25 1 -26 1 73 0 -45 
1 169 1 -116 1 -54 1 0 0 43 1 -37 1 -5 1 20 
0 -33 1 72 1 -88 1 7 1 101 1 243 1 -307 1 -30 
0 3 1 33 1 594 1 708 0 -1229 1 -84 1 -33 1 1 
1 28 0 163 1 -158 1 14 1 -2 0 224 1 347 1 -223 
1 -268 0 -37 1 152 1 312 1 -389 1 -38 0 -91 1 -42 
1 48 1 1006 0 -292 1 -692 1 207 1 17 1 -145 0 -72 
1 -65 1 4 1 210 0 -179 1 21 1 52 1 17 0 -55 
1 -79 1 8 1 186 1 -4 0 -107 1 8 1 -88 1 29 
0 -4 1 108 1 -3 1 -102 1 2 0 16 1 12 1 -30 
1 -19 0 -10 1 -5 1 10 1 48 0 -14 1 136 1 -121 
1 -18 1 -2 0 -29 3764 3618 100 MP stroke
1 16 1 -17 1 31 0 -8 1 -32 1 24 1 -17 1 1 
0 64 1 -42 1 17 1 -48 0 60 1 -35 1 14 1 108 
1 -58 0 -43 1 -46 1 47 1 18 0 -44 1 47 1 -64 
1 3 0 47 1 -49 1 -4 1 15 1 -12 0 3 1 4 
1 8 1 3 0 -19 1 25 1 137 1 -135 1 41 0 -67 
1 -1 1 17 1 -10 0 -6 1 5 1 2 1 1 0 -4 
1 0 1 12 1 -19 1 47 0 -32 1 -7 1 -8 1 32 
0 -5 1 -27 1 48 1 -41 1 5 0 22 1 -19 1 0 
1 6 1 28 1 -50 1 34 0 -14 1 -19 1 10 1 14 
1 -25 0 26 1 10 1 -8 1 -28 0 6 1 0 1 54 
1 -49 1 -6 0 32 1 -31 1 18 1 -22 1 33 1 -1 
1 5 0 8 1 -37 1 67 1 -45 1 13 0 -16 1 11 
1 -17 1 30 0 -15 3686 3591 100 MP stroke
1 2 1 18 1 3 1 -13 0 84 1 -100 1 23 1 -26 
0 5 1 10 1 96 1 -114 0 85 1 -103 1 44 1 -35 
1 16 0 -24 1 -6 1 58 1 -52 0 13 1 31 1 2 
1 -44 1 32 0 -17 1 13 1 50 1 -84 0 30 1 -6 
1 65 1 -87 0 -3 1 12 1 -6 1 32 1 -39 0 8 
1 -8 1 -1 1 4 0 -5 1 94 1 -46 1 10 1 -21 
0 -25 1 21 1 25 1 -45 0 -8 1 55 1 -61 1 10 
0 57 1 -15 1 20 1 51 1 -91 0 36 1 -20 1 2 
1 -22 0 -9 1 -11 1 6 1 9 1 -10 0 -12 1 152 
1 -122 1 -4 0 5 1 46 1 51 1 39 0 363 1 273 
1 214 1 -957 1 399 0 108 1 1264 1 -1639 1 37 0 -191 
1 2121 1 -1950 1 497 1 -699 0 71 1 -68 1 254 1 -127 
0 -53 1 177 1 -166 3609 3533 100 MP stroke
1 -50 0 -8 1 14 1 6 1 -45 1 -13 0 464 1 -459 
1 4 1 0 0 -5 1 64 1 -64 1 15 1 -18 0 27 
1 3 1 10 1 14 0 -51 1 42 1 -37 1 5 1 -11 
0 47 1 -18 1 7 1 -35 0 39 1 -1 1 -12 1 69 
0 -71 1 56 1 -41 1 -38 1 8 0 81 1 -48 1 846 
1 -888 0 479 1 -190 1 422 1 -407 1 1736 0 -1791 1 -128 
1 742 1 -603 0 269 1 -472 1 -46 1 -15 0 6 1 14 
1 368 1 -206 1 -177 0 32 1 -35 1 49 1 -37 0 65 
1 -24 1 34 1 -4 1 -14 0 -66 1 72 1 -13 1 -37 
0 94 1 36 1 -89 1 -60 0 -1 1 20 1 14 1 -40 
1 32 0 -27 1 36 1 -31 1 17 0 -6 1 17 1 -28 
1 45 1 23 0 -69 1 90 1 -100 1 32 0 -22 1 0 
1 3 1 -11 0 15 3533 3612 100 MP stroke
1 45 1 -35 1 -23 1 42 0 -33 1 11 1 -12 1 15 
0 58 1 -48 1 -32 1 24 1 3 0 51 1 -70 1 19 
1 -31 0 34 1 -9 1 -25 1 49 0 -15 1 -35 1 0 
1 59 1 -31 0 -20 1 47 1 -46 1 22 0 -8 1 1 
1 -6 1 -12 1 17 0 -12 1 82 1 -87 1 -3 0 6 
1 4 1 24 1 9 0 -37 1 -9 1 14 1 -7 1 7 
0 4 1 10 1 -6 1 -10 0 19 1 14 1 -4 1 17 
1 -52 0 12 1 -14 1 52 1 23 0 -3 1 -12 1 52 
1 -51 0 -34 1 -14 1 34 1 -38 1 -6 0 -6 1 102 
1 -76 1 38 0 -38 1 -24 1 23 1 937 1 -827 0 -58 
1 187 1 -206 1 -57 0 110 1 -78 1 354 1 -232 0 105 
1 -238 1 302 1 -274 1 107 0 623 1 309 1 -1050 1 741 
0 -566 1 -201 1 175 3456 3440 100 MP stroke
1 229 1 -297 0 -73 1 267 1 1263 1 -535 0 -452 1 104 
1 -660 1 126 0 -20 1 74 1 -46 1 -127 1 -34 0 -7 
1 68 1 314 1 -342 0 33 1 -59 1 1 1 -10 1 107 
0 -21 1 64 1 -150 1 17 0 -11 1 107 1 -61 1 -53 
0 336 1 -298 1 24 1 -41 1 139 0 -73 1 -25 1 -7 
1 -53 0 37 1 57 1 -55 1 30 1 -59 0 21 1 -13 
1 45 1 -63 0 5 1 86 1 -92 1 27 1 -12 0 -15 
1 -4 1 6 1 13 0 15 1 6 1 -21 1 -12 0 62 
1 22 1 -92 1 10 1 39 0 -10 1 -36 1 4 1 4 
0 22 1 -10 1 12 1 -17 1 -14 0 11 1 1 1 -1 
1 -7 0 37 1 -33 1 -5 1 7 0 17 1 58 1 -85 
1 37 1 -34 1 22 1 -18 1 7 0 12 1 -23 1 8 
1 -8 1 -5 0 -1 3379 3627 100 MP stroke
1 15 1 -5 1 1 0 -6 1 19 1 -14 1 4 0 -16 
1 18 1 -8 1 -8 1 19 0 -10 1 -4 1 10 1 13 
0 1 1 17 1 -27 1 -9 1 14 0 -12 1 -5 1 0 
1 -8 0 33 1 -7 1 12 1 6 0 -11 1 -8 1 -19 
1 84 1 -56 0 54 1 -86 1 22 1 63 0 -38 1 -41 
1 69 1 -69 1 14 0 25 1 13 1 -53 1 -6 0 10 
1 -10 1 19 1 60 0 -71 1 22 1 115 1 -132 1 108 
0 -20 1 105 1 -201 1 32 0 16 1 -23 1 10 1 -14 
1 -23 0 5 1 0 1 -7 1 -3 0 3 1 10 1 50 
1 -55 0 10 1 33 1 -17 1 -32 1 88 0 -78 1 64 
1 -62 1 -6 0 -4 1 79 1 -59 1 8 1 -22 0 49 
1 -40 1 11 1 45 0 -36 1 -10 1 -17 1 8 0 11 
1 -14 1 43 1 -33 3302 3602 100 MP stroke
1 -19 0 8 1 80 1 -88 1 20 0 18 1 -17 1 9 
1 -32 1 29 0 -15 1 59 1 73 1 -97 0 -30 1 -23 
1 12 1 34 0 1 1 -27 1 63 1 83 1 -58 0 -99 
1 -10 1 18 1 -16 0 61 1 17 1 39 1 -16 1 -53 
0 -10 1 455 1 -176 1 234 0 277 1 78 1 -393 1 -79 
0 -142 1 152 1 -329 1 34 1 -121 0 253 1 -114 1 -137 
1 48 0 34 1 88 1 -144 1 22 1 -73 0 125 1 -1 
1 -130 1 44 0 -30 1 362 1 -352 1 -14 1 82 0 -72 
1 -19 1 43 1 -21 0 25 1 45 1 -78 1 26 0 15 
1 -53 1 59 1 -15 1 57 0 -102 1 59 1 -58 1 8 
0 52 1 -11 1 -7 1 -16 1 98 0 -61 1 -13 1 -48 
1 36 0 -28 1 26 1 -40 1 94 0 -79 1 95 1 34 
1 461 1 -337 0 -224 3226 3584 100 MP stroke
1 8 1 66 1 279 0 -391 1 148 1 477 1 -10 1 -551 
0 -38 1 176 1 -174 1 43 0 8 1 -54 1 188 1 -178 
0 -41 1 17 1 45 1 -39 1 73 0 -9 1 -85 1 53 
1 -29 0 -15 1 -4 1 -8 1 3 1 13 0 16 1 -3 
1 64 1 -73 0 -11 1 54 1 -51 1 -6 0 9 1 -12 
1 30 1 -28 1 2 0 37 1 -22 1 52 1 -74 0 37 
1 34 1 -70 1 42 1 -18 0 5 1 -28 1 3 1 16 
0 42 1 -35 1 -24 1 13 0 23 1 -16 1 -12 1 -8 
1 34 0 -35 1 -1 1 38 1 -5 0 -9 1 -21 1 80 
1 -57 1 -23 0 -2 1 37 1 -10 1 11 0 -20 1 -15 
1 16 1 -15 0 22 1 -29 1 3 1 0 1 16 0 22 
1 34 1 64 1 -112 0 -19 1 64 1 -43 1 -17 1 -11 
0 6 1 -4 1 -2 3149 3628 100 MP stroke
1 42 0 5 1 -38 1 36 1 -44 0 31 1 80 1 -93 
1 -11 1 -7 0 29 1 -17 1 11 1 -7 0 107 1 -93 
1 -11 1 7 1 -8 0 7 1 116 1 -93 1 -5 0 -43 
1 63 1 -48 1 -15 0 55 1 60 1 -64 1 -19 1 73 
0 -76 1 382 1 -383 1 39 0 60 1 -92 1 105 1 47 
1 355 0 -482 1 3 1 6 1 -28 0 169 1 -175 1 212 
1 -170 0 16 1 -43 1 1467 1 3 1 -1281 0 -196 1 601 
1 -296 1 -168 0 237 1 -166 1 156 1 68 1 -465 0 50 
1 265 1 -184 1 -19 0 -5 1 -10 1 206 1 -47 0 104 
1 -336 1 97 1 -38 1 -22 0 -68 1 180 1 -175 1 -8 
0 222 1 -182 1 -27 1 8 1 -4 0 -9 1 22 1 -32 
1 49 0 -30 1 180 1 -150 1 -29 1 21 0 -41 1 61 
1 9 1 -14 0 -55 3073 3628 100 MP stroke
1 62 1 -59 1 4 0 44 1 -21 1 -29 1 1 1 18 
0 52 1 -73 1 60 1 40 0 -92 1 -4 1 5 1 7 
1 18 0 -17 1 -13 1 28 1 -15 0 -1 1 -12 1 13 
1 -3 0 74 1 -65 1 23 1 -34 1 29 0 -21 1 11 
1 -3 1 25 0 -25 1 45 1 -43 1 -18 1 10 0 82 
1 -80 1 -9 1 4 0 18 1 -20 1 -2 1 2 0 40 
1 -52 1 25 1 -29 1 73 0 20 1 -57 1 -29 1 24 
0 -1 1 22 1 3 1 -31 1 -24 0 46 1 -6 1 -41 
1 40 0 -37 1 45 1 -22 1 -22 0 72 1 -59 1 -16 
1 29 1 -17 0 -6 1 0 1 10 1 -8 0 8 1 8 
1 2 1 -18 1 9 0 6 1 25 1 -36 1 8 0 -14 
1 41 1 -44 1 20 0 -24 1 71 1 -29 1 3 1 8 
0 -28 1 49 1 -50 2996 3605 100 MP stroke
1 9 0 -33 1 41 1 -26 1 17 1 -2 0 48 1 -55 
1 62 1 -81 0 21 1 -5 1 8 1 -12 0 -15 1 13 
1 -11 1 22 1 -10 0 55 1 -52 1 -4 1 -7 0 51 
1 17 1 -70 1 23 1 9 0 2 1 -26 1 66 1 -71 
0 9 1 29 1 -27 1 -12 0 36 1 -34 1 31 1 -37 
1 5 0 40 1 -24 1 29 1 -48 0 17 1 -18 1 45 
1 -5 1 -23 0 -8 1 5 1 -4 1 28 0 -29 1 22 
1 20 1 -35 0 9 1 -3 1 5 1 -23 1 13 0 11 
1 -20 1 32 1 -31 0 -12 1 29 1 -28 1 22 1 -23 
0 50 1 -41 1 18 1 87 0 -97 1 -14 1 4 1 38 
0 75 1 103 1 -168 1 57 1 -112 0 15 1 288 1 -268 
1 157 0 -143 1 59 1 349 1 -396 1 20 0 56 1 -136 
1 108 1 -23 0 -3 2920 3545 100 MP stroke
1 -47 1 -30 1 21 1 49 0 64 1 -118 1 -21 1 270 
0 -220 1 -21 1 -31 1 21 0 1 1 47 1 -60 1 -6 
1 0 0 4 1 29 1 140 1 -40 0 -107 1 49 1 -50 
1 1 1 -23 0 70 1 -28 1 43 1 -90 0 32 1 -12 
1 -3 1 14 0 71 1 -102 1 28 1 -1 1 -24 0 15 
1 -1 1 -4 1 12 0 164 1 -165 1 63 1 -20 1 -36 
0 479 1 -278 1 13 1 23 0 -254 1 133 1 -85 1 80 
0 -62 1 -73 1 47 1 -29 1 2 0 242 1 -268 1 13 
1 76 0 -82 1 44 1 24 1 -77 1 3 0 142 1 -94 
1 -32 1 -10 0 1 1 200 1 -119 1 -82 0 37 1 -36 
1 -1 1 22 1 -31 0 23 1 20 1 -3 1 -11 0 10 
1 -39 1 3 1 29 1 3 0 -13 1 -21 1 24 1 32 
0 -57 1 24 1 16 2843 3589 100 MP stroke
1 -11 0 35 1 -61 1 3 1 17 1 0 -1 0 2 -19 
1 47 1 -47 0 7 1 12 1 62 1 -53 1 -28 0 35 
1 -24 1 22 1 -2 0 -27 1 -3 1 14 1 74 0 15 
1 -34 1 -63 1 -5 1 14 0 29 1 -44 1 -3 1 -2 
0 8 1 23 1 -26 1 20 1 77 0 -99 1 38 1 -12 
1 -28 0 15 1 5 1 -10 1 -2 0 41 1 -42 1 32 
1 -7 1 11 0 -38 1 1 1 6 1 20 0 16 1 -48 
1 107 1 -105 1 9 0 10 1 -7 1 2 1 -1 0 20 
1 -10 1 33 1 32 0 -28 1 -25 1 53 1 28 1 -63 
0 -15 1 -19 1 -1 1 13 0 -10 1 70 1 371 1 -250 
1 -215 0 190 1 111 1 -301 1 68 0 388 1 -412 1 -1 
1 -31 0 110 1 -69 1 186 1 119 1 -327 0 238 1 -193 
1 47 1 -43 0 -63 2767 3612 100 MP stroke
1 0 1 13 1 18 1 -22 0 -18 1 28 1 0 1 36 
0 -69 1 58 1 -33 1 -26 1 5 0 10 1 85 1 -92 
1 22 0 -32 1 36 1 -21 1 -4 0 -6 1 205 1 -183 
1 -6 1 -11 0 17 1 -20 1 97 1 -67 0 -14 1 -13 
1 -1 1 0 1 -3 0 43 1 -36 1 -8 1 114 0 -91 
1 -8 1 -20 1 50 0 -45 1 33 1 49 1 -68 1 29 
0 14 1 -28 1 1 1 4 0 1 1 7 1 16 1 -20 
1 -39 0 19 1 -11 1 0 1 17 0 -2 1 24 1 71 
1 14 0 -72 1 -43 1 4 1 -24 1 5 0 20 1 -5 
1 -21 1 88 0 -23 1 2 1 -22 1 -37 1 20 0 25 
1 3 1 -31 1 -24 0 26 1 -10 1 63 1 -70 0 -6 
1 46 1 -41 1 -7 1 32 0 -5 1 -25 1 41 1 -30 
0 21 1 -19 1 8 2690 3604 100 MP stroke
1 7 1 22 0 -38 1 -11 1 6 1 -8 0 76 1 -28 
1 -18 1 -5 0 -8 1 78 1 -4 1 -80 1 8 0 10 
1 9 1 -12 1 2 0 -12 1 -10 1 1 1 2 1 -9 
0 6 1 -3 1 86 1 -73 0 -8 1 5 1 15 1 35 
0 -66 1 0 1 8 1 14 1 2 0 14 1 -14 1 9 
1 51 0 13 1 -83 1 25 1 -3 1 -36 0 11 1 39 
1 -30 1 -2 0 23 1 86 1 -67 1 -43 0 -10 1 15 
1 -17 1 18 1 77 0 -22 1 -78 1 1 1 66 0 -31 
1 -28 1 22 1 48 1 -70 0 3 1 -7 1 153 1 -127 
0 -24 1 19 1 -20 1 -2 0 -3 1 32 1 -28 1 -4 
1 8 0 -5 1 15 1 -7 1 7 0 -5 1 17 1 -14 
1 5 1 -8 0 -10 1 120 1 -95 1 37 0 -23 1 -35 
1 8 1 -6 0 113 2614 3507 100 MP stroke
1 -64 1 -50 1 -1 1 75 0 54 1 -82 1 -36 1 11 
0 120 1 26 1 -109 1 249 1 -124 0 -120 1 123 1 54 
1 -165 0 -52 1 273 1 -193 1 23 0 -60 1 -47 1 16 
1 -39 1 20 0 203 1 -221 1 128 1 -99 0 137 1 80 
1 -238 1 47 1 -24 0 -8 1 105 1 71 1 -127 0 -33 
1 -45 1 17 1 23 1 26 0 -41 1 51 1 -52 1 60 
0 -55 1 -19 1 18 1 -5 0 19 1 -20 1 -16 1 1 
1 7 0 -13 1 0 1 108 1 -100 0 12 1 -9 1 -12 
1 16 1 7 0 11 1 49 1 -17 1 -36 0 -1 1 -7 
1 -19 1 29 0 -11 1 -4 1 138 1 -109 1 -36 0 511 
1 -498 1 305 1 -301 0 -21 1 5 1 -1 1 19 1 29 
0 -31 1 37 1 -30 1 13 0 -26 1 55 1 -62 1 50 
0 14 1 43 1 -101 2537 3609 100 MP stroke
1 -5 1 79 0 -71 1 -9 1 26 1 -19 0 71 1 -39 
1 -35 1 -17 1 8 0 79 1 -54 1 57 1 -90 0 11 
1 38 1 -29 1 2 0 -10 1 -11 1 25 1 11 1 -2 
0 16 1 -25 1 -10 1 38 0 -49 1 47 1 60 1 -82 
1 -20 0 32 1 -43 1 127 1 -63 0 -14 1 -50 1 154 
1 -110 0 -26 1 8 1 61 1 -44 1 -23 0 39 1 -34 
1 -12 1 48 0 -53 1 24 1 -25 1 10 1 12 0 6 
1 57 1 -70 1 92 0 -69 1 -23 1 121 1 -56 0 -74 
1 22 1 -8 1 -1 1 25 0 -43 1 32 1 82 1 -71 
0 -44 1 17 1 -23 1 9 1 138 0 -59 1 89 1 -165 
1 -7 0 14 1 -20 1 19 1 30 0 -49 1 7 1 30 
1 -22 1 15 0 34 1 -51 1 -8 1 8 0 14 1 -21 
1 -3 1 36 1 -16 2460 3606 100 MP stroke
0 38 1 -58 1 -3 1 35 0 77 1 -36 1 -34 1 -19 
0 63 1 -54 1 68 1 -75 1 -9 0 12 1 65 1 -83 
1 -7 0 21 1 17 1 46 1 -80 1 2 0 164 1 -42 
1 187 1 -264 0 -34 1 126 1 -114 1 60 0 -91 1 64 
1 -65 1 59 1 161 0 -81 1 10 1 -62 1 -86 0 51 
1 -51 1 299 1 -284 1 2 0 39 1 -48 1 38 1 -37 
0 -7 1 81 1 -20 1 -13 1 -34 0 -10 1 97 1 -69 
1 -5 0 148 1 -176 1 8 1 82 0 -36 1 -11 1 -22 
1 0 1 0 0 62 1 87 1 -57 1 -103 0 17 1 -22 
1 13 1 -16 1 -2 0 18 1 67 1 -8 1 -70 0 -5 
1 67 1 -58 1 164 0 -83 1 -88 1 32 1 -37 1 4 
0 -2 1 14 1 -14 1 21 0 -20 1 55 1 -50 1 14 
1 1 0 5 1 9 2384 3591 100 MP stroke
1 -18 1 -11 0 35 1 174 1 -185 1 -13 0 63 1 -69 
1 -4 1 61 1 -62 1 8 1 18 1 -26 0 69 1 -12 
1 -2 1 -32 1 -26 0 42 1 54 1 -83 1 6 0 65 
1 -52 1 -22 1 69 0 -84 1 88 1 -71 1 -16 1 130 
0 -92 1 64 1 -61 1 -36 0 46 1 -18 1 -2 1 -8 
1 301 0 -268 1 -58 1 29 1 21 0 30 1 -9 1 -65 
1 61 0 -31 1 5 1 -38 1 22 1 61 0 -61 1 11 
1 -28 1 19 0 75 1 -72 1 29 1 -58 1 35 0 -26 
1 63 1 -64 1 72 0 -60 1 -15 1 46 1 -49 0 21 
1 31 1 -27 1 140 1 53 0 -152 1 -48 1 19 1 -13 
0 -27 1 9 1 7 1 36 1 -41 0 44 1 -16 1 27 
1 -58 0 9 1 18 1 7 1 16 0 110 1 -123 1 -27 
1 182 1 -151 0 -29 2307 3609 100 MP stroke
1 17 1 -34 1 18 0 254 1 -271 1 20 1 35 1 68 
0 -76 1 12 1 -49 1 43 0 -7 1 -1 1 -16 1 22 
0 -55 1 28 1 -5 1 45 1 -65 0 59 1 -51 1 3 
1 -10 0 58 1 -45 1 -15 1 52 1 -46 0 38 1 93 
1 -91 1 -5 0 54 1 -67 1 -28 1 17 0 42 1 -6 
1 -41 1 40 1 -35 0 -15 1 11 1 -7 1 29 0 -28 
1 60 1 83 1 -140 1 13 0 14 1 -30 1 138 1 -35 
0 126 1 -65 1 -166 1 56 1 -41 0 39 1 85 1 287 
1 -385 0 -14 1 92 1 -120 1 85 0 -87 1 12 1 16 
1 5 1 27 0 -16 1 -48 1 178 1 -126 0 94 1 -83 
1 -60 1 6 1 17 0 3 1 77 1 -79 1 3 0 -26 
1 31 1 35 1 -55 0 97 1 -14 1 -65 1 31 1 -9 
0 -27 1 30 1 -27 2230 3598 100 MP stroke
1 -29 0 19 1 181 1 -198 1 -4 1 56 0 -53 1 42 
1 -18 1 10 0 -8 1 33 1 -42 1 144 0 -128 1 -27 
1 14 1 57 1 15 0 22 1 -30 1 -75 1 18 0 -5 
1 116 1 -140 1 41 1 13 0 -12 1 -26 1 41 1 39 
0 -88 1 61 1 -59 1 50 0 76 1 -96 1 -13 1 34 
1 29 0 -81 1 -6 1 27 1 -11 0 242 1 -252 1 197 
1 -204 1 134 0 -27 1 -68 1 -10 1 -31 0 40 1 -16 
1 10 1 -17 0 -1 1 70 1 58 1 -65 1 9 0 -67 
1 54 1 65 1 -16 0 -49 1 -57 1 -19 1 2 1 32 
0 -10 1 -11 1 24 1 2 0 70 1 -104 1 3 1 64 
0 -68 1 8 1 -7 1 17 1 -14 0 36 1 -31 1 10 
1 77 0 -79 1 18 1 66 1 -50 1 -32 0 269 1 -290 
1 108 1 -110 0 44 2154 3585 100 MP stroke
1 27 1 -53 1 20 0 78 1 -85 1 62 1 99 1 -164 
0 -3 1 -17 1 138 1 -120 0 30 1 -48 1 75 1 106 
1 -165 0 -20 1 4 1 112 1 -61 0 24 1 -53 1 16 
1 -10 0 -18 1 146 1 -160 1 6 1 -9 0 76 1 -64 
1 -11 1 8 0 94 1 -59 1 -9 1 -8 1 -21 0 57 
1 -60 1 -4 1 2 0 10 1 32 1 6 1 -28 0 97 
1 -101 1 42 1 -22 1 -12 0 -5 1 4 1 -11 1 10 
0 72 1 -57 1 22 1 23 1 -68 0 92 1 -29 1 -71 
1 29 0 -8 1 -1 1 41 1 -54 0 -12 1 23 1 29 
1 27 1 -70 0 39 1 -45 1 130 1 -37 0 -94 1 25 
1 41 1 -40 1 2 0 8 1 10 1 -5 1 -22 0 92 
1 -20 1 -39 1 23 1 -75 0 3 1 9 1 185 1 -191 
0 3 1 107 1 -104 2077 3612 100 MP stroke
1 -11 0 30 1 -31 1 2 1 -4 1 -2 0 53 1 13 
1 -30 1 -30 0 12 1 75 1 -90 1 22 1 93 0 -68 
1 62 1 -44 1 -62 0 3 1 20 1 -14 1 -11 0 27 
1 61 1 -14 1 57 1 -44 0 -24 1 -47 1 15 1 -28 
0 109 1 -93 1 88 1 -82 1 -27 0 10 1 135 1 -77 
1 -71 0 28 1 86 1 -14 1 -90 0 7 1 28 1 -39 
1 117 1 -85 0 -34 1 32 1 -9 1 88 0 122 1 -158 
1 -4 1 -70 1 19 0 -23 1 63 1 -53 1 256 0 -254 
1 5 1 -7 1 18 0 -22 1 95 1 -69 1 -15 1 20 
0 5 1 -41 1 28 1 -14 0 6 1 117 1 -84 1 -4 
1 35 0 -78 1 23 1 115 1 -115 0 -9 1 12 1 -19 
1 0 0 -9 1 6 1 45 1 -40 1 296 0 -272 1 162 
1 -141 1 -56 0 8 2001 3615 100 MP stroke
1 102 1 50 1 -147 1 140 0 -127 1 23 1 8 1 -44 
0 43 1 93 1 -126 1 -8 0 22 1 16 1 -34 1 -6 
1 25 0 -7 1 -34 1 67 1 -45 0 105 1 8 1 -97 
1 2 1 -38 0 1 1 133 1 -88 1 -20 0 -17 1 40 
1 -54 1 22 0 145 1 -146 1 11 1 44 1 -60 0 104 
1 -115 1 97 1 -85 0 2 1 -18 1 120 1 -19 1 56 
0 -155 1 51 1 73 1 -38 0 -34 1 -54 1 8 1 0 
0 129 1 -52 1 -16 1 172 1 -205 0 -26 1 31 1 -31 
1 192 0 -134 1 -57 1 34 1 -26 1 46 0 20 1 -82 
1 20 1 94 0 -19 1 -84 1 4 1 -16 0 36 1 -19 
1 61 1 17 1 -51 0 119 1 -125 1 27 1 -34 0 94 
1 -40 1 128 1 -207 1 45 0 -9 1 -42 1 51 1 -47 
0 -3 1 35 1 28 1924 3562 100 MP stroke
1 -47 1 263 0 -256 1 20 1 -28 1 25 0 28 1 -52 
1 32 1 -18 0 33 1 11 1 -73 1 40 1 -39 0 36 
1 9 1 -2 1 34 0 -79 1 183 1 -175 1 40 1 -25 
0 136 1 -77 1 -48 1 -36 0 86 1 -75 1 -7 1 44 
0 -8 1 -37 1 26 1 95 1 -73 0 132 1 -14 1 -67 
1 -13 0 -76 1 4 1 14 1 2 1 120 0 -103 1 -48 
1 64 1 -31 0 78 1 -66 1 -3 1 39 0 -71 1 53 
1 -67 1 27 1 -5 0 -9 1 47 1 -43 1 -2 0 23 
1 42 1 32 1 -50 1 50 0 -76 1 -9 1 -26 1 11 
0 239 1 -246 1 36 1 -41 0 2 1 1 1 324 1 -127 
1 -178 0 -6 1 -6 1 58 1 -58 0 21 1 -17 1 80 
1 -29 1 -24 0 91 1 -75 1 17 1 -53 0 -5 1 -10 
1 24 1 49 0 -34 1848 3584 100 MP stroke
1 -29 1 -10 1 81 1 -41 0 -12 1 -21 1 73 1 -54 
0 31 1 -47 1 36 1 37 1 -30 0 5 1 -46 1 -4 
1 44 0 -25 1 -13 1 1 1 -12 0 38 1 -34 1 7 
1 -3 1 -16 0 49 1 -40 1 23 1 5 0 193 1 -114 
1 -84 1 19 1 28 0 -67 1 -13 1 24 1 88 0 -4 
1 -68 1 -16 1 96 0 -43 1 -74 1 -2 1 99 1 -29 
0 -55 1 16 1 -9 1 -23 0 46 1 -25 1 -17 1 47 
1 42 0 -46 1 203 1 -123 1 -105 0 110 1 -28 1 39 
1 -132 0 91 1 28 1 -117 1 37 1 4 0 -15 1 60 
1 -61 1 -11 0 55 1 -53 1 58 1 -66 1 -15 0 79 
1 -8 1 2 1 -59 0 -9 1 88 1 -38 1 -47 0 13 
1 -25 1 10 1 60 1 88 0 -154 1 6 1 0 1 12 
0 62 1 -48 1 -3 1771 3594 100 MP stroke
1 -7 1 -28 0 10 1 83 1 6 1 -63 0 35 1 -15 
1 25 1 87 1 -91 0 55 1 -96 1 -29 1 20 0 104 
1 -112 1 -2 1 5 0 92 1 16 1 -120 1 10 1 88 
0 20 1 -114 1 51 1 -47 0 -3 1 -9 1 19 1 227 
1 -96 0 -70 1 -79 1 -6 1 77 0 -52 1 -11 1 177 
1 -23 0 -124 1 -32 1 88 1 -75 1 31 0 -38 1 0 
1 25 1 60 0 94 1 -117 1 -49 1 3 1 -34 0 166 
1 -138 1 -29 1 14 0 45 1 -37 1 9 1 2 0 71 
1 -94 1 10 1 -4 1 62 0 -39 1 -38 1 35 1 56 
0 -30 1 -37 1 1 1 52 1 -76 0 25 1 27 1 -5 
1 52 0 -93 1 154 1 -108 1 -37 0 55 1 -26 1 6 
1 59 1 -66 0 -39 1 12 1 178 1 -107 0 53 1 -104 
1 76 1 18 1 -21 1694 3518 100 MP stroke
0 -85 1 -25 1 30 1 41 0 -10 1 -51 1 -7 1 4 
0 105 1 -108 1 32 1 87 1 -120 0 18 1 109 1 36 
1 -156 0 139 1 -133 1 -10 1 51 1 -54 0 5 1 18 
1 145 1 -169 0 38 1 44 1 -31 1 -50 0 78 1 -69 
1 80 1 -92 1 173 0 -159 1 150 1 -72 1 93 0 20 
1 137 1 -174 1 3 1 -143 0 21 1 -42 1 35 1 -42 
0 30 1 81 1 -76 1 -19 0 129 1 -145 1 4 1 57 
1 32 0 -18 1 -24 1 28 1 -4 0 -19 1 -56 1 35 
1 28 1 -29 0 -23 1 -1 1 5 1 152 0 -91 1 -64 
1 309 1 -269 0 46 1 138 1 -137 1 4 1 -63 0 20 
1 -7 1 215 1 -134 0 -110 1 33 1 57 1 37 1 -107 
0 -29 1 12 1 126 1 -125 0 43 1 -61 1 2 1 1 
0 47 1 -32 1 -21 1618 3621 100 MP stroke
1 -8 1 209 0 -189 1 140 1 -18 1 -53 0 -64 1 149 
1 -172 1 40 1 -36 0 39 1 54 1 -85 1 -7 0 258 
1 -218 1 -38 1 44 0 -48 1 83 1 -49 1 140 1 -174 
0 8 1 42 1 34 1 -61 0 -13 1 183 1 -187 1 11 
1 1 0 -16 1 26 1 21 1 -13 0 -30 1 -5 1 30 
1 108 1 -55 0 -76 1 19 1 62 1 101 0 -82 1 -50 
1 24 1 19 0 -13 1 -66 1 48 1 -59 1 92 0 -89 
1 23 1 -12 1 16 0 -40 1 61 1 -57 1 13 1 67 
0 -69 1 -13 1 7 1 -10 0 140 1 -80 1 221 1 -277 
0 9 1 104 1 -99 1 11 1 89 0 200 1 -240 1 78 
1 -64 0 141 1 -236 1 129 1 -62 1 -42 0 3 1 82 
1 -101 1 95 0 5 1 21 1 -61 1 -1 0 -14 1 -53 
1 77 1 -35 1 -45 1541 3629 100 MP stroke
0 10 1 81 1 -42 1 74 0 16 1 -66 1 48 1 -101 
1 40 0 -18 1 -25 1 146 1 -95 0 -42 1 27 1 20 
1 -73 0 47 1 11 1 -43 1 4 1 -16 0 427 1 -318 
1 -61 1 4 0 -43 1 11 1 8 1 27 1 41 0 26 
1 -72 1 34 1 117 0 -202 1 76 1 -41 1 23 0 42 
1 233 1 -137 1 -153 1 -15 0 -2 1 44 1 37 1 -109 
0 134 1 -127 1 147 1 -80 1 9 0 33 1 -113 1 28 
1 130 0 -125 1 154 1 -160 1 -9 0 34 1 -5 1 154 
1 -172 1 -5 0 -26 1 57 1 -6 1 -24 0 106 1 -54 
1 144 1 -197 1 13 0 74 1 -108 1 100 1 -105 0 19 
1 18 1 -12 1 55 0 -31 1 -37 1 126 1 -12 1 52 
0 -129 1 71 1 57 1 -144 0 -23 1 51 1 -52 1 181 
1 -86 0 -59 1 101 1465 3482 100 MP stroke
1 -39 1 -45 0 130 1 -74 1 -104 1 81 0 92 1 -74 
1 53 1 -113 1 -29 0 81 1 -14 1 -57 1 98 0 95 
1 -103 1 -86 1 -37 1 58 0 70 1 -93 1 188 1 -199 
0 -1 1 43 1 -68 1 198 0 -176 1 33 1 77 1 -41 
1 -13 0 37 1 -79 1 -28 1 94 0 -15 1 -77 1 147 
1 -56 1 -13 0 -84 1 48 1 51 1 -82 0 10 1 89 
1 -27 1 -45 1 47 0 30 1 18 1 -107 1 8 0 61 
1 -21 1 -2 1 15 0 99 1 -179 1 57 1 -4 1 -70 
0 64 1 -41 1 75 1 -23 0 -29 1 -41 1 92 1 -90 
1 -7 0 30 1 -30 1 6 1 193 0 -187 1 0 1 64 
1 92 0 -72 1 30 1 -72 1 -51 1 12 0 27 1 -37 
1 21 1 -19 0 58 1 63 1 97 1 300 1 -465 0 163 
1 -98 1 -116 1 25 1388 3595 100 MP stroke
0 -33 1 103 1 -12 1 -77 0 217 1 -207 1 9 1 58 
1 78 0 -103 1 5 1 -12 1 -58 0 111 1 -12 1 16 
1 -114 1 15 0 6 1 33 1 -56 1 160 0 -18 1 -125 
1 6 1 -24 0 34 1 104 1 -90 1 80 1 -124 0 21 
1 186 1 -104 1 110 0 -60 1 -156 1 151 1 -151 1 2 
0 22 1 11 1 -9 1 188 0 -97 1 48 1 -111 1 79 
0 -41 1 71 1 -79 1 51 1 -119 0 175 1 -169 1 18 
1 -31 0 13 1 274 1 48 1 -328 1 268 0 -267 1 98 
1 -89 1 -23 0 96 1 23 1 -117 1 44 0 -16 1 0 
1 91 1 -124 1 1 0 19 1 28 1 105 1 -51 0 -55 
1 -37 1 -11 1 139 1 -13 0 -52 1 -41 1 -4 1 67 
0 -48 1 18 1 172 1 -204 0 245 1 -148 1 21 1 -113 
1 28 0 -65 1 493 1312 3134 100 MP stroke
1 -452 1 50 0 -57 1 24 1 -10 1 -28 1 321 0 -151 
1 -9 1 -80 1 37 0 -127 1 -9 1 177 1 30 0 11 
1 -66 1 -151 1 5 1 137 0 -88 1 -34 1 102 1 35 
0 -115 1 103 1 -82 1 -20 1 -39 0 66 1 -33 1 -18 
1 17 0 -26 1 34 1 -14 1 -5 0 100 1 -89 1 -16 
1 -2 1 119 0 104 1 -204 1 -2 1 -28 0 47 1 140 
1 -167 1 -26 1 11 0 110 1 -116 1 36 1 320 0 -204 
1 -107 1 -47 1 86 1 -79 0 99 1 56 1 -78 1 -16 
0 -50 1 69 1 194 1 381 0 -659 1 112 1 -119 1 367 
1 -241 0 -47 1 91 1 -53 1 -30 0 -41 1 39 1 59 
1 29 1 -63 0 -107 1 -3 1 1 1 77 0 78 1 -79 
1 286 1 -331 0 87 1 244 1 -362 1 88 1 -60 0 38 
1 -34 1 -28 1 235 1235 3384 100 MP stroke
0 -71 1 214 1 111 1 -445 1 -1 0 98 1 39 1 -104 
1 -15 0 -48 1 -18 1 163 1 -81 0 49 1 -101 1 138 
1 -24 1 221 0 -196 1 -161 1 129 1 200 0 -91 1 -64 
1 -187 1 3 1 5 0 11 1 252 1 169 1 -305 0 20 
1 59 1 -195 1 114 0 283 1 -285 1 -62 1 16 1 92 
0 -155 1 10 1 89 1 -70 1 -12 1 39 1 -59 1 321 
0 -311 1 71 1 154 1 15 0 -266 1 132 1 -111 1 203 
0 -137 1 237 1 -140 1 -130 1 131 0 -164 1 3 1 17 
1 -30 0 67 1 -52 1 127 1 6 1 -92 0 142 1 195 
1 -180 1 -137 0 -4 1 58 1 26 1 -85 0 199 1 -263 
1 0 1 101 1 16 0 237 1 118 1 -99 1 -251 0 -70 
1 32 1 61 1 26 1 -40 0 58 1 -48 1 -147 1 229 
0 -7 1 -52 1 -166 1158 3610 100 MP stroke
1 -3 0 120 1 -100 1 43 1 -60 1 133 0 -135 1 131 
1 -131 1 81 0 55 1 -69 1 241 1 -295 1 38 0 155 
1 -55 1 -126 1 -16 0 424 1 -389 1 68 1 -126 0 86 
1 -47 1 91 1 -55 1 -31 0 -41 1 7 1 97 1 129 
0 -233 1 124 1 -126 1 162 1 -68 0 -47 1 187 1 -187 
1 -47 0 167 1 266 1 -307 1 29 0 32 1 -110 1 59 
1 34 1 -42 0 79 1 -195 1 50 1 155 0 -210 1 124 
1 100 1 89 1 -192 0 -92 1 3 1 62 1 13 0 255 
1 -348 1 5 1 97 0 -21 1 86 1 -28 1 -2 1 244 
0 -403 1 -1 1 130 1 360 0 -383 1 -8 1 94 1 -195 
1 149 0 -123 1 110 1 -58 1 247 0 35 1 -109 1 -204 
1 397 1 -409 0 222 1 -250 1 29 1 24 0 -11 1 -6 
1 137 1 293 0 -407 1082 3563 100 MP stroke
1 -4 1 -60 1 239 1 -161 0 170 1 -104 1 390 1 -531 
0 139 1 -122 1 47 1 51 1 49 0 67 1 -132 1 296 
1 -298 0 26 1 152 1 -243 1 -17 0 33 1 99 1 -114 
1 -37 1 177 0 -171 1 165 1 -74 1 -24 0 34 1 -45 
1 1 1 324 1 0 0 -384 1 -1 1 196 1 -118 0 291 
1 -250 1 69 1 -112 0 63 1 -113 1 167 1 -167 1 11 
0 -29 1 43 1 -34 1 124 0 -18 1 11 1 24 1 43 
1 -181 0 256 1 107 1 -367 1 990 0 -768 1 133 1 -218 
1 -79 0 244 1 -152 1 45 1 53 1 -234 0 130 1 -157 
1 17 1 120 0 -71 1 -71 1 245 1 -178 1 8 0 51 
1 -18 1 285 1 -82 0 -236 1 354 1 -251 1 -179 0 28 
1 -25 1 212 1 195 1 -211 0 12 1 -47 1 -104 1 105 
0 -144 1 -11 1 43 1005 3576 100 MP stroke
1 -2 1 -3 0 63 1 4 1 19 1 -83 0 29 1 297 
1 -227 1 -49 0 -50 1 34 1 1 1 49 1 -31 0 -102 
1 99 1 168 1 -43 0 -220 1 305 1 43 1 -119 1 -210 
0 62 1 -86 1 458 1 -411 0 140 1 -132 1 130 1 237 
0 -275 1 93 1 43 1 -225 1 181 0 -34 1 -150 1 -42 
1 267 0 124 1 -382 1 137 1 109 1 -262 0 217 1 -215 
1 42 1 -29 0 223 1 -192 1 99 1 -146 0 121 1 153 
1 -106 1 25 1 -170 0 393 1 -150 1 -231 1 67 0 -10 
1 306 1 -371 1 143 1 -163 0 535 1 -542 1 49 1 63 
0 -62 1 221 1 120 1 -319 0 -50 1 243 1 -146 1 -125 
1 48 0 288 1 -282 1 -36 1 -5 0 33 1 175 1 94 
1 -266 1 330 0 -269 1 264 1 -198 1 -143 0 437 1 -334 
1 -3 1 -52 1 -68 928 3616 100 MP stroke
0 40 1 13 1 632 1 -509 0 -186 1 22 1 -6 1 9 
0 455 1 -351 1 61 1 -100 1 -34 0 108 1 94 1 23 
1 -220 0 158 1 -132 1 -6 1 10 1 6 0 -76 1 0 
1 -19 1 369 0 -253 1 -82 1 189 1 -108 0 -62 1 565 
1 -613 1 6 1 136 0 445 1 -526 1 64 1 -47 0 370 
1 -235 1 -198 1 347 1 -275 0 -65 1 190 1 -207 1 36 
0 152 1 -188 1 1024 1 -765 0 -267 1 168 1 181 1 -162 
1 -167 0 25 1 18 1 86 1 13 0 -150 1 188 1 -90 
1 112 1 -57 0 123 1 -266 1 114 1 -143 0 147 1 -16 
1 240 1 -298 0 67 1 19 1 -36 1 -116 1 249 0 -237 
1 85 1 -93 1 16 0 278 1 -180 1 -80 1 73 1 190 
0 172 1 -316 1 -164 1 260 0 -216 1 -27 1 334 1 -137 
0 96 1 -43 1 -89 852 3451 100 MP stroke
1 321 1 -350 0 -115 1 117 1 -151 1 85 0 211 1 183 
1 -373 1 517 1 292 0 -655 1 -210 1 59 1 58 0 -74 
1 250 1 -213 1 -126 0 55 1 11 1 -26 1 56 1 224 
0 30 1 -347 1 497 1 -453 0 17 1 17 1 64 1 -98 
1 -7 0 120 1 15 1 -150 1 204 0 -10 1 -194 1 673 
1 -433 0 607 1 -663 1 -95 1 20 1 -117 0 9 1 222 
1 -156 1 48 0 288 1 -286 1 -33 1 -101 1 680 0 -197 
1 -242 1 -160 1 105 0 332 1 -270 1 -195 1 224 0 -268 
1 192 1 -202 1 130 1 244 0 -321 1 390 1 -440 1 258 
0 -79 1 -150 1 185 1 -114 1 544 0 -560 1 -43 1 -52 
1 138 0 59 1 141 1 -98 1 76 0 -287 1 227 1 -189 
1 14 1 453 0 -399 1 -98 1 559 1 -423 0 476 1 -639 
1 264 1 -173 1 77 775 3448 100 MP stroke
0 -73 1 194 1 -78 1 -146 0 -44 1 169 1 -203 1 249 
0 -167 1 -38 1 600 1 -617 1 99 0 105 1 -171 1 -36 
1 262 0 -238 1 594 1 -630 1 121 1 19 0 -65 1 -46 
1 195 1 -134 0 257 1 -285 1 137 1 -136 1 -30 0 746 
1 -711 1 392 1 538 0 -1007 1 379 1 233 1 -558 0 171 
1 294 1 142 1 -644 1 344 0 -192 1 -137 1 74 1 48 
0 -126 1 216 1 39 1 -260 1 237 0 -117 1 -128 1 680 
1 -635 0 58 1 -48 1 -34 1 -12 0 372 1 -196 1 111 
1 241 1 -238 0 364 1 -342 1 -210 1 -93 0 -5 1 281 
1 -281 1 -26 1 236 0 1278 1 -1017 1 -197 1 -27 0 -185 
1 18 1 33 1 284 0 -304 1 353 1 -188 1 144 1 -186 
0 547 1 -755 1 285 1 15 0 2 1 -253 1 397 1 49 
1 -401 0 63 1 6 699 3427 100 MP stroke
1 375 1 -408 0 13 1 40 1 -75 1 -96 0 49 1 178 
1 -51 1 -129 0 36 691 3495 12 MP stroke
gr

c8
0 sg
%%IncludeResource: font Helvetica
/Helvetica /ISOLatin1Encoding 120 FMSR

5391 1511 mt 
(KIC 9269772) s
2981 3918 mt 
(Frequency \(micro Hertz\)) s
 508 2789 mt  -90 rotate
(Oscillation power) s
90 rotate
4 w
DO
SO
6 w
 691 3630 mt 6566 3630 L
 691 1037 mt 6566 1037 L
 691 3630 mt  691 1037 L
6566 3630 mt 6566 1037 L
 691 3630 mt 6566 3630 L
 691 3630 mt  691 1037 L
 691 3630 mt  691 3571 L
 691 1037 mt  691 1095 L
 625 3775 mt 
(10) s
1278 3630 mt 1278 3571 L
1278 1037 mt 1278 1095 L
1212 3775 mt 
(20) s
1866 3630 mt 1866 3571 L
1866 1037 mt 1866 1095 L
1800 3775 mt 
(30) s
2453 3630 mt 2453 3571 L
2453 1037 mt 2453 1095 L
2387 3775 mt 
(40) s
3041 3630 mt 3041 3571 L
3041 1037 mt 3041 1095 L
2975 3775 mt 
(50) s
3628 3630 mt 3628 3571 L
3628 1037 mt 3628 1095 L
3562 3775 mt 
(60) s
4216 3630 mt 4216 3571 L
4216 1037 mt 4216 1095 L
4150 3775 mt 
(70) s
4803 3630 mt 4803 3571 L
4803 1037 mt 4803 1095 L
4737 3775 mt 
(80) s
5391 3630 mt 5391 3571 L
5391 1037 mt 5391 1095 L
5325 3775 mt 
(90) s
5978 3630 mt 5978 3571 L
5978 1037 mt 5978 1095 L
5878 3775 mt 
(100) s
6566 3630 mt 6566 3571 L
6566 1037 mt 6566 1095 L
6466 3775 mt 
(110) s
 691 3630 mt  749 3630 L
6566 3630 mt 6507 3630 L
 590 3674 mt 
(0) s
 691 3303 mt  749 3303 L
6566 3303 mt 6507 3303 L
 590 3347 mt 
(1) s
 691 2976 mt  749 2976 L
6566 2976 mt 6507 2976 L
 590 3020 mt 
(2) s
 691 2649 mt  749 2649 L
6566 2649 mt 6507 2649 L
 590 2693 mt 
(3) s
 691 2322 mt  749 2322 L
6566 2322 mt 6507 2322 L
 590 2366 mt 
(4) s
 691 1995 mt  749 1995 L
6566 1995 mt 6507 1995 L
 590 2039 mt 
(5) s
 691 1669 mt  749 1669 L
6566 1669 mt 6507 1669 L
 590 1713 mt 
(6) s
 691 1342 mt  749 1342 L
6566 1342 mt 6507 1342 L
 590 1386 mt 
(7) s
 691  983 mt 
(x 10) s
%%IncludeResource: font Helvetica
/Helvetica /ISOLatin1Encoding 80 FMSR

 917  909 mt 
(4) s
 691 3630 mt 6566 3630 L
 691 1037 mt 6566 1037 L
 691 3630 mt  691 1037 L
6566 3630 mt 6566 1037 L

end %%Color Dict

eplot
%%EndObject

epage
end

showpage

%%Trailer
%%EOF
