EPIC,GALAH,APOGEE,LAMOST,Gaia-ESO,SAGA,RAVE
213362608,0,0,0,0,0,0
213362826,0,0,0,0,0,0
213363404,0,0,0,0,0,0
213364163,0,0,0,0,0,0
213364266,0,0,0,0,0,0
213365177,0,0,0,0,0,0
213365654,0,0,0,0,0,0
213368183,0,0,0,0,0,0
213368869,0,0,0,0,0,0
213370469,0,0,0,0,0,0
213371380,0,0,0,0,0,0
213374590,0,0,0,0,0,0
213375288,0,0,0,0,0,0
213375761,0,0,0,0,0,0
213377398,0,0,0,0,0,0
213381307,0,0,0,0,0,0
213382552,0,0,0,0,0,0
213382643,0,0,0,0,0,0
213383300,0,0,0,0,0,0
213383603,0,0,0,0,0,0
213384135,0,0,0,0,0,0
213385746,0,0,0,0,0,0
213387880,0,0,0,0,0,0
213388347,0,0,0,0,0,0
213390958,0,0,0,0,0,0
213391468,0,0,0,0,0,0
213391875,0,0,0,0,0,0
213391950,0,0,0,0,0,0
213393161,0,0,0,0,0,0
213396058,0,0,0,0,0,0
213396217,0,0,0,0,0,0
213396544,0,0,0,0,0,0
213396752,0,0,0,0,0,0
213396822,0,0,0,0,0,0
213397585,0,0,0,0,0,0
213398230,0,0,0,0,0,0
213398350,0,0,0,0,0,0
213400801,0,0,0,0,0,0
213401582,0,0,0,0,0,0
213401591,0,0,0,0,0,0
213401883,0,0,0,0,0,0
213402256,0,0,0,0,0,0
213402861,0,0,0,0,0,0
213403406,0,0,0,0,0,0
213403720,0,0,0,0,0,0
213403812,0,0,0,0,0,0
213404197,0,0,0,0,0,0
213404375,0,0,0,0,0,0
213405003,0,0,0,0,0,0
213406676,0,0,0,0,0,0
213407567,0,0,0,0,0,0
213408367,0,0,0,0,0,0
213408445,0,0,0,0,0,0
213409402,0,0,0,0,0,0
213410040,0,0,0,0,0,0
213410332,0,0,0,0,0,0
213410340,0,0,0,0,0,0
213410543,0,0,0,0,0,0
213410939,0,0,0,0,0,0
213410977,0,0,0,0,0,0
213412098,0,0,0,0,0,0
213412897,0,0,0,0,0,0
213413422,0,0,0,0,0,0
213413905,0,0,0,0,0,0
213414090,0,0,0,0,0,0
213414620,0,0,0,0,0,0
213415202,0,0,0,0,0,0
213415435,0,0,0,0,0,0
213416372,0,0,0,0,0,0
213416544,0,0,0,0,0,0
213417067,0,0,0,0,0,0
213417095,0,0,0,0,0,0
213417225,0,0,0,0,0,0
213417244,0,0,0,0,0,0
213417354,0,0,0,0,0,0
213417865,0,0,0,0,0,0
213418099,0,0,0,0,0,0
213418628,0,0,0,0,0,0
213420084,0,0,0,0,0,0
213420286,0,0,0,0,0,0
213421252,0,0,0,0,0,0
213422464,0,0,0,0,0,0
213423011,0,0,0,0,0,0
213423470,0,0,0,0,0,0
213424545,0,0,0,0,0,0
213424804,0,0,0,0,0,0
213425026,0,0,0,0,0,0
213426090,0,0,0,0,0,0
213426198,0,0,0,0,0,0
213428148,0,0,0,0,0,0
213428879,0,0,0,0,0,0
213429430,0,0,0,0,0,0
213430092,0,0,0,0,0,0
213430971,0,0,0,0,0,0
213431949,0,0,0,0,0,0
213432065,0,0,0,0,0,0
213432146,0,0,0,0,0,0
213432291,0,0,0,0,0,0
213433012,0,0,0,0,0,0
213434413,0,0,0,0,0,0
213435063,0,0,0,0,0,0
213435847,0,0,0,0,0,0
213435876,0,0,0,0,0,0
213436033,0,0,0,0,0,0
213436372,0,0,0,0,0,0
213436993,0,0,0,0,0,0
213437162,0,0,0,0,0,0
213438113,0,0,0,0,0,0
213438639,0,0,0,0,0,0
213439082,0,0,0,0,0,0
213439627,0,0,0,0,0,0
213439834,0,0,0,0,0,0
213439955,0,0,0,0,0,0
213440915,0,0,0,0,0,0
213441391,0,0,0,0,0,0
213441771,0,0,0,0,0,0
213442538,0,0,0,0,0,0
213442764,0,0,0,0,0,0
213443286,0,0,0,0,0,0
213443323,0,0,0,0,0,0
213443783,0,0,0,0,0,0
213444166,0,0,0,0,0,0
213444880,0,0,0,0,0,0
213445031,0,0,0,0,0,0
213445220,0,0,0,0,0,0
213445221,0,0,0,0,0,0
213445360,0,0,0,0,0,0
213446168,0,0,0,0,0,0
213447531,0,0,0,0,0,0
213447892,0,0,0,0,0,0
213448260,0,0,0,0,0,0
213448708,0,0,0,0,0,0
213449661,0,0,0,0,0,0
213450086,0,0,0,0,0,0
213450915,0,0,0,0,0,0
213451117,0,0,0,0,0,0
213451423,0,0,0,0,0,0
213452287,0,0,0,0,0,0
213452340,0,0,0,0,0,0
213453302,0,0,0,0,0,0
213453437,0,0,0,0,0,0
213453916,0,0,0,0,0,0
213454481,0,0,0,0,0,0
213455042,0,0,0,0,0,0
213455199,0,0,0,0,0,0
213455995,0,0,0,0,0,0
213456815,0,0,0,0,0,0
213457213,0,0,0,0,0,0
213457971,0,0,0,0,0,0
213458082,0,0,0,0,0,0
213458674,0,0,0,0,0,0
213458704,0,0,0,0,0,0
213459720,0,0,0,0,0,0
213460379,0,0,0,0,0,0
213460549,0,0,0,0,0,0
213461259,0,0,0,0,0,0
213461494,0,0,0,0,0,0
213462579,0,0,0,0,0,0
213462659,0,0,0,0,0,0
213462874,0,0,0,0,0,0
213462996,0,0,0,0,0,1
213463429,0,0,0,0,0,0
213463686,0,0,0,0,0,0
213463719,0,0,0,0,0,0
213463766,0,0,0,0,0,0
213464659,0,0,0,0,0,0
213465151,0,0,0,0,0,0
213465734,0,0,0,0,0,0
213467003,0,0,0,0,0,0
213467200,0,0,0,0,0,0
213467447,0,0,0,0,0,0
213467587,0,0,0,0,0,0
213467652,0,0,0,0,0,0
213467813,0,0,0,0,0,0
213469022,0,0,0,0,0,0
213469675,0,0,0,0,0,0
213469758,0,0,0,0,0,0
213470053,0,0,0,0,0,0
213471123,0,0,0,0,0,0
213473687,0,0,0,0,0,0
213473755,0,0,0,0,0,0
213473837,0,0,0,0,0,0
213474475,0,0,0,0,0,0
213475645,0,0,0,0,0,0
213475758,0,0,0,0,0,0
213476996,0,0,0,0,0,0
213478370,0,0,0,0,0,0
213478490,0,0,0,0,0,0
213478494,0,0,0,0,0,0
213479247,0,0,0,0,0,0
213479508,0,0,0,0,0,0
213479664,0,0,0,0,0,0
213480166,0,0,0,0,0,0
213481207,0,0,0,0,0,0
213481638,0,0,0,0,0,0
213481703,0,0,0,0,0,0
213481761,0,0,0,0,0,0
213481888,0,0,0,0,0,0
213481901,0,0,0,0,0,0
213482112,0,0,0,0,0,0
213482195,0,0,0,0,0,0
213483527,0,0,0,0,0,0
213484572,0,0,0,0,0,0
213484616,0,0,0,0,0,0
213484843,0,0,0,0,0,0
213484851,0,0,0,0,0,0
213485121,0,0,0,0,0,0
213485355,0,0,0,0,0,0
213485626,0,0,0,0,0,0
213486289,0,0,0,0,0,0
213486616,0,0,0,0,0,0
213487571,0,0,0,0,0,0
213487657,0,0,0,0,0,0
213487891,0,0,0,0,0,0
213488455,0,0,0,0,0,0
213488531,0,0,0,0,0,0
213489173,0,0,0,0,0,0
213489199,0,0,0,0,0,0
213489554,0,0,0,0,0,0
213489598,0,0,0,0,0,0
213489779,0,0,0,0,0,0
213490008,0,0,0,0,0,0
213490042,0,0,0,0,0,0
213490311,0,0,0,0,0,0
213492350,0,0,0,0,0,1
213492578,0,0,0,0,0,0
213493160,0,0,0,0,0,0
213493168,0,0,0,0,0,0
213493223,0,0,0,0,0,0
213493986,0,0,0,0,0,0
213494473,0,0,0,0,0,0
213495564,0,0,0,0,0,0
213496028,0,0,0,0,0,0
213496157,0,0,0,0,0,0
213496974,0,0,0,0,0,0
213497065,0,0,0,0,0,0
213497083,0,0,0,0,0,0
213497176,0,0,0,0,0,0
213497270,0,0,0,0,0,0
213498027,0,0,0,0,0,0
213498381,0,0,0,0,0,0
213498382,0,0,0,0,0,0
213498963,0,0,0,0,0,0
213499581,0,0,0,0,0,0
213500295,0,0,0,0,0,0
213500543,0,0,0,0,0,0
213500801,0,0,0,0,0,0
213501552,0,0,0,0,0,0
213502173,0,0,0,0,0,0
213502311,0,0,0,0,0,0
213503517,0,0,0,0,0,0
213503774,0,0,0,0,0,0
213503909,0,0,0,0,0,0
213504304,0,0,0,0,0,0
213504446,0,0,0,0,0,0
213504638,0,0,0,0,0,0
213504646,0,0,0,0,0,0
213504732,0,0,0,0,0,0
213505980,0,0,0,0,0,0
213506728,0,0,0,0,0,0
213507221,0,0,0,0,0,0
213507295,0,0,0,0,0,0
213507491,0,0,0,0,0,0
213508016,0,0,0,0,0,0
213508221,0,0,0,0,0,0
213508255,0,0,0,0,0,0
213508316,0,0,0,0,0,0
213508456,0,0,0,0,0,0
213508504,0,0,0,0,0,0
213509472,0,0,0,0,0,0
213509491,0,0,0,0,0,0
213509645,0,0,0,0,0,0
213509735,0,0,0,0,0,0
213510048,0,0,0,0,0,0
213510239,0,0,0,0,0,0
213510882,0,0,0,0,0,0
213512260,0,0,0,0,0,0
213512385,0,0,0,0,0,0
213512673,0,0,0,0,0,0
213512680,0,0,0,0,0,0
213512892,0,0,0,0,0,0
213512983,0,0,0,0,0,0
213513319,0,0,0,0,0,0
213514363,0,0,0,0,0,0
213514559,0,0,0,0,0,0
213515004,0,0,0,0,0,0
213515239,0,0,0,0,0,0
213515665,0,0,0,0,0,0
213515698,0,0,0,0,0,0
213516220,0,0,0,0,0,0
213516244,0,0,0,0,0,0
213516623,0,0,0,0,0,0
213517186,0,0,0,0,0,0
213517464,0,0,0,0,0,0
213517522,0,0,0,0,0,0
213518442,0,0,0,0,0,0
213518459,0,0,0,0,0,0
213518798,0,0,0,0,0,0
213519584,0,0,0,0,0,0
213520133,0,0,0,0,0,0
213520514,0,0,0,0,0,0
213522553,0,0,0,0,0,0
213523349,0,0,0,0,0,0
213523425,0,0,0,0,0,0
213523476,0,0,0,0,0,0
213523640,0,0,0,0,0,0
213523960,0,0,0,0,0,0
213524105,0,0,0,0,0,0
213524167,0,0,0,0,0,0
213524212,0,0,0,0,0,0
213524680,0,0,0,0,0,0
213524723,0,0,0,0,0,0
213525300,0,0,0,0,0,0
213525541,0,0,0,0,0,0
213527397,0,0,0,0,0,0
213527551,0,0,0,0,0,0
213527920,0,0,0,0,0,0
213528072,0,0,0,0,0,0
213528560,0,0,0,0,0,0
213528908,0,0,0,0,0,0
213529412,0,0,0,0,0,0
213530184,0,0,0,0,0,0
213530400,0,0,0,0,0,0
213530563,0,0,0,0,0,0
213531008,0,0,0,0,0,0
213531069,0,0,0,0,0,0
213531448,0,0,0,0,0,0
213531453,0,0,0,0,0,0
213532050,0,0,0,0,0,0
213532320,0,0,0,0,0,0
213532686,0,0,0,0,0,0
213532859,0,0,0,0,0,0
213533540,0,0,0,0,0,0
213534070,0,0,0,0,0,0
213534464,0,0,0,0,0,0
213535241,0,0,0,0,0,0
213535954,0,0,0,0,0,0
213536006,0,0,0,0,0,0
213536351,0,0,0,0,0,0
213536493,0,0,0,0,0,0
213537276,0,0,0,0,0,0
213537528,0,0,0,0,0,0
213537648,0,0,0,0,0,0
213538117,0,0,0,0,0,0
213538178,0,0,0,0,0,0
213538594,0,0,0,0,0,0
213538724,0,0,0,0,0,0
213539156,0,0,0,0,0,0
213539168,0,0,0,0,0,0
213539392,0,0,0,0,0,0
213539662,0,0,0,0,0,0
213539932,0,0,0,0,0,0
213539954,0,0,0,0,0,0
213540314,0,0,0,0,0,0
213540776,0,0,0,0,0,0
213541539,0,0,0,0,0,0
213541656,0,0,0,0,0,0
213541862,0,0,0,0,0,0
213542225,0,0,0,0,0,0
213543697,0,0,0,0,0,0
213544217,0,0,0,0,0,0
213546164,0,0,0,0,0,0
213546304,0,0,0,0,0,0
213546360,0,0,0,0,0,0
213546785,0,0,0,0,0,0
213547695,0,0,0,0,0,0
213548228,0,0,0,0,0,0
213548581,0,0,0,0,0,0
213548586,0,0,0,0,0,0
213549315,0,0,0,0,0,0
213549332,0,0,0,0,0,0
213549359,0,0,0,0,0,0
213550226,0,0,0,0,0,0
213551085,0,0,0,0,0,0
213551173,0,0,0,0,0,0
213551491,0,0,0,0,0,0
213551526,0,0,0,0,0,0
213551584,0,0,0,0,0,0
213552294,0,0,0,0,0,0
213552626,0,0,0,0,0,0
213553069,0,0,0,0,0,0
213553443,0,0,0,0,0,0
213553826,0,0,0,0,0,0
213553968,0,0,0,0,0,0
213554364,0,0,0,0,0,0
213554566,0,0,0,0,0,0
213554855,0,0,0,0,0,0
213555079,0,0,0,0,0,0
213556423,0,0,0,0,0,0
213556952,0,0,0,0,0,0
213557419,0,0,0,0,0,0
213557636,0,0,0,0,0,0
213558241,0,0,0,0,0,0
213558567,0,0,0,0,0,0
213560084,0,0,0,0,0,0
213560089,0,0,0,0,0,0
213560272,0,0,0,0,0,0
213560877,0,0,0,0,0,0
213562012,0,0,0,0,0,0
213562102,0,0,0,0,0,0
213562291,0,0,0,0,0,0
213562354,0,0,0,0,0,0
213563657,0,0,0,0,0,0
213563990,0,0,0,0,0,0
213564289,0,0,0,0,0,0
213564750,0,0,0,0,0,0
213564924,0,0,0,0,0,0
213565895,0,0,0,0,0,0
213566497,0,0,0,0,0,0
213567018,0,0,0,0,0,0
213567787,0,0,0,0,0,0
213568542,0,0,0,0,0,0
213569009,0,0,0,0,0,0
213569356,0,0,0,0,0,0
213569428,0,0,0,0,0,0
213570398,0,0,0,0,0,0
213570836,0,0,0,0,0,0
213571124,0,0,0,0,0,0
213571816,0,0,0,0,0,0
213572065,0,0,0,0,0,0
213572310,0,0,0,0,0,0
213573559,0,0,0,0,0,0
213574033,0,0,0,0,0,0
213574408,0,0,0,0,0,0
213574661,0,0,0,0,0,0
213574685,0,0,0,0,0,0
213574732,0,0,0,0,0,0
213574799,0,0,0,0,0,0
213575519,0,0,0,0,0,0
213575543,0,0,0,0,0,0
213575638,0,0,0,0,0,0
213575940,0,0,0,0,0,0
213576140,0,0,0,0,0,0
213576474,0,0,0,0,0,0
213576569,0,0,0,0,0,0
213577023,0,0,0,0,0,0
213577406,0,0,0,0,0,0
213578043,0,0,0,0,0,0
213578495,0,0,0,0,0,0
213578581,0,0,0,0,0,0
213579312,0,0,0,0,0,0
213579357,0,0,0,0,0,0
213579699,0,0,0,0,0,0
213580193,0,0,0,0,0,0
213581206,0,0,0,0,0,0
213582639,0,0,0,0,0,0
213582845,0,0,0,0,0,0
213583262,0,0,0,0,0,0
213583834,0,0,0,0,0,0
213583885,0,0,0,0,0,0
213585411,0,0,0,0,0,0
213585630,0,0,0,0,0,0
213585652,0,0,0,0,0,0
213586472,0,0,0,0,0,0
213587227,0,0,0,0,0,0
213587432,0,0,0,0,0,0
213587452,0,0,0,0,0,0
213587801,0,0,0,0,0,0
213587935,0,0,0,0,0,0
213588242,0,0,0,0,0,0
213588373,0,0,0,0,0,0
213588425,0,0,0,0,0,0
213589046,0,0,0,0,0,0
213589632,0,0,0,0,0,0
213589823,0,0,0,0,0,0
213589895,0,0,0,0,0,0
213591325,0,0,0,0,0,0
213591921,0,0,0,0,0,0
213591969,0,0,0,0,0,0
213592761,0,0,0,0,0,0
213593000,0,0,0,0,0,0
213593031,0,0,0,0,0,0
213593495,0,0,0,0,0,0
213593696,0,0,0,0,0,0
213593939,0,0,0,0,0,0
213594112,0,0,0,0,0,0
213594453,0,0,0,0,0,0
213595266,0,0,0,0,0,0
213595642,0,0,0,0,0,0
213595814,0,0,0,0,0,0
213596144,0,0,0,0,0,0
213597285,0,0,0,0,0,0
213597286,0,0,0,0,0,0
213598116,0,0,0,0,0,1
213598969,0,0,0,0,0,0
213599413,0,0,0,0,0,0
213600378,0,0,0,0,0,0
213600477,0,0,0,0,0,0
213600514,0,0,0,0,0,0
213600632,0,0,0,0,0,0
213601038,0,0,0,0,0,0
213601209,0,0,0,0,0,0
213601382,0,0,0,0,0,0
213601546,0,0,0,0,0,0
213602501,0,0,0,0,0,0
213603999,0,0,0,0,0,0
213604406,0,0,0,0,0,0
213604647,0,0,0,0,0,0
213605033,0,0,0,0,0,0
213606176,0,0,0,0,0,0
213606314,0,0,0,0,0,0
213607765,0,0,0,0,0,0
213609330,0,0,0,0,0,0
213609470,0,0,0,0,0,0
213611078,0,0,0,0,0,0
213611380,0,0,0,0,0,0
213612429,0,0,0,0,0,0
213612834,0,0,0,0,0,0
213612948,0,0,0,0,0,0
213613184,0,0,0,0,0,0
213613810,0,0,0,0,0,0
213614021,0,0,0,0,0,0
213614151,0,0,0,0,0,0
213614236,0,0,0,0,0,0
213614882,0,0,0,0,0,0
213615041,0,0,0,0,0,0
213615341,0,0,0,0,0,0
213615628,0,0,0,0,0,0
213615856,0,0,0,0,0,0
213615937,0,0,0,0,0,0
213616115,0,0,0,0,0,0
213616808,0,0,0,0,0,0
213617051,0,0,0,0,0,0
213617339,0,0,0,0,0,0
213617569,0,0,0,0,0,1
213617662,0,0,0,0,0,0
213617820,0,0,0,0,0,0
213617893,0,0,0,0,0,0
213618307,0,0,0,0,0,0
213618415,0,0,0,0,0,0
213618992,0,0,0,0,0,0
213619223,0,0,0,0,0,0
213619558,0,0,0,0,0,0
213619656,0,0,0,0,0,0
213619962,0,0,0,0,0,0
213620907,0,0,0,0,0,0
213621569,0,0,0,0,0,0
213622018,0,0,0,0,0,0
213622036,0,0,0,0,0,0
213623023,0,0,0,0,0,0
213624072,0,0,0,0,0,0
213624272,0,0,0,0,0,0
213624925,0,0,0,0,0,0
213625440,0,0,0,0,0,0
213625761,0,0,0,0,0,0
213626032,0,0,0,0,0,0
213626280,0,0,0,0,0,0
213627017,0,0,0,0,0,0
213627233,0,0,0,0,0,0
213628278,0,0,0,0,0,0
213628417,0,0,0,0,0,0
213628962,0,0,0,0,0,0
213629813,0,0,0,0,0,0
213630325,0,0,0,0,0,0
213631028,0,0,0,0,0,0
213631526,0,0,0,0,0,0
213631883,0,0,0,0,0,0
213632145,0,0,0,0,0,0
213632986,0,0,0,0,0,0
213633292,0,0,0,0,0,0
213633325,0,0,0,0,0,0
213633845,0,0,0,0,0,0
213635280,0,0,0,0,0,0
213635284,0,0,0,0,0,1
213635581,0,0,0,0,0,0
213636280,0,0,0,0,0,0
213636568,0,0,0,0,0,0
213637167,0,0,0,0,0,0
213637460,0,0,0,0,0,0
213638079,0,0,0,0,0,0
213638949,0,0,0,0,0,0
213639192,0,0,0,0,0,0
213639678,0,0,0,0,0,0
213640112,0,0,0,0,0,0
213640890,0,0,0,0,0,0
213641214,0,0,0,0,0,0
213641269,0,0,0,0,0,0
213641382,0,0,0,0,0,0
213641582,0,0,0,0,0,0
213642117,0,0,0,0,0,0
213642328,0,0,0,0,0,0
213642589,0,0,0,0,0,0
213643339,0,0,0,0,0,0
213643642,0,0,0,0,0,0
213643650,0,0,0,0,0,0
213644854,0,0,0,0,0,0
213645014,0,0,0,0,0,0
213645306,0,0,0,0,0,0
213645408,0,0,0,0,0,0
213645669,0,0,0,0,0,0
213645864,0,0,0,0,0,0
213645953,0,0,0,0,0,0
213647431,0,0,0,0,0,0
213648304,0,0,0,0,0,0
213648449,0,0,0,0,0,0
213649167,0,0,0,0,0,0
213649320,0,0,0,0,0,0
213649499,0,0,0,0,0,0
213650333,0,0,0,0,0,0
213650818,0,0,0,0,0,0
213651699,0,0,0,0,0,0
213651916,0,0,0,0,0,0
213652006,0,0,0,0,0,0
213652267,0,0,0,0,0,0
213653008,0,0,0,0,0,0
213653864,0,0,0,0,0,0
213653960,0,0,0,0,0,0
213654146,0,0,0,0,0,0
213654342,0,0,0,0,0,1
213655061,0,0,0,0,0,0
213656981,0,0,0,0,0,0
213657106,0,0,0,0,0,0
213657136,0,0,0,0,0,0
213657468,0,0,0,0,0,0
213657714,0,0,0,0,0,0
213657752,0,0,0,0,0,0
213658104,0,0,0,0,0,0
213658351,0,0,0,0,0,0
213658491,0,0,0,0,0,0
213658682,0,0,0,0,0,0
213658748,0,0,0,0,0,0
213658878,0,0,0,0,0,0
213659220,0,0,0,0,0,0
213660032,0,0,0,0,0,0
213660315,0,0,0,0,0,0
213660493,0,0,0,0,0,0
213660659,0,0,0,0,0,0
213660683,0,0,0,0,0,0
213661041,0,0,0,0,0,0
213661300,0,0,0,0,0,0
213661624,0,0,0,0,0,0
213661970,0,0,0,0,0,0
213661990,0,0,0,0,0,0
213662450,0,0,0,0,0,0
213662959,0,0,0,0,0,0
213663347,0,0,0,0,0,0
213664068,0,0,0,0,0,0
213664116,0,0,0,0,0,0
213665507,0,0,0,0,0,0
213665964,0,0,0,0,0,0
213666795,0,0,0,0,0,0
213667172,0,0,0,0,0,0
213667214,0,0,0,0,0,0
213667454,0,0,0,0,0,0
213667472,0,0,0,0,0,0
213667960,0,0,0,0,0,0
213668746,0,0,0,0,0,0
213668816,0,0,0,0,0,0
213669220,0,0,0,0,0,0
213669334,0,0,0,0,0,0
213670700,0,0,0,0,0,0
213670704,0,0,0,0,0,1
213670773,0,0,0,0,0,0
213670870,0,0,0,0,0,0
213671728,0,0,0,0,0,0
213672864,0,0,0,0,0,0
213673431,0,0,0,0,0,0
213674258,0,0,0,0,0,0
213675278,0,0,0,0,0,0
213675392,0,0,0,0,0,0
213675614,0,0,0,0,0,0
213676462,0,0,0,0,0,0
213676652,0,0,0,0,0,0
213676682,0,0,0,0,0,0
213676849,0,0,0,0,0,0
213678069,0,0,0,0,0,0
213678166,0,0,0,0,0,0
213678275,0,0,0,0,0,0
213678352,0,0,0,0,0,0
213679907,0,0,0,0,0,0
213680013,0,0,0,0,0,0
213680092,0,0,0,0,0,0
213680116,0,0,0,0,0,0
213680750,0,0,0,0,0,0
213681913,0,0,0,0,0,0
213682548,0,0,0,0,0,0
213682641,0,0,0,0,0,0
213683145,0,0,0,0,0,0
213684663,0,0,0,0,0,0
213685451,0,1,0,0,0,0
213685624,0,0,0,0,0,0
213685806,0,0,0,0,0,0
213686171,0,0,0,0,0,0
213686181,0,0,0,0,0,0
213686438,0,0,0,0,0,0
213687395,0,0,0,0,0,0
213687785,0,0,0,0,0,0
213688804,0,0,0,0,0,0
213689099,0,0,0,0,0,0
213689620,0,0,0,0,0,0
213690056,0,0,0,0,0,0
213690363,0,0,0,0,0,0
213690631,0,0,0,0,0,0
213690825,0,0,0,0,0,0
213690859,0,0,0,0,0,0
213691269,0,0,0,0,0,0
213691373,0,0,0,0,0,0
213691469,0,0,0,0,0,0
213692113,0,0,0,0,0,0
213692448,0,0,0,0,0,0
213692613,0,0,0,0,0,0
213692721,0,0,0,0,0,0
213692723,0,0,0,0,0,0
213692901,0,0,0,0,0,0
213693090,0,0,0,0,0,0
213693788,0,0,0,0,0,0
213693825,0,0,0,0,0,0
213694531,0,0,0,0,0,0
213695358,0,0,0,0,0,0
213695753,0,0,0,0,0,0
213696088,0,0,0,0,0,0
213698261,0,0,0,0,0,0
213698824,0,0,0,0,0,0
213699369,0,0,0,0,0,0
213699676,0,0,0,0,0,0
213700166,0,0,0,0,0,0
213700493,0,0,0,0,0,0
213700814,0,0,0,0,0,0
213701107,0,0,0,0,0,0
213701170,0,0,0,0,0,0
213701863,0,0,0,0,0,0
213702420,0,0,0,0,0,0
213702971,0,0,0,0,0,0
213703001,0,0,0,0,0,0
213703481,0,0,0,0,0,0
213703832,0,0,0,0,0,0
213704100,0,0,0,0,0,0
213704174,0,0,0,0,0,0
213704709,0,0,0,0,0,0
213705219,0,0,0,0,0,0
213705771,0,0,0,0,0,0
213706472,0,0,0,0,0,0
213707213,0,0,0,0,0,0
213707624,0,0,0,0,0,0
213707670,0,0,0,0,0,1
213707868,0,0,0,0,0,0
213708436,0,0,0,0,0,0
213708586,0,0,0,0,0,0
213710168,0,0,0,0,0,0
213710499,0,0,0,0,0,0
213713912,0,0,0,0,0,0
213715182,0,0,0,0,0,0
213715734,0,0,0,0,0,0
213716325,0,0,0,0,0,0
213716898,0,0,0,0,0,0
213716925,0,0,0,0,0,0
213717060,0,0,0,0,0,0
213717400,0,0,0,0,0,0
213717948,0,0,0,0,0,1
213719403,0,0,0,0,0,0
213719553,0,0,0,0,0,0
213720202,0,0,0,0,0,0
213720771,0,0,0,0,0,0
213721565,0,0,0,0,0,0
213721784,0,0,0,0,0,0
213721922,0,0,0,0,0,0
213722282,0,0,0,0,0,0
213722591,0,0,0,0,0,0
213723126,0,0,0,0,0,0
213723201,0,0,0,0,0,0
213723516,0,0,0,0,0,0
213723521,0,0,0,0,0,0
213724145,0,1,0,0,0,0
213724189,0,0,0,0,0,0
213724285,0,0,0,0,0,0
213724419,0,0,0,0,0,0
213724954,0,0,0,0,0,0
213725051,0,0,0,0,0,0
213726302,0,0,0,0,0,0
213726417,0,0,0,0,0,0
213727729,0,0,0,0,0,0
213727734,0,0,0,0,0,0
213728076,0,0,0,0,0,0
213728931,0,0,0,0,0,0
213729000,0,0,0,0,0,0
213729642,0,0,0,0,0,0
213729739,0,0,0,0,0,0
213729836,0,0,0,0,0,0
213729846,0,0,0,0,0,0
213729903,0,0,0,0,0,0
213730997,0,0,0,0,0,0
213732030,0,0,0,0,0,0
213732624,0,0,0,0,0,0
213733432,0,0,0,0,0,0
213733659,0,0,0,0,0,0
213733976,0,0,0,0,0,0
213734838,0,0,0,0,0,0
213736396,0,0,0,0,0,0
213736704,0,0,0,0,0,0
213738589,0,0,0,0,0,0
213738801,0,0,0,0,0,0
213739010,0,0,0,0,0,0
213739390,0,0,0,0,0,0
213739555,0,0,0,0,0,0
213740521,0,0,0,0,0,0
213741832,0,0,0,0,0,0
213742103,0,0,0,0,0,0
213742275,0,0,0,0,0,0
213742522,0,0,0,0,0,0
213743245,0,0,0,0,0,0
213743619,0,0,0,0,0,0
213743957,0,0,0,0,0,0
213744955,0,0,0,0,0,0
213745291,0,0,0,0,0,0
213745988,0,0,0,0,0,0
213746430,0,0,0,0,0,0
213747398,0,0,0,0,0,0
213747996,0,0,0,0,0,0
213748001,0,0,0,0,0,0
213748317,0,0,0,0,0,0
213748457,0,0,0,0,0,0
213749138,0,0,0,0,0,0
213749222,0,0,0,0,0,0
213749660,0,0,0,0,0,0
213749663,0,0,0,0,0,0
213749902,0,0,0,0,0,0
213750085,0,0,0,0,0,0
213750609,0,0,0,0,0,0
213750689,0,0,0,0,0,0
213751342,0,0,0,0,0,0
213752450,0,0,0,0,0,0
213753861,0,0,0,0,0,0
213754032,0,0,0,0,0,0
213754522,0,0,0,0,0,0
213754636,0,0,0,0,0,0
213755213,0,0,0,0,0,0
213756094,0,0,0,0,0,0
213756197,0,0,0,0,0,0
213757030,0,0,0,0,0,0
213757309,0,0,0,0,0,0
213758552,0,0,0,0,0,0
213759032,0,0,0,0,0,0
213759039,0,0,0,0,0,0
213759366,0,0,0,0,0,0
213759956,0,0,0,0,0,0
213760968,0,0,0,0,0,0
213761121,0,0,0,0,0,0
213761166,0,0,0,0,0,0
213762385,0,0,0,0,0,0
213762399,0,0,0,0,0,0
213762672,0,0,0,0,0,0
213762720,0,0,0,0,0,0
213763205,0,0,0,0,0,0
213763356,0,0,0,0,0,0
213763590,0,0,0,0,0,0
213763596,0,0,0,0,0,0
213763749,0,0,0,0,0,0
213763794,0,0,0,0,0,0
213764390,0,0,0,0,0,0
213764892,0,0,0,0,0,0
213765003,0,0,0,0,0,0
213765007,0,0,0,0,0,0
213765093,0,0,0,0,0,0
213765435,0,0,0,0,0,0
213767042,0,0,0,0,0,0
213767335,0,0,0,0,0,0
213768176,0,0,0,0,0,0
213768542,0,0,0,0,0,0
213769135,0,0,0,0,0,0
213769257,0,0,0,0,0,0
213769786,0,0,0,0,0,0
213770461,0,0,0,0,0,0
213770870,0,0,0,0,0,0
213771447,0,0,0,0,0,0
213771857,0,0,0,0,0,0
213771860,0,0,0,0,0,0
213772193,0,0,0,0,0,0
213772217,0,0,0,0,0,0
213772655,0,0,0,0,0,0
213772739,0,0,0,0,0,0
213772804,0,0,0,0,0,0
213773097,0,0,0,0,0,0
213773736,0,0,0,0,0,0
213774891,0,0,0,0,0,0
213775807,0,0,0,0,0,0
213776772,0,0,0,0,0,0
213776842,0,0,0,0,0,0
213776887,0,0,0,0,0,0
213777009,0,0,0,0,0,0
213777398,0,0,0,0,0,0
213777861,0,0,0,0,0,0
213778018,0,0,0,0,0,0
213778129,0,0,0,0,0,0
213778217,0,0,0,0,0,0
213778312,0,0,0,0,0,0
213778492,0,0,0,0,0,0
213778787,0,0,0,0,0,0
213779215,0,0,0,0,0,0
213779372,0,0,0,0,0,0
213779464,0,0,0,0,0,0
213779688,0,0,0,0,0,0
213780706,0,0,0,0,0,0
213780947,0,0,0,0,0,0
213781674,0,0,0,0,0,0
213782913,0,0,0,0,0,0
213783043,0,0,0,0,0,0
213783321,0,0,0,0,0,0
213783904,0,0,0,0,0,0
213784385,0,0,0,0,0,0
213785971,0,0,0,0,0,0
213788387,0,0,0,0,0,0
213789387,0,0,0,0,0,0
213789445,0,0,0,0,0,0
213789553,0,0,0,0,0,0
213789556,0,0,0,0,0,0
213789977,0,0,0,0,0,0
213790011,0,0,0,0,0,0
213790284,0,0,0,0,0,0
213791301,0,0,0,0,0,0
213791825,0,0,0,0,0,0
213792893,0,0,0,0,0,0
213793103,0,0,0,0,0,0
213793166,0,0,0,0,0,0
213793703,0,0,0,0,0,0
213794475,0,0,0,0,0,0
213795229,0,0,0,0,0,0
213795410,0,0,0,0,0,0
213795656,0,0,0,0,0,0
213796056,0,0,0,0,0,0
213796283,0,0,0,0,0,0
213796837,0,0,0,0,0,0
213797278,0,0,0,0,0,0
213799078,0,0,0,0,0,0
213799439,0,0,0,0,0,0
213800086,0,0,0,0,0,0
213800164,0,0,0,0,0,0
213800252,0,0,0,0,0,0
213800383,0,0,0,0,0,0
213801001,0,0,0,0,0,0
213801843,0,0,0,0,0,0
213803248,0,0,0,0,0,0
213803847,0,0,0,0,0,0
213803877,0,0,0,0,0,0
213804663,0,0,0,0,0,0
213805034,0,0,0,0,0,0
213806065,0,0,0,0,0,0
213806075,0,0,0,0,0,0
213806089,0,0,0,0,0,0
213806348,0,0,0,0,0,0
213807358,0,0,0,0,0,0
213807898,0,0,0,0,0,0
213808244,0,0,0,0,0,0
213808472,0,0,0,0,0,0
213808903,0,0,0,0,0,0
213809000,0,0,0,0,0,0
213809232,0,0,0,0,0,0
213809654,0,0,0,0,0,0
213809700,0,0,0,0,0,0
213810125,0,0,0,0,0,0
213810760,0,0,0,0,0,0
213810771,0,0,0,0,0,0
213811600,0,0,0,0,0,0
213811846,0,0,0,0,0,0
213812046,0,0,0,0,0,0
213812150,0,0,0,0,0,0
213813541,0,0,0,0,0,0
213813711,0,0,0,0,0,0
213813723,0,0,0,0,0,0
213813802,0,0,0,0,0,0
213814062,0,0,0,0,0,0
213814345,0,0,0,0,0,0
213814432,0,0,0,0,0,0
213814656,0,0,0,0,0,0
213814950,0,0,0,0,0,0
213815118,0,0,0,0,0,0
213815764,0,0,0,0,0,0
213815788,0,0,0,0,0,0
213815900,0,0,0,0,0,0
213816203,0,0,0,0,0,0
213816570,0,0,0,0,0,0
213818122,0,0,0,0,0,0
213818146,0,0,0,0,0,0
213818322,0,0,0,0,0,0
213819243,0,0,0,0,0,0
213819287,0,0,0,0,0,0
213819543,0,0,0,0,0,0
213819916,0,0,0,0,0,0
213819943,0,0,0,0,0,0
213820955,0,0,0,0,0,0
213821245,0,0,0,0,0,0
213821513,0,0,0,0,0,0
213823554,0,0,0,0,0,0
213825297,0,0,0,0,0,0
213825595,0,0,0,0,0,0
213827600,0,0,0,0,0,0
213828212,0,0,0,0,0,0
213828636,0,0,0,0,0,0
213829683,0,0,0,0,0,0
213829933,0,0,0,0,0,0
213830508,0,0,0,0,0,0
213830810,0,0,0,0,0,0
213831251,0,0,0,0,0,0
213831547,0,0,0,0,0,0
213832060,0,0,0,0,0,0
213832178,0,0,0,0,0,0
213832362,0,0,0,0,0,0
213832708,0,0,0,0,0,0
213832794,0,0,0,0,0,0
213833429,0,0,0,0,0,0
213833808,0,0,0,0,0,0
213834379,0,0,0,0,0,0
213835402,0,0,0,0,0,0
213836234,0,0,0,0,0,0
213836439,0,0,0,0,0,0
213837261,0,0,0,0,0,0
213837525,0,0,0,0,0,0
213837765,0,0,0,0,0,0
213838091,0,0,0,0,0,0
213838860,0,0,0,0,0,0
213839950,0,0,0,0,0,0
213840079,0,0,0,0,0,0
213840204,0,0,0,0,0,0
213840290,0,0,0,0,0,0
213840500,0,0,0,0,0,0
213840713,0,0,0,0,0,0
213840781,0,0,0,0,0,0
213841467,0,0,0,0,0,0
213841822,0,0,0,0,0,0
213841960,0,0,0,0,0,0
213842667,0,0,0,0,0,0
213842683,0,0,0,0,0,0
213842841,0,0,0,0,0,0
213843274,0,0,0,0,0,0
213844664,0,0,0,0,0,0
213844765,0,0,0,0,0,0
213844792,0,0,0,0,0,0
213844903,0,0,0,0,0,0
213845081,0,0,0,0,0,0
213845371,0,0,0,0,0,0
213845617,0,0,0,0,0,0
213846505,0,0,0,0,0,1
213846541,0,0,0,0,0,0
213846664,0,0,0,0,0,0
213846908,0,0,0,0,0,0
213846989,0,0,0,0,0,0
213847007,0,0,0,0,0,0
213848857,0,0,0,0,0,0
213849030,0,0,0,0,0,0
213851739,0,0,0,0,0,0
213852583,0,0,0,0,0,0
213853964,0,0,0,0,0,0
213855680,0,0,0,0,0,0
213855911,0,0,0,0,0,0
213856489,0,0,0,0,0,0
213856542,0,0,0,0,0,0
213859399,0,0,0,0,0,0
213859647,0,0,0,0,0,0
213859661,0,0,0,0,0,0
213860219,0,0,0,0,0,0
213861310,0,0,0,0,0,0
213864311,0,0,0,0,0,0
213864471,0,0,0,0,0,0
213864615,0,0,0,0,0,0
213864882,0,0,0,0,0,0
213866648,0,0,0,0,0,0
213866776,0,0,0,0,0,0
213866874,0,0,0,0,0,0
213866881,0,0,0,0,0,0
213867148,0,0,0,0,0,0
213868225,0,0,0,0,0,0
213868769,0,0,0,0,0,0
213869395,0,0,0,0,0,0
213869936,0,0,0,0,0,0
213870194,0,0,0,0,0,0
213870442,0,0,0,0,0,0
213871126,0,0,0,0,0,0
213871531,0,0,0,0,0,0
213871864,0,0,0,0,0,0
213871933,0,0,0,0,0,0
213872229,0,0,0,0,0,0
213872354,0,0,0,0,0,0
213872420,0,0,0,0,0,0
213872445,0,0,0,0,0,0
213872836,0,0,0,0,0,0
213873406,0,0,0,0,0,0
213873729,0,0,0,0,0,0
213873835,0,0,0,0,0,0
213874505,0,0,0,0,0,0
213874876,0,0,0,0,0,0
213875407,0,0,0,0,0,0
213875912,0,0,0,0,0,0
213876149,0,0,0,0,0,0
213876818,0,0,0,0,0,0
213877544,0,0,0,0,0,0
213877667,0,0,0,0,0,0
213878137,0,0,0,0,0,0
213878602,0,0,0,0,0,0
213879236,0,0,0,0,0,0
213879320,0,0,0,0,0,0
213879379,0,0,0,0,0,0
213881732,0,0,0,0,0,0
213882568,0,0,0,0,0,0
213882915,0,0,0,0,0,0
213883103,0,0,0,0,0,0
213884319,0,0,0,0,0,0
213886775,0,0,0,0,0,0
213887711,0,0,0,0,0,0
213887751,0,0,0,0,0,0
213887836,0,0,0,0,0,0
213887929,0,0,0,0,0,0
213888458,0,0,0,0,0,0
213888894,0,0,0,0,0,0
213889036,0,0,0,0,0,0
213889336,0,0,0,0,0,0
213889836,0,0,0,0,0,0
213890151,0,0,0,0,0,0
213890710,0,0,0,0,0,0
213890711,0,0,0,0,0,0
213890870,0,0,0,0,0,0
213890930,0,0,0,0,0,0
213892406,0,0,0,0,0,0
213892844,0,0,0,0,0,0
213892886,0,0,0,0,0,0
213893799,0,0,0,0,0,0
213894144,0,0,0,0,0,0
213894327,0,0,0,0,0,0
213894413,0,0,0,0,0,0
213894747,0,0,0,0,0,0
213894951,0,0,0,0,0,0
213895353,0,0,0,0,0,0
213895673,0,0,0,0,0,0
213896480,0,0,0,0,0,0
213897290,0,0,0,0,0,0
213897992,0,0,0,0,0,0
213898002,0,0,0,0,0,0
213899289,0,0,0,0,0,0
213899542,0,0,0,0,0,0
213899550,0,0,0,0,0,0
213899630,0,0,0,0,0,0
213899653,0,0,0,0,0,0
213899984,0,0,0,0,0,0
213900636,0,0,0,0,0,0
213901141,0,0,0,0,0,0
213902713,0,0,0,0,0,0
213903644,0,0,0,0,0,0
213904295,0,0,0,0,0,0
213904387,0,0,0,0,0,0
213904516,0,0,0,0,0,0
213905505,0,0,0,0,0,0
213905688,0,0,0,0,0,0
213906699,0,0,0,0,0,0
213907531,0,0,0,0,0,0
213908726,0,0,0,0,0,0
213908908,0,0,0,0,0,0
213909085,0,0,0,0,0,0
213909943,0,0,0,0,0,0
213910667,0,0,0,0,0,0
213910794,0,0,0,0,0,0
213911016,0,0,0,0,0,0
213911724,0,0,0,0,0,0
213912349,0,0,0,0,0,0
213912688,0,0,0,0,0,0
213913484,0,0,0,0,0,0
213913837,0,0,0,0,0,0
213914312,0,0,0,0,0,0
213914743,0,0,0,0,0,0
213916694,0,0,0,0,0,0
213918425,0,0,0,0,0,0
213918628,0,0,0,0,0,0
213919525,0,0,0,0,0,0
213919737,0,0,0,0,0,0
213921620,0,0,0,0,0,0
213922185,0,0,0,0,0,0
213923576,0,0,0,0,0,0
213924158,0,0,0,0,0,0
213924473,0,0,0,0,0,0
213925189,0,0,0,0,0,0
213925461,0,0,0,0,0,0
213925572,0,0,0,0,0,0
213926096,0,0,0,0,0,0
213926552,0,0,0,0,0,0
213926947,0,0,0,0,0,0
213927974,0,0,0,0,0,0
213928216,0,0,0,0,0,0
213928472,0,0,0,0,0,0
213928943,0,0,0,0,0,0
213929412,0,0,0,0,0,0
213931040,0,0,0,0,0,0
213932085,0,0,0,0,0,0
213934543,0,0,0,0,0,0
213934788,0,0,0,0,0,0
213935245,0,0,0,0,0,0
213935442,0,0,0,0,0,0
213936662,0,0,0,0,0,0
213936801,0,0,0,0,0,0
213937603,0,0,0,0,0,0
213937830,0,0,0,0,0,0
213938800,0,0,0,0,0,0
213939708,0,0,0,0,0,0
213940140,0,0,0,0,0,0
213944015,0,0,0,0,0,0
213944052,0,0,0,0,0,0
213944751,0,0,0,0,0,0
213944813,0,0,0,0,0,0
213945401,0,0,0,0,0,0
213946612,0,0,0,0,0,0
213947936,0,0,0,0,0,0
213947990,0,0,0,0,0,0
213949368,0,0,0,0,0,0
213949410,0,0,0,0,0,1
213949708,0,0,0,0,0,0
213950069,0,0,0,0,0,0
213952596,0,0,0,0,0,0
213953851,0,0,0,0,0,0
213955165,0,0,0,0,0,0
213956808,0,0,0,0,0,0
213957956,0,0,0,0,0,0
213963196,0,0,0,0,0,0
213964046,0,0,0,0,0,0
213969778,0,0,0,0,0,0
213972962,0,0,0,0,0,0
213974737,0,0,0,0,0,0
213975121,0,0,0,0,0,0
213980293,0,0,0,0,0,0
213980935,0,0,0,0,0,0
213984563,0,0,0,0,0,0
214007818,0,0,0,0,0,0
214039830,0,0,0,0,0,0
214066722,0,0,0,0,0,0
214088496,0,0,0,0,0,0
214112991,0,0,0,0,0,0
214117621,0,0,0,0,0,0
214139732,0,0,0,0,0,0
214169460,0,0,0,0,0,0
214178377,0,0,0,0,0,0
214193925,0,0,0,0,0,0
214230263,0,0,0,0,0,0
214242838,0,0,0,0,0,0
214254518,0,0,0,0,0,0
214283084,0,0,0,0,0,0
214284498,0,0,0,0,0,0
214287144,0,0,0,0,0,0
214299062,0,0,0,0,0,0
214311901,0,0,0,0,0,0
214314277,0,0,0,0,0,0
214327524,0,0,0,0,0,0
214334333,0,0,0,0,0,0
214354254,0,0,0,0,0,0
214385296,0,0,0,0,0,0
214402646,0,0,0,0,0,0
214405105,0,0,0,0,0,0
214438217,0,0,0,0,0,0
214446640,0,0,0,0,0,0
214456761,0,0,0,0,0,0
214493772,0,0,0,0,0,0
214514995,0,0,0,0,0,0
214522613,0,0,0,0,0,0
214528890,0,0,0,0,0,0
214551796,0,0,0,0,0,0
214552536,0,0,0,0,0,0
214553777,0,0,0,0,0,0
214554515,0,0,0,0,0,0
214554541,0,0,0,0,0,0
214555113,0,0,0,0,0,0
214556506,0,0,0,0,0,0
214558882,0,0,0,0,0,0
214559388,0,0,0,0,0,0
214559560,0,0,0,0,0,0
214560630,0,0,0,0,0,0
214560775,0,0,0,0,0,0
214562157,0,0,0,0,0,0
214564872,0,0,0,0,0,0
214567637,0,0,0,0,0,0
214568649,0,0,0,0,0,0
214568722,0,0,0,0,0,0
214568779,0,0,0,0,0,0
214570137,0,0,0,0,0,0
214571442,0,0,0,0,0,0
214572074,0,0,0,0,0,0
214574267,0,0,0,0,0,0
214574549,0,0,0,0,0,0
214575049,0,0,0,0,0,0
214575138,0,0,0,0,0,0
214575226,0,0,0,0,0,0
214575323,0,0,0,0,0,0
214575825,0,0,0,0,0,0
214575852,0,0,0,0,0,0
214575894,0,0,0,0,0,0
214576141,0,0,0,0,0,0
214576668,0,0,0,0,0,0
214578099,0,0,0,0,0,0
214578799,0,0,0,0,0,0
214579262,0,0,0,0,0,0
214579758,0,0,0,0,0,0
214581299,0,0,0,0,0,0
214581555,0,0,0,0,0,0
214582225,0,0,0,0,0,0
214582372,0,0,0,0,0,0
214582654,0,0,0,0,0,0
214582731,0,0,0,0,0,0
214583903,0,0,0,0,0,0
214585072,0,0,0,0,0,0
214585097,0,0,0,0,0,0
214585330,0,0,0,0,0,0
214585494,0,0,0,0,0,0
214587895,0,0,0,0,0,0
214588926,0,0,0,0,0,0
214589159,0,0,0,0,0,0
214589777,0,0,0,0,0,0
214590170,0,0,0,0,0,0
214590859,0,0,0,0,0,0
214591808,0,0,0,0,0,0
214592213,0,0,0,0,0,0
214592405,0,0,0,0,0,0
214593892,0,0,0,0,0,0
214593906,0,0,0,0,0,0
214594589,0,0,0,0,0,0
214595079,0,0,0,0,0,0
214595581,0,0,0,0,0,0
214595966,0,0,0,0,0,0
214596348,0,0,0,0,0,0
214596723,0,0,0,0,0,0
214598001,0,0,0,0,0,0
214598175,0,0,0,0,0,0
214598217,0,0,0,0,0,0
214598242,0,0,0,0,0,0
214598293,0,0,0,0,0,0
214598438,0,0,0,0,0,0
214598634,0,0,0,0,0,0
214600459,0,0,0,0,0,0
214600731,0,0,0,0,0,0
214602190,0,0,0,0,0,0
214602239,0,0,0,0,0,0
214605185,0,0,0,0,0,0
214605552,0,0,0,0,0,0
214605962,0,0,0,0,0,0
214606859,0,0,0,0,0,0
214607569,0,0,0,0,0,0
214607747,0,0,0,0,0,0
214608335,0,0,0,0,0,0
214608564,0,0,0,0,0,0
214609498,0,0,0,0,0,0
214609751,0,0,0,0,0,0
214609946,0,0,0,0,0,0
214611136,0,0,0,0,0,0
214611325,0,0,0,0,0,0
214611362,0,0,0,0,0,0
214611660,0,0,0,0,0,0
214611950,0,0,0,0,0,0
214613568,0,0,0,0,0,0
214613835,0,0,0,0,0,0
214618272,0,0,0,0,0,0
214619414,0,0,0,0,0,0
214620160,0,0,0,0,0,0
214620763,0,0,0,0,0,0
214621541,0,0,0,0,0,0
214623214,0,0,0,0,0,0
214623239,0,0,0,0,0,0
214623271,0,0,0,0,0,0
214623542,0,0,0,0,0,0
214623824,0,0,0,0,0,0
214624440,0,0,0,0,0,0
214624802,0,0,0,0,0,0
214625346,0,0,0,0,0,0
214626691,0,0,0,0,0,0
214627034,0,0,0,0,0,0
214627146,0,0,0,0,0,0
214627367,0,0,0,0,0,0
214628243,0,0,0,0,0,0
214629283,0,0,0,0,0,0
214630744,0,0,0,0,0,0
214630761,0,0,0,0,0,0
214630853,0,0,0,0,0,0
214630912,0,0,0,0,0,0
214631414,0,0,0,0,0,0
214632998,0,0,0,0,0,0
214634084,0,0,0,0,0,0
214635787,0,0,0,0,0,0
214636104,0,0,0,0,0,0
214636419,0,0,0,0,0,0
214638725,0,0,0,0,0,0
214639286,0,0,0,0,0,0
214640084,0,0,0,0,0,0
214640369,0,0,0,0,0,0
214640647,0,0,0,0,0,0
214641261,0,0,0,0,0,0
214641376,0,0,0,0,0,0
214643390,0,0,0,0,0,0
214643725,0,0,0,0,0,0
214644546,0,0,0,0,0,0
214644572,0,0,0,0,0,0
214644971,0,0,0,0,0,0
214645813,0,0,0,0,0,0
214646263,0,0,0,0,0,0
214646731,0,0,0,0,0,0
214647589,0,0,0,0,0,0
214647724,0,0,0,0,0,0
214648251,0,0,0,0,0,0
214648446,0,0,0,0,0,0
214648510,0,0,0,0,0,0
214648645,0,0,0,0,0,0
214648998,0,0,0,0,0,0
214649649,0,0,0,0,0,0
214649982,0,0,0,0,0,0
214650131,0,0,0,0,0,0
214651596,0,0,0,0,0,0
214652557,0,0,0,0,0,0
214652838,0,0,0,0,0,0
214652964,0,0,0,0,0,0
214653301,0,0,0,0,0,0
214653421,0,0,0,0,0,0
214653735,0,0,0,0,0,0
214653876,0,0,0,0,0,0
214654245,0,0,0,0,0,0
214654827,0,0,0,0,0,0
214655465,0,0,0,0,0,0
214655858,0,0,0,0,0,0
214655915,0,0,0,0,0,0
214656637,0,0,0,0,0,0
214656710,0,0,0,0,0,0
214657562,0,0,0,0,0,0
214659046,0,0,0,0,0,0
214659111,0,0,0,0,0,0
214659202,0,0,0,0,0,0
214659747,0,0,0,0,0,0
214659915,0,0,0,0,0,0
214660763,0,0,0,0,0,0
214662400,0,0,0,0,0,0
214662817,0,0,0,0,0,0
214662915,0,0,0,0,0,0
214663311,0,0,0,0,0,0
214663346,0,0,0,0,0,0
214663384,0,0,0,0,0,0
214663688,0,0,0,0,0,0
214664648,0,0,0,0,0,0
214665279,0,0,0,0,0,0
214667127,0,0,0,0,0,0
214667516,0,0,0,0,0,0
214667541,0,0,0,0,0,0
214667698,0,0,0,0,0,0
214668451,0,0,0,0,0,1
214668566,0,0,0,0,0,0
214668583,0,0,0,0,0,0
214668708,0,0,0,0,0,0
214668891,0,0,0,0,0,0
214668986,0,0,0,0,0,0
214669083,0,0,0,0,0,0
214669739,0,0,0,0,0,0
214669807,0,0,0,0,0,0
214669934,0,0,0,0,0,0
214670207,0,0,0,0,0,0
214670430,0,0,0,0,0,0
214671176,0,0,0,0,0,0
214671226,0,0,0,0,0,0
214671434,0,0,0,0,0,0
214671870,0,0,0,0,0,0
214672233,0,0,0,0,0,0
214672496,0,0,0,0,0,0
214673183,0,0,0,0,0,0
214673234,0,0,0,0,0,0
214673946,0,0,0,0,0,0
214675488,0,0,0,0,0,0
214675824,0,0,0,0,0,0
214676038,0,0,0,0,0,0
214677688,0,0,0,0,0,0
214679078,0,0,0,0,0,0
214679722,0,0,0,0,0,0
214679726,0,0,0,0,0,0
214679851,0,0,0,0,0,0
214679931,0,0,0,0,0,0
214680056,0,0,0,0,0,0
214680254,0,0,0,0,0,0
214681374,0,0,0,0,0,0
214682079,0,0,0,0,0,0
214682239,0,0,0,0,0,0
214682280,0,0,0,0,0,0
214682400,0,0,0,0,0,0
214682765,0,0,0,0,0,0
214683154,0,0,0,0,0,0
214683945,0,0,0,0,0,0
214684100,0,0,0,0,0,0
214684279,0,0,0,0,0,0
214684296,0,0,0,0,0,0
214684495,0,0,0,0,0,0
214684528,0,0,0,0,0,0
214684869,0,0,0,0,0,0
214685356,0,0,0,0,0,0
214685372,0,0,0,0,0,0
214685721,0,0,0,0,0,0
214685734,0,0,0,0,0,0
214686419,0,0,0,0,0,0
214687073,0,0,0,0,0,0
214687255,0,0,0,0,0,0
214687432,0,0,0,0,0,0
214687473,0,0,0,0,0,0
214687519,0,0,0,0,0,0
214687620,0,0,0,0,0,0
214688034,0,0,0,0,0,0
214688200,0,0,0,0,0,0
214688269,0,0,0,0,0,0
214688584,0,0,0,0,0,0
214688786,0,0,0,0,0,0
214688884,0,0,0,0,0,0
214689411,0,0,0,0,0,0
214689700,0,0,0,0,0,0
214689818,0,0,0,0,0,0
214690121,0,0,0,0,0,0
214690562,0,0,0,0,0,0
214690910,0,0,0,0,0,0
214690931,0,0,0,0,0,0
214692159,0,0,0,0,0,0
214692171,0,0,0,0,0,0
214694344,0,0,0,0,0,0
214694768,0,0,0,0,0,0
214695406,0,0,0,0,0,0
214695440,0,0,0,0,0,0
214695571,0,0,0,0,0,0
214695648,0,0,0,0,0,0
214696298,0,0,0,0,0,0
214696536,0,0,0,0,0,0
214696936,0,0,0,0,0,0
214697173,0,0,0,0,0,0
214698201,0,0,0,0,0,0
214698851,0,0,0,0,0,0
214699017,0,0,0,0,0,0
214699322,0,0,0,0,0,0
214699619,0,0,0,0,0,0
214700058,0,0,0,0,0,0
214700504,0,0,0,0,0,0
214702326,0,0,0,0,0,0
214702587,0,0,0,0,0,0
214702744,0,0,0,0,0,0
214702838,0,0,0,0,0,0
214702913,0,0,0,0,0,0
214703088,0,0,0,0,0,0
214703115,0,0,0,0,0,0
214703232,0,0,0,0,0,0
214703689,0,0,0,0,0,0
214703698,0,0,0,0,0,0
214703701,0,0,0,0,0,0
214703871,0,0,0,0,0,0
214703940,0,0,0,0,0,0
214704291,0,0,0,0,0,0
214704553,0,0,0,0,0,0
214705029,0,0,0,0,0,0
214705210,0,0,0,0,0,0
214705228,0,0,0,0,0,0
214705621,0,0,0,0,0,0
214705653,0,0,0,0,0,0
214706431,0,0,0,0,0,0
214706787,0,0,0,0,0,0
214707046,0,0,0,0,0,0
214707342,0,0,0,0,0,0
214707450,0,0,0,0,0,0
214707702,0,0,0,0,0,0
214707820,0,0,0,0,0,0
214707833,0,0,0,0,0,0
214707855,0,0,0,0,0,0
214708045,0,0,0,0,0,0
214708139,0,0,0,0,0,0
214708311,0,0,0,0,0,0
214708429,0,0,0,0,0,0
214708565,0,0,0,0,0,0
214708748,0,0,0,0,0,0
214708790,0,0,0,0,0,0
214710068,0,0,0,0,0,0
214710271,0,0,0,0,0,0
214710365,0,0,0,0,0,0
214710527,0,0,0,0,0,0
214710697,0,0,0,0,0,0
214711324,0,0,0,0,0,0
214712115,0,0,0,0,0,0
214712200,0,0,0,0,0,0
214712287,0,0,0,0,0,0
214712730,0,0,0,0,0,0
214712791,0,0,0,0,0,0
214712971,0,0,0,0,0,0
214713719,0,0,0,0,0,0
214713854,0,0,0,0,0,0
214714213,0,0,0,0,0,0
214715125,0,0,0,0,0,0
214715317,0,0,0,0,0,0
214715687,0,0,0,0,0,0
214716038,0,0,0,0,0,0
214716157,0,0,0,0,0,0
214716418,0,0,0,0,0,0
214716613,0,0,0,0,0,0
214717261,0,0,0,0,0,0
214717431,0,0,0,0,0,0
214717463,0,0,0,0,0,0
214718078,0,0,0,0,0,0
214718133,0,0,0,0,0,0
214718545,0,0,0,0,0,0
214718635,0,0,0,0,0,0
214719202,0,0,0,0,0,0
214719219,0,0,0,0,0,0
214720051,0,0,0,0,0,0
214721052,0,0,0,0,0,1
214721342,0,0,0,0,0,0
214721790,0,0,0,0,0,0
214722008,0,0,0,0,0,0
214722009,0,0,0,0,0,0
214722089,0,0,0,0,0,0
214722402,0,0,0,0,0,0
214722420,0,0,0,0,0,0
214722474,0,0,0,0,0,0
214723739,0,0,0,0,0,0
214723803,0,0,0,0,0,0
214723962,0,0,0,0,0,0
214723998,0,0,0,0,0,0
214724292,0,0,0,0,0,0
214724418,0,0,0,0,0,0
214724462,0,0,0,0,0,0
214724486,0,0,0,0,0,0
214724887,0,0,0,0,0,0
214725405,0,0,0,0,0,0
214725650,0,0,0,0,0,0
214725843,0,0,0,0,0,0
214726020,0,0,0,0,0,0
214726806,0,0,0,0,0,0
214727326,0,0,0,0,0,0
214727391,0,0,0,0,0,0
214727446,0,0,0,0,0,0
214728294,0,0,0,0,0,0
214728725,0,0,0,0,0,0
214729069,0,0,0,0,0,0
214729122,0,0,0,0,0,0
214729243,0,0,0,0,0,0
214731764,0,0,0,0,0,0
214731853,0,0,0,0,0,0
214732206,0,0,0,0,0,0
214732207,0,0,0,0,0,0
214733303,0,0,0,0,0,0
214733543,0,0,0,0,0,0
214733600,0,0,0,0,0,0
214733638,0,0,0,0,0,0
214735723,0,0,0,0,0,0
214735900,0,0,0,0,0,0
214736581,0,0,0,0,0,0
214736722,0,0,0,0,0,0
214736958,0,0,0,0,0,0
214737178,0,0,0,0,0,0
214737250,0,0,0,0,0,0
214737784,0,0,0,0,0,0
214738035,0,0,0,0,0,0
214738063,0,0,0,0,0,0
214738326,0,0,0,0,0,0
214738330,0,0,0,0,0,0
214738894,0,0,0,0,0,0
214739296,0,0,0,0,0,0
214739660,0,0,0,0,0,0
214739764,0,0,0,0,0,0
214739797,0,0,0,0,0,0
214740495,0,0,0,0,0,0
214740595,0,0,0,0,0,0
214740798,0,0,0,0,0,0
214740982,0,0,0,0,0,0
214741009,0,0,0,0,0,0
214741343,0,0,0,0,0,0
214741841,0,0,0,0,0,0
214741883,0,0,0,0,0,0
214742875,0,0,0,0,0,0
214743133,0,0,0,0,0,0
214743968,0,0,0,0,0,0
214744098,0,0,0,0,0,0
214744242,0,0,0,0,0,1
214744433,0,0,0,0,0,0
214744521,0,0,0,0,0,0
214744533,0,0,0,0,0,0
214745154,0,0,0,0,0,0
214745385,0,0,0,0,0,0
214746942,0,0,0,0,0,0
214747077,0,0,0,0,0,0
214747133,0,0,0,0,0,0
214747301,0,0,0,0,0,0
214747815,0,0,0,0,0,0
214747918,0,0,0,0,0,0
214748587,0,0,0,0,0,0
214749130,0,0,0,0,0,0
214749169,0,0,0,0,0,0
214749771,0,0,0,0,0,0
214749786,0,0,0,0,0,0
214749865,0,0,0,0,0,0
214749874,0,0,0,0,0,0
214749891,0,0,0,0,0,0
214750071,0,0,0,0,0,0
214751443,0,0,0,0,0,0
214751544,0,0,0,0,0,0
214751722,0,0,0,0,0,0
214752519,0,0,0,0,0,0
214753294,0,0,0,0,0,0
214753397,0,0,0,0,0,0
214753923,0,0,0,0,0,0
214754056,0,0,0,0,0,0
214754237,0,0,0,0,0,0
214754612,0,0,0,0,0,0
214754958,0,0,0,0,0,0
214755169,0,0,0,0,0,0
214755196,0,0,0,0,0,0
214755928,0,0,0,0,0,0
214756145,0,0,0,0,0,0
214756331,0,0,0,0,0,0
214756654,0,0,0,0,0,0
214756769,0,0,0,0,0,0
214756881,0,0,0,0,0,0
214756976,0,0,0,0,0,0
214757380,0,0,0,0,0,0
214757384,0,0,0,0,0,0
214757948,0,0,0,0,0,0
214758667,0,0,0,0,0,0
214758875,0,0,0,0,0,0
214759251,0,0,0,0,0,0
214759450,0,0,0,0,0,0
214759480,0,0,0,0,0,0
214759864,0,0,0,0,0,0
214760279,0,0,0,0,0,0
214760472,0,0,0,0,0,0
214760530,0,0,0,0,0,0
214761068,0,0,0,0,0,0
214761095,0,0,0,0,0,0
214762139,0,0,0,0,0,0
214763091,0,0,0,0,0,0
214763431,0,0,0,0,0,0
214764475,0,0,0,0,0,0
214764920,0,0,0,0,0,0
214764976,0,0,0,0,0,0
214764978,0,0,0,0,0,0
214765654,0,0,0,0,0,0
214765765,0,0,0,0,0,0
214766250,0,0,0,0,0,0
214766749,0,0,0,0,0,0
214766983,0,0,0,0,0,0
214767332,0,0,0,0,0,0
214767361,0,0,0,0,0,0
214767396,0,0,0,0,0,0
214768209,0,0,0,0,0,0
214768984,0,0,0,0,0,0
214769017,0,0,0,0,0,0
214770334,0,0,0,0,0,0
214770352,0,0,0,0,0,0
214770757,0,0,0,0,0,0
214770868,0,0,0,0,0,0
214771335,0,0,0,0,0,0
214771425,0,0,0,0,0,0
214771822,0,0,0,0,0,0
214772234,0,0,0,0,0,0
214773237,0,0,0,0,0,0
214773804,0,0,0,0,0,0
214773854,0,0,0,0,0,0
214775274,0,0,0,0,0,0
214775664,0,0,0,0,0,0
214776280,0,0,0,0,0,0
214776289,0,0,0,0,0,0
214776552,0,0,0,0,0,0
214776787,0,0,0,0,0,0
214777369,0,0,0,0,0,0
214777964,0,0,0,0,0,0
214778560,0,0,0,0,0,0
214778768,0,0,0,0,0,0
214778853,0,0,0,0,0,0
214778855,0,0,0,0,0,0
214778907,0,0,0,0,0,0
214779396,0,0,0,0,0,0
214779416,0,0,0,0,0,0
214779496,0,0,0,0,0,0
214780294,0,0,0,0,0,0
214780917,0,0,0,0,0,0
214781358,0,0,0,0,0,0
214782192,0,0,0,0,0,0
214782404,0,0,0,0,0,0
214783208,0,0,0,0,0,0
214783496,0,0,0,0,0,0
214783968,0,0,0,0,0,0
214784157,0,0,0,0,0,0
214785326,0,0,0,0,0,0
214785390,0,0,0,0,0,0
214785612,0,0,0,0,0,0
214785705,0,0,0,0,0,0
214785795,0,0,0,0,0,0
214785947,0,0,0,0,0,0
214786451,0,0,0,0,0,0
214786853,0,0,0,0,0,0
214786865,0,0,0,0,0,0
214787262,0,0,0,0,0,0
214787441,0,0,0,0,0,0
214787456,0,0,0,0,0,0
214788001,0,0,0,0,0,0
214788014,0,0,0,0,0,0
214788330,0,0,0,0,0,0
214788415,0,0,0,0,0,0
214788609,0,0,0,0,0,0
214789249,0,0,0,0,0,0
214789384,0,0,0,0,0,0
214790184,0,0,0,0,0,0
214790534,0,0,0,0,0,0
214790629,0,0,0,0,0,0
214790867,0,0,0,0,0,0
214790910,0,0,0,0,0,0
214790933,0,0,0,0,0,0
214790946,0,0,0,0,0,0
214791190,0,0,0,0,0,0
214791237,0,0,0,0,0,0
214791447,0,0,0,0,0,0
214792085,0,0,0,0,0,0
214792277,0,0,0,0,0,0
214792673,0,0,0,0,0,0
214793047,0,0,0,0,0,0
214793072,0,0,0,0,0,0
214793369,0,0,0,0,0,0
214793732,0,0,0,0,0,0
214794287,0,0,0,0,0,0
214795067,0,0,0,0,0,0
214795149,0,0,0,0,0,0
214795182,0,0,0,0,0,0
214796054,0,0,0,0,0,0
214796132,0,0,0,0,0,0
214796863,0,0,0,0,0,0
214797116,0,0,0,0,0,0
214797141,0,0,0,0,0,0
214798366,0,0,0,0,0,0
214799621,0,0,0,0,0,0
214800331,0,0,0,0,0,0
214800402,0,0,0,0,0,0
214800409,0,0,0,0,0,0
214800762,0,0,0,0,0,0
214801201,0,0,0,0,0,0
214801550,0,0,0,0,0,0
214801590,0,0,0,0,0,0
214801616,0,0,0,0,0,0
214801740,0,0,0,0,0,0
214801941,0,0,0,0,0,0
214802000,0,0,0,0,0,0
214802447,0,0,0,0,0,0
214802544,0,0,0,0,0,0
214802589,0,0,0,0,0,0
214802917,0,0,0,0,0,0
214803146,0,0,0,0,0,0
214803188,0,0,0,0,0,0
214803522,0,0,0,0,0,0
214803695,0,0,0,0,0,0
214804061,0,0,0,0,0,0
214804292,0,0,0,0,0,0
214804563,0,0,0,0,0,0
214804897,0,0,0,0,0,0
214805111,0,0,0,0,0,0
214806353,0,0,0,0,0,0
214806432,0,0,0,0,0,0
214806631,0,0,0,0,0,0
214806928,0,0,0,0,0,0
214807112,0,0,0,0,0,0
214807238,0,0,0,0,0,0
214807275,0,0,0,0,0,0
214807561,0,0,0,0,0,0
214807583,0,0,0,0,0,0
214807608,0,0,0,0,0,0
214807662,0,0,0,0,0,0
214807892,0,0,0,0,0,0
214807982,0,0,0,0,0,0
214808322,0,0,0,0,0,0
214808420,0,0,0,0,0,0
214808603,0,0,0,0,0,0
214808989,0,0,0,0,0,0
214809411,0,0,0,0,0,0
214809442,0,0,0,0,0,0
214810001,0,0,0,0,0,0
214810175,0,0,0,0,0,0
214810782,0,0,0,0,0,0
214810841,0,0,0,0,0,0
214810856,0,0,0,0,0,0
214811417,0,0,0,0,0,0
214811423,0,0,0,0,0,0
214812168,0,0,0,0,0,0
214812655,0,0,0,0,0,0
214813041,0,0,0,0,0,0
214813064,0,0,0,0,0,0
214813702,0,0,0,0,0,0
214813892,0,0,0,0,0,0
214814258,0,0,0,0,0,0
214814371,0,0,0,0,0,0
214814485,0,0,0,0,0,0
214814604,0,0,0,0,0,0
214814894,0,0,0,0,0,0
214815081,0,0,0,0,0,0
214815713,0,0,0,0,0,0
214816246,0,0,0,0,0,0
214816337,0,0,0,0,0,0
214816428,0,0,0,0,0,0
214816975,0,0,0,0,0,0
214817122,0,0,0,0,0,0
214817247,0,0,0,0,0,0
214817573,0,0,0,0,0,0
214818059,0,0,0,0,0,0
214818166,0,0,0,0,0,0
214819352,0,0,0,0,0,0
214819979,0,0,0,0,0,0
214820702,0,0,0,0,0,0
214821021,0,0,0,0,0,0
214821115,0,0,0,0,0,0
214822083,0,0,0,0,0,0
214822306,0,0,0,0,0,0
214822717,0,0,0,0,0,0
214822771,0,0,0,0,0,0
214822934,0,0,0,0,0,0
214823438,0,0,0,0,0,0
214824346,0,0,0,0,0,0
214824985,0,0,0,0,0,0
214825575,0,0,0,0,0,0
214825725,0,0,0,0,0,0
214825736,0,0,0,0,0,0
214826415,0,0,0,0,0,0
214827003,0,0,0,0,0,0
214827660,0,0,0,0,0,0
214827776,0,0,0,0,0,0
214828049,0,0,0,0,0,0
214828058,0,0,0,0,0,0
214828177,0,0,0,0,0,0
214828930,0,0,0,0,0,0
214829645,0,0,0,0,0,0
214829731,0,0,0,0,0,0
214829787,0,0,0,0,0,0
214829842,0,0,0,0,0,0
214829886,0,0,0,0,0,0
214830159,0,0,0,0,0,0
214830599,0,0,0,0,0,0
214831851,0,0,0,0,0,0
214832352,0,0,0,0,0,0
214832561,0,0,0,0,0,0
214833209,0,0,0,0,0,0
214834008,0,0,0,0,0,0
214834031,0,0,0,0,0,0
214834456,0,0,0,0,0,0
214834488,0,0,0,0,0,0
214834768,0,0,0,0,0,0
214835068,0,0,0,0,0,0
214835543,0,0,0,0,0,0
214835562,0,0,0,0,0,0
214835777,0,0,0,0,0,0
214835849,0,0,0,0,0,0
214835885,0,0,0,0,0,0
214835894,0,0,0,0,0,0
214836540,0,0,0,0,0,0
214836640,0,0,0,0,0,0
214837163,0,0,0,0,0,0
214837246,0,0,0,0,0,0
214837257,0,0,0,0,0,0
214838709,0,0,0,0,0,0
214839047,0,0,0,0,0,0
214839648,0,0,0,0,0,0
214839652,0,0,0,0,0,0
214839794,0,0,0,0,0,0
214839814,0,0,0,0,0,0
214839923,0,0,0,0,0,0
214840288,0,0,0,0,0,0
214840694,0,0,0,0,0,0
214840802,0,0,0,0,0,0
214841312,0,0,0,0,0,0
214841667,0,0,0,0,0,0
214841777,0,0,0,0,0,0
214842514,0,0,0,0,0,0
214842541,0,0,0,0,0,0
214842796,0,0,0,0,0,0
214843051,0,0,0,0,0,0
214844027,0,0,0,0,0,0
214844790,0,0,0,0,0,0
214844865,0,0,0,0,0,0
214845997,0,0,0,0,0,0
214846096,0,0,0,0,0,0
214846803,0,0,0,0,0,0
214846854,0,0,0,0,0,0
214846855,0,0,0,0,0,0
214846985,0,0,0,0,0,0
214847605,0,0,0,0,0,0
214847736,0,0,0,0,0,0
214848102,0,0,0,0,0,0
214848257,0,0,0,0,0,0
214849351,0,0,0,0,0,0
214849557,0,0,0,0,0,0
214849972,0,0,0,0,0,0
214849994,0,0,0,0,0,0
214850945,0,0,0,0,0,0
214851196,0,0,0,0,0,0
214851937,0,0,0,0,0,0
214851988,0,0,0,0,0,0
214852041,0,0,0,0,0,0
214852160,0,0,0,0,0,0
214852381,0,0,0,0,0,0
214853058,0,0,0,0,0,0
214853156,0,0,0,0,0,0
214853373,0,0,0,0,0,0
214853894,0,0,0,0,0,0
214853971,0,0,0,0,0,0
214854508,0,0,0,0,0,0
214855004,0,0,0,0,0,0
214855228,0,0,0,0,0,0
214855360,0,0,0,0,0,0
214855939,0,0,0,0,0,0
214856072,0,0,0,0,0,0
214856668,0,0,0,0,0,0
214857058,0,0,0,0,0,0
214857072,0,0,0,0,0,0
214857100,0,0,0,0,0,0
214857178,0,0,0,0,0,0
214857706,0,0,0,0,0,0
214857714,0,0,0,0,0,0
214857885,0,0,0,0,0,0
214858000,0,0,0,0,0,0
214858010,0,0,0,0,0,0
214858722,0,0,0,0,0,0
214859084,0,0,0,0,0,0
214859205,0,0,0,0,0,0
214859226,0,0,0,0,0,0
214859427,0,0,0,0,0,0
214859787,0,0,0,0,0,0
214859892,0,0,0,0,0,0
214860504,0,0,0,0,0,0
214861157,0,0,0,0,0,0
214861164,0,0,0,0,0,0
214861194,0,0,0,0,0,0
214862113,0,0,0,0,0,0
214862119,0,0,0,0,0,0
214862236,0,0,0,0,0,0
214862788,0,0,0,0,0,0
214863310,0,0,0,0,0,0
214863370,0,0,0,0,0,0
214863736,0,0,0,0,0,0
214863852,0,0,0,0,0,0
214864239,0,0,0,0,0,0
214864277,0,0,0,0,0,0
214864381,0,0,0,0,0,0
214864897,0,0,0,0,0,0
214865200,0,0,0,0,0,0
214865393,0,0,0,0,0,0
214866135,0,0,0,0,0,0
214866159,0,0,0,0,0,0
214866899,0,0,0,0,0,0
214867222,0,0,0,0,0,0
214867585,0,0,0,0,0,0
214867591,0,0,0,0,0,0
214868899,0,0,0,0,0,0
214869430,0,0,0,0,0,0
214869516,0,0,0,0,0,0
214870126,0,0,0,0,0,0
214870223,0,0,0,0,0,0
214870242,0,0,0,0,0,0
214870251,0,0,0,0,0,0
214870300,0,0,0,0,0,0
214870507,0,0,0,0,0,0
214870997,0,0,0,0,0,0
214871027,0,0,0,0,0,0
214871554,0,0,0,0,0,0
214871586,0,0,0,0,0,0
214871630,0,0,0,0,0,0
214871879,0,0,0,0,0,0
214871931,0,0,0,0,0,0
214871999,0,0,0,0,0,0
214872041,0,0,0,0,0,0
214872387,0,0,0,0,0,0
214872622,0,0,0,0,0,0
214872897,0,0,0,0,0,0
214873018,0,0,0,0,0,0
214873558,0,0,0,0,0,0
214873730,0,0,0,0,0,0
214874424,0,0,0,0,0,0
214874491,0,0,0,0,0,0
214874618,0,0,0,0,0,0
214874897,0,0,0,0,0,0
214874944,0,0,0,0,0,0
214875122,0,0,0,0,0,0
214875424,0,0,0,0,0,0
214875555,0,0,0,0,0,0
214875561,0,0,0,0,0,0
214875878,0,0,0,0,0,0
214875912,0,0,0,0,0,0
214875955,0,0,0,0,0,0
214876120,0,0,0,0,0,0
214876601,0,0,0,0,0,0
214876604,0,0,0,0,0,0
214877100,0,0,0,0,0,0
214877649,0,0,0,0,0,0
214878187,0,0,0,0,0,0
214878971,0,0,0,0,0,0
214879583,0,0,0,0,0,0
214879593,0,0,0,0,0,0
214879662,0,0,0,0,0,0
214879852,0,0,0,0,0,0
214879937,0,0,0,0,0,0
214880038,0,0,0,0,0,0
214880487,0,0,0,0,0,0
214880667,0,0,0,0,0,0
214881119,0,0,0,0,0,0
214881129,0,0,0,0,0,0
214881598,0,0,0,0,0,0
214882535,0,0,0,0,0,0
214882576,0,0,0,0,0,0
214882668,0,0,0,0,0,0
214882726,0,0,0,0,0,0
214883057,0,0,0,0,0,0
214883249,0,0,0,0,0,0
214883529,0,0,0,0,0,0
214883875,0,0,0,0,0,0
214883950,0,0,0,0,0,0
214883984,0,0,0,0,0,0
214884334,0,0,0,0,0,0
214884769,0,0,0,0,0,0
214885378,0,0,0,0,0,0
214886766,0,0,0,0,0,0
214887048,0,0,0,0,0,0
214887469,0,0,0,0,0,0
214887706,0,0,0,0,0,0
214888033,0,0,0,0,0,0
214888146,0,0,0,0,0,0
214888318,0,0,0,0,0,0
214888791,0,0,0,0,0,0
214889119,0,0,0,0,0,0
214889604,0,0,0,0,0,0
214889977,0,0,0,0,0,0
214890260,0,0,0,0,0,0
214890634,0,0,0,0,0,0
214890685,0,0,0,0,0,0
214890735,0,0,0,0,0,0
214890761,0,0,0,0,0,0
214890940,0,0,0,0,0,0
214891089,0,0,0,0,0,0
214891308,0,0,0,0,0,0
214891439,0,0,0,0,0,0
214891734,0,0,0,0,0,0
214892132,0,0,0,0,0,0
214892412,0,0,0,0,0,0
214892564,0,0,0,0,0,0
214893005,0,0,0,0,0,0
214893358,0,0,0,0,0,0
214893616,0,0,0,0,0,0
214894049,0,0,0,0,0,0
214894083,0,0,0,0,0,0
214894149,0,0,0,0,0,0
214894151,0,0,0,0,0,0
214894227,0,0,0,0,0,0
214894419,0,0,0,0,0,0
214894995,0,0,0,0,0,0
214895058,0,0,0,0,0,0
214895283,0,0,0,0,0,0
214895531,0,0,0,0,0,0
214895832,0,0,0,0,0,0
214895946,0,0,0,0,0,0
214896022,0,0,0,0,0,0
214896052,0,0,0,0,0,0
214896061,0,0,0,0,0,0
214896124,0,0,0,0,0,0
214896505,0,0,0,0,0,0
214896541,0,0,0,0,0,0
214896603,0,0,0,0,0,0
214896681,0,0,0,0,0,0
214896711,0,0,0,0,0,0
214896932,0,0,0,0,0,0
214897317,0,0,0,0,0,0
214897573,0,0,0,0,0,0
214897651,0,0,0,0,0,0
214897863,0,0,0,0,0,0
214899216,0,0,0,0,0,0
214899265,0,0,0,0,0,0
214899596,0,0,0,0,0,0
214899679,0,0,0,0,0,0
214899878,0,0,0,0,0,0
214900018,0,0,0,0,0,0
214900085,0,0,0,0,0,0
214900446,0,0,0,0,0,0
214900550,0,0,0,0,0,0
214900570,0,0,0,0,0,0
214900851,0,0,0,0,0,0
214901089,0,0,0,0,0,0
214901364,0,0,0,0,0,0
214902220,0,0,0,0,0,0
214902481,0,0,0,0,0,0
214903738,0,0,0,0,0,0
214903760,0,0,0,0,0,0
214904394,0,0,0,0,0,0
214904676,0,0,0,0,0,0
214905208,0,0,0,0,0,0
214905279,0,0,0,0,0,0
214905538,0,0,0,0,0,0
214905750,0,0,0,0,0,0
214905795,0,0,0,0,0,0
214905956,0,0,0,0,0,0
214906213,0,0,0,0,0,0
214906457,0,0,0,0,0,0
214907235,0,0,0,0,0,0
214907453,0,0,0,0,0,0
214907635,0,0,0,0,0,0
214907662,0,0,0,0,0,0
214908127,0,0,0,0,0,0
214908361,0,0,0,0,0,0
214908364,0,0,0,0,0,0
214908565,0,0,0,0,0,0
214908742,0,0,0,0,0,0
214909473,0,0,0,0,0,0
214909871,0,0,0,0,0,0
214910398,0,0,0,0,0,0
214910905,0,0,0,0,0,0
214910931,0,0,0,0,0,0
214910932,0,0,0,0,0,0
214910974,0,0,0,0,0,0
214911509,0,0,0,0,0,0
214912000,0,0,0,0,0,0
214912428,0,0,0,0,0,0
214912467,0,0,0,0,0,0
214912972,0,0,0,0,0,0
214913332,0,0,0,0,0,0
214913354,0,0,0,0,0,0
214913587,0,0,0,0,0,0
214913588,0,0,0,0,0,0
214914240,0,0,0,0,0,0
214914341,0,0,0,0,0,0
214914644,0,0,0,0,0,0
214914673,0,0,0,0,0,0
214915317,0,0,0,0,0,0
214915368,0,0,0,0,0,0
214915680,0,0,0,0,0,0
214916157,0,0,0,0,0,0
214916332,0,0,0,0,0,0
214916493,0,0,0,0,0,0
214916586,0,0,0,0,0,0
214916910,0,0,0,0,0,0
214917338,0,0,0,0,0,0
214917520,0,0,0,0,0,0
214917632,0,0,0,0,0,0
214918572,0,0,0,0,0,0
214918869,0,0,0,0,0,0
214918992,0,0,0,0,0,0
214919082,0,0,0,0,0,0
214919686,0,0,0,0,0,0
214920024,0,0,0,0,0,0
214921302,0,0,0,0,0,0
214921826,0,0,0,0,0,0
214922114,0,0,0,0,0,0
214922346,0,0,0,0,0,0
214922686,0,0,0,0,0,0
214922978,0,0,0,0,0,0
214923154,0,0,0,0,0,0
214923432,0,0,0,0,0,0
214923460,0,0,0,0,0,0
214924381,0,0,0,0,0,0
214924838,0,0,0,0,0,0
214925084,0,0,0,0,0,0
214925228,0,0,0,0,0,0
214925320,0,0,0,0,0,0
214926624,0,0,0,0,0,0
214926926,0,0,0,0,0,0
214927228,0,0,0,0,0,0
214927448,0,0,0,0,0,0
214927617,0,0,0,0,0,0
214927800,0,0,0,0,0,0
214927975,0,0,0,0,0,0
214928411,0,0,0,0,0,0
214928421,0,0,0,0,0,0
214928506,0,0,0,0,0,0
214928569,0,0,0,0,0,0
214929089,0,0,0,0,0,0
214929782,0,0,0,0,0,0
214930816,0,0,0,0,0,0
214931457,0,0,0,0,0,0
214932127,0,0,0,0,0,0
214932152,0,0,0,0,0,0
214932747,0,0,0,0,0,0
214933029,0,0,0,0,0,0
214933270,0,0,0,0,0,0
214933400,0,0,0,0,0,0
214933568,0,0,0,0,0,0
214934347,0,0,0,0,0,0
214934463,0,0,0,0,0,0
214936080,0,0,0,0,0,0
214936232,0,0,0,0,0,0
214936470,0,0,0,0,0,0
214936674,0,0,0,0,0,0
214936736,0,0,0,0,0,0
214937265,0,0,0,0,0,0
214937309,0,0,0,0,0,0
214937372,0,0,0,0,0,0
214937706,0,0,0,0,0,0
214937769,0,0,0,0,0,0
214938220,0,0,0,0,0,0
214938940,0,0,0,0,0,0
214939507,0,0,0,0,0,0
214939852,0,0,0,0,0,0
214940074,0,0,0,0,0,0
214940119,0,0,0,0,0,0
214940428,0,0,0,0,0,0
214940608,0,0,0,0,0,0
214940669,0,0,0,0,0,0
214941026,0,0,0,0,0,0
214941233,0,0,0,0,0,0
214942170,0,0,0,0,0,0
214942366,0,0,0,0,0,0
214942699,0,0,0,0,0,0
214943007,0,0,0,0,0,0
214943152,0,0,0,0,0,0
214943157,0,0,0,0,0,0
214943528,0,0,0,0,0,0
214943902,0,0,0,0,0,0
214944132,0,0,0,0,0,0
214944463,0,0,0,0,0,0
214944490,0,0,0,0,0,0
214945067,0,0,0,0,0,0
214945206,0,0,0,0,0,0
214945305,0,0,0,0,0,0
214945744,0,0,0,0,0,0
214945769,0,0,0,0,0,0
214946465,0,0,0,0,0,0
214946876,0,0,0,0,0,0
214947018,0,0,0,0,0,0
214947517,0,0,0,0,0,0
214948160,0,0,0,0,0,0
214949273,0,0,0,0,0,0
214949388,0,0,0,0,0,0
214950207,0,0,0,0,0,0
214951008,0,0,0,0,0,0
214951576,0,0,0,0,0,0
214951999,0,0,0,0,0,0
214952289,0,0,0,0,0,0
214952303,0,0,0,0,0,0
214952351,0,0,0,0,0,0
214952951,0,0,0,0,0,0
214953320,0,0,0,0,0,0
214953343,0,0,0,0,0,0
214953483,0,0,0,0,0,0
214953592,0,0,0,0,0,0
214953607,0,0,0,0,0,0
214954235,0,0,0,0,0,0
214954403,0,0,0,0,0,0
214954446,0,0,0,0,0,0
214955207,0,0,0,0,0,0
214955384,0,0,0,0,0,0
214955712,0,0,0,0,0,0
214956260,0,0,0,0,0,0
214957337,0,0,0,0,0,0
214957349,0,0,0,0,0,0
214957515,0,0,0,0,0,0
214958258,0,0,0,0,0,1
214958379,0,0,0,0,0,0
214958656,0,0,0,0,0,0
214958958,0,0,0,0,0,0
214959370,0,0,0,0,0,0
214959373,0,0,0,0,0,0
214960550,0,0,0,0,0,0
214960825,0,0,0,0,0,0
214961418,0,0,0,0,0,0
214961434,0,0,0,0,0,0
214962044,0,0,0,0,0,0
214962433,0,0,0,0,0,0
214962835,0,0,0,0,0,0
214963500,0,0,0,0,0,0
214963538,0,0,0,0,0,0
214963551,0,0,0,0,0,0
214963629,0,0,0,0,0,0
214964166,0,0,0,0,0,0
214964243,0,0,0,0,0,0
214964279,0,0,0,0,0,0
214964410,0,0,0,0,0,0
214964652,0,0,0,0,0,0
214965024,0,0,0,0,0,0
214965287,0,0,0,0,0,0
214965346,0,0,0,0,0,0
214966173,0,0,0,0,0,0
214966188,0,0,0,0,0,0
214966299,0,0,0,0,0,0
214966512,0,0,0,0,0,0
214966552,0,0,0,0,0,0
214966578,0,0,0,0,0,0
214966811,0,0,0,0,0,0
214966899,0,0,0,0,0,0
214966911,0,0,0,0,0,0
214967315,0,0,0,0,0,0
214967599,0,0,0,0,0,0
214967600,0,0,0,0,0,0
214968129,0,0,0,0,0,0
214968919,0,0,0,0,0,0
214969616,0,0,0,0,0,0
214969646,0,0,0,0,0,0
214969797,0,0,0,0,0,0
214970491,0,0,0,0,0,0
214970619,0,0,0,0,0,0
214970898,0,0,0,0,0,0
214971167,0,0,0,0,0,0
214971243,0,0,0,0,0,0
214971925,0,0,0,0,0,0
214971949,0,0,0,0,0,0
214972384,0,0,0,0,0,0
214972583,0,0,0,0,0,0
214973054,0,0,0,0,0,0
214973524,0,0,0,0,0,0
214974083,0,0,0,0,0,0
214974687,0,0,0,0,0,0
214974695,0,0,0,0,0,0
214974706,0,0,0,0,0,0
214974729,0,0,0,0,0,0
214975017,0,0,0,0,0,0
214975488,0,0,0,0,0,0
214975809,0,0,0,0,0,0
214976130,0,0,0,0,0,0
214976136,0,0,0,0,0,0
214977619,0,0,0,0,0,0
214977710,0,0,0,0,0,0
214978105,0,0,0,0,0,0
214978134,0,0,0,0,0,0
214978171,0,0,0,0,0,0
214978407,0,0,0,0,0,0
214978512,0,0,0,0,0,0
214978617,0,0,0,0,0,0
214978675,0,0,0,0,0,0
214978686,0,0,0,0,0,0
214979988,0,0,0,0,0,0
214980090,0,0,0,0,0,0
214980342,0,0,0,0,0,0
214980891,0,0,0,0,0,0
214981057,0,0,0,0,0,0
214981182,0,0,0,0,0,0
214981595,0,0,0,0,0,0
214981714,0,0,0,0,0,0
214982127,0,0,0,0,0,0
214982481,0,0,0,0,0,0
214982523,0,0,0,0,0,0
214983069,0,0,0,0,0,0
214983398,0,0,0,0,0,0
214983566,0,0,0,0,0,0
214984247,0,0,0,0,0,0
214984368,0,0,0,0,0,0
214984413,0,0,0,0,0,0
214984450,0,0,0,0,0,0
214984995,0,0,0,0,0,0
214985152,0,0,0,0,0,0
214985597,0,0,0,0,0,0
214986049,0,0,0,0,0,0
214986066,0,0,0,0,0,0
214986516,0,0,0,0,0,0
214986845,0,0,0,0,0,0
214987073,0,0,0,0,0,0
214988009,0,0,0,0,0,0
214988217,0,0,0,0,0,0
214988454,0,0,0,0,0,0
214988783,0,0,0,0,0,0
214989195,0,0,0,0,0,0
214989463,0,0,0,0,0,0
214989547,0,0,0,0,0,0
214989877,0,0,0,0,0,0
214990230,0,0,0,0,0,0
214990609,0,0,0,0,0,0
214990877,0,0,0,0,0,0
214991787,0,0,0,0,0,0
214991972,0,0,0,0,0,0
214992603,0,0,0,0,0,0
214993191,0,0,0,0,0,0
214993201,0,0,0,0,0,0
214993478,0,0,0,0,0,0
214993554,0,0,0,0,0,0
214993953,0,0,0,0,0,0
214994497,0,0,0,0,0,0
214995161,0,0,0,0,0,0
214995181,0,0,0,0,0,0
214995210,0,0,0,0,0,0
214995367,0,0,0,0,0,0
214995418,0,0,0,0,0,0
214995513,0,0,0,0,0,0
214995539,0,0,0,0,0,0
214995725,0,0,0,0,0,0
214995859,0,0,0,0,0,0
214996054,0,0,0,0,0,0
214996466,0,0,0,0,0,0
214996521,0,0,0,0,0,0
214996829,0,0,0,0,0,0
214996860,0,0,0,0,0,0
214996946,0,0,0,0,0,0
214997033,0,0,0,0,0,0
214997663,0,0,0,0,0,0
214998078,0,0,0,0,0,0
214998334,0,0,0,0,0,0
214998748,0,0,0,0,0,0
214999032,0,0,0,0,0,0
214999205,0,0,0,0,0,0
214999688,0,0,0,0,0,0
215001263,0,0,0,0,0,0
215001531,0,0,0,0,0,0
215001550,0,0,0,0,0,0
215002639,0,0,0,0,0,0
215003124,0,0,0,0,0,0
215003523,0,0,0,0,0,0
215003701,0,0,0,0,0,0
215004454,0,0,0,0,0,0
215004557,0,0,0,0,0,0
215004972,0,0,0,0,0,0
215005045,0,0,0,0,0,0
215005097,0,0,0,0,0,0
215005633,0,0,0,0,0,0
215005665,0,0,0,0,0,0
215006033,0,0,0,0,0,0
215006356,0,0,0,0,0,0
215006505,0,0,0,0,0,0
215006767,0,0,0,0,0,0
215006985,0,0,0,0,0,0
215007531,0,0,0,0,0,0
215007638,0,0,0,0,0,0
215007713,0,0,0,0,0,0
215007812,0,0,0,0,0,0
215008529,0,0,0,0,0,0
215009062,0,0,0,0,0,0
215009601,0,0,0,0,0,0
215009650,0,0,0,0,0,0
215009730,0,0,0,0,0,0
215009992,0,0,0,0,0,0
215010512,0,0,0,0,0,0
215010711,0,0,0,0,0,0
215011080,0,0,0,0,0,0
215011159,0,0,0,0,0,0
215011342,0,0,0,0,0,0
215011470,0,0,0,0,0,0
215011492,0,0,0,0,0,0
215011570,0,0,0,0,0,0
215012004,0,0,0,0,0,0
215012124,0,0,0,0,0,0
215012395,0,0,0,0,0,0
215012498,0,0,0,0,0,0
215012534,0,0,0,0,0,0
215013406,0,0,0,0,0,0
215013553,0,0,0,0,0,0
215015086,0,0,0,0,0,0
215015689,0,0,0,0,0,0
215015971,0,0,0,0,0,0
215016406,0,0,0,0,0,0
215016531,0,0,0,0,0,0
215016661,0,0,0,0,0,0
215016867,0,0,0,0,0,0
215017104,0,0,0,0,0,0
215017506,0,0,0,0,0,0
215017539,0,0,0,0,0,0
215018356,0,0,0,0,0,0
215018444,0,0,0,0,0,0
215018455,0,0,0,0,0,0
215018574,0,0,0,0,0,0
215018909,0,0,0,0,0,0
215019647,0,0,0,0,0,0
215019779,0,0,0,0,0,0
215020088,0,0,0,0,0,0
215020262,0,0,0,0,0,0
215020330,0,0,0,0,0,0
215020450,0,0,0,0,0,0
215020831,0,0,0,0,0,0
215021102,0,0,0,0,0,0
215021180,0,0,0,0,0,0
215021544,0,0,0,0,0,0
215021667,0,0,0,0,0,0
215022152,0,0,0,0,0,0
215022195,0,0,0,0,0,0
215022804,0,0,0,0,0,0
215022918,0,0,0,0,0,0
215023077,0,0,0,0,0,0
215023286,0,0,0,0,0,0
215023959,0,0,0,0,0,0
215024198,0,0,0,0,0,0
215024794,0,0,0,0,0,0
215024887,0,0,0,0,0,0
215025083,0,0,0,0,0,0
215025317,0,0,0,0,0,0
215026078,0,0,0,0,0,0
215026097,0,0,0,0,0,0
215026229,0,0,0,0,0,0
215026913,0,0,0,0,0,0
215026952,0,0,0,0,0,0
215027024,0,0,0,0,0,0
215027267,0,0,0,0,0,0
215028005,0,0,0,0,0,0
215028707,0,0,0,0,0,0
215028709,0,0,0,0,0,0
215029339,0,0,0,0,0,0
215029571,0,0,0,0,0,0
215030059,0,0,0,0,0,0
215030092,0,0,0,0,0,0
215030652,0,0,0,0,0,0
215031406,0,0,0,0,0,0
215031620,0,0,0,0,0,0
215031992,0,0,0,0,0,0
215032305,0,0,0,0,0,0
215032459,0,0,0,0,0,0
215032955,0,0,0,0,0,0
215033106,0,0,0,0,0,0
215033167,0,0,0,0,0,0
215033273,0,0,0,0,0,0
215033445,0,0,0,0,0,0
215033683,0,0,0,0,0,0
215034067,0,0,0,0,0,0
215034101,0,0,0,0,0,0
215034147,0,0,0,0,0,0
215034202,0,0,0,0,0,0
215034326,0,0,0,0,0,0
215034457,0,0,0,0,0,0
215035469,0,0,0,0,0,0
215036222,0,0,0,0,0,0
215036394,0,0,0,0,0,0
215036507,0,0,0,0,0,0
215036681,0,0,0,0,0,0
215037341,0,0,0,0,0,0
215037518,0,0,0,0,0,0
215038313,0,0,0,0,0,0
215038586,0,0,0,0,0,0
215038905,0,0,0,0,0,0
215039063,0,0,0,0,0,0
215039088,0,0,0,0,0,0
215039301,0,0,0,0,0,0
215039386,0,0,0,0,0,0
215039435,0,0,0,0,0,0
215039506,0,0,0,0,0,0
215039579,0,0,0,0,0,0
215040614,0,0,0,0,0,0
215042679,0,0,0,0,0,0
215042775,0,0,0,0,0,0
215042843,0,0,0,0,0,0
215043113,0,0,0,0,0,0
215043204,0,0,0,0,0,0
215043440,0,0,0,0,0,0
215043839,0,0,0,0,0,0
215043884,0,0,0,0,0,0
215044182,0,0,0,0,0,0
215044443,0,0,0,0,0,0
215044466,0,0,0,0,0,0
215044616,0,0,0,0,0,0
215045170,0,0,0,0,0,0
215045286,0,0,0,0,0,0
215045650,0,0,0,0,0,0
215046523,0,0,0,0,0,0
215046798,0,0,0,0,0,0
215048449,0,0,0,0,0,0
215048665,0,0,0,0,0,0
215048913,0,0,0,0,0,0
215049290,0,0,0,0,0,0
215050021,0,0,0,0,0,0
215050200,0,0,0,0,0,0
215050244,0,0,0,0,0,0
215050459,0,0,0,0,0,0
215050948,0,0,0,0,0,0
215051231,0,0,0,0,0,0
215051620,0,0,0,0,0,0
215051949,0,0,0,0,0,0
215051970,0,0,0,0,0,0
215052171,0,0,0,0,0,0
215052292,0,0,0,0,0,0
215052769,0,0,0,0,0,0
215053252,0,0,0,0,0,0
215053785,0,0,0,0,0,0
215053841,0,0,0,0,0,0
215054349,0,0,0,0,0,0
215054924,0,0,0,0,0,0
215055157,0,0,0,0,0,0
215055883,0,0,0,0,0,0
215056211,0,0,0,0,0,0
215056886,0,0,0,0,0,0
215057628,0,0,0,0,0,0
215058043,0,0,0,0,0,0
215058765,0,0,0,0,0,0
215058882,0,0,0,0,0,0
215059079,0,0,0,0,0,0
215059208,0,0,0,0,0,0
215059400,0,0,0,0,0,0
215059864,0,0,0,0,0,0
215060000,0,0,0,0,0,0
215060057,0,0,0,0,0,0
215060072,0,0,0,0,0,0
215060163,0,0,0,0,0,0
215060583,0,0,0,0,0,0
215061442,0,0,0,0,0,0
215062054,0,0,0,0,0,0
215062576,0,0,0,0,0,0
215062777,0,0,0,0,0,0
215062834,0,0,0,0,0,0
215062896,0,0,0,0,0,0
215063494,0,0,0,0,0,0
215063598,0,0,0,0,0,0
215063701,0,0,0,0,0,0
215064245,0,0,0,0,0,0
215064246,0,0,0,0,0,0
215065481,0,0,0,0,0,0
215065492,0,0,0,0,0,0
215065770,0,0,0,0,0,0
215066068,0,0,0,0,0,0
215066244,0,0,0,0,0,0
215066398,0,0,0,0,0,0
215066411,0,0,0,0,0,0
215067213,0,0,0,0,0,0
215067393,0,0,0,0,0,0
215067465,0,0,0,0,0,0
215067774,0,0,0,0,0,0
215067962,0,0,0,0,0,0
215068647,0,0,0,0,0,0
215068735,0,0,0,0,0,0
215069099,0,0,0,0,0,0
215069706,0,0,0,0,0,0
215069921,0,0,0,0,0,0
215070080,0,0,0,0,0,0
215070142,0,0,0,0,0,0
215070260,0,0,0,0,0,0
215070568,0,0,0,0,0,0
215070816,0,0,0,0,0,0
215070972,0,0,0,0,0,0
215071178,0,0,0,0,0,0
215072437,0,0,0,0,0,0
215072946,0,0,0,0,0,0
215073371,0,0,0,0,0,0
215075067,0,0,0,0,0,0
215075616,0,0,0,0,0,0
215075780,0,0,0,0,0,0
215076352,0,0,0,0,0,0
215076645,0,0,0,0,0,0
215076815,0,0,0,0,0,0
215076898,0,0,0,0,0,0
215077357,0,0,0,0,0,0
215077609,0,0,0,0,0,0
215077652,0,0,0,0,0,0
215078060,0,0,0,0,0,0
215078215,0,0,0,0,0,0
215078425,0,0,0,0,0,0
215078516,0,0,0,0,0,0
215078711,0,0,0,0,0,0
215078836,0,0,0,0,0,0
215078844,0,0,0,0,0,0
215078905,0,0,0,0,0,0
215078929,0,0,0,0,0,0
215078939,0,0,0,0,0,0
215078978,0,0,0,0,0,0
215079061,0,0,0,0,0,0
215079104,0,0,0,0,0,0
215079348,0,0,0,0,0,0
215079379,0,0,0,0,0,0
215079410,0,0,0,0,0,0
215079599,0,0,0,0,0,0
215080165,0,0,0,0,0,0
215080287,0,0,0,0,0,0
215080701,0,0,0,0,0,0
215081461,0,0,0,0,0,0
215081829,0,0,0,0,0,0
215082072,0,0,0,0,0,0
215083448,0,0,0,0,0,0
215083805,0,0,0,0,0,0
215083944,0,0,0,0,0,0
215084111,0,0,0,0,0,0
215084401,0,0,0,0,0,0
215084562,0,0,0,0,0,0
215084675,0,0,0,0,0,0
215084941,0,0,0,0,0,0
215085499,0,0,0,0,0,0
215085535,0,0,0,0,0,0
215085949,0,0,0,0,0,0
215086701,0,0,0,0,0,0
215087177,0,0,0,0,0,0
215087461,0,0,0,0,0,0
215087855,0,0,0,0,0,0
215087961,0,0,0,0,0,0
215088152,0,0,0,0,0,0
215088259,0,0,0,0,0,0
215088328,0,0,0,0,0,0
215088415,0,0,0,0,0,0
215088581,0,0,0,0,0,0
215088905,0,0,0,0,0,0
215089170,0,0,0,0,0,0
215089221,0,0,0,0,0,0
215089329,0,0,0,0,0,0
215089364,0,0,0,0,0,0
215089436,0,0,0,0,0,0
215089541,0,0,0,0,0,0
215089789,0,0,0,0,0,0
215089880,0,0,0,0,0,0
215090200,0,0,0,0,0,0
215090278,0,0,0,0,0,0
215090356,0,0,0,0,0,0
215090390,0,0,0,0,0,0
215090404,0,0,0,0,0,0
215090439,0,0,0,0,0,0
215090633,0,0,0,0,0,0
215091088,0,0,0,0,0,0
215091296,0,0,0,0,0,0
215091508,0,0,0,0,0,0
215092148,0,0,0,0,0,0
215092603,0,0,0,0,0,0
215093050,0,0,0,0,0,0
215093195,0,0,0,0,0,0
215093521,0,0,0,0,0,0
215094557,0,0,0,0,0,0
215095534,0,0,0,0,0,0
215095730,0,0,0,0,0,0
215095891,0,0,0,0,0,0
215095982,0,0,0,0,0,0
215096532,0,0,0,0,0,0
215096539,0,0,0,0,0,0
215096679,0,0,0,0,0,0
215096838,0,0,0,0,0,0
215096975,0,0,0,0,0,0
215097377,0,0,0,0,0,0
215097432,0,0,0,0,0,0
215097541,0,0,0,0,0,0
215097604,0,0,0,0,0,0
215097859,0,0,0,0,0,0
215097921,0,0,0,0,0,0
215097931,0,0,0,0,0,0
215097937,0,0,0,0,0,0
215098153,0,0,0,0,0,0
215098286,0,0,0,0,0,0
215098402,0,0,0,0,0,0
215098896,0,0,0,0,0,0
215099004,0,0,0,0,0,0
215099477,0,0,0,0,0,0
215099592,0,0,0,0,0,0
215099704,0,0,0,0,0,0
215100153,0,0,0,0,0,0
215100834,0,0,0,0,0,0
215101022,0,0,0,0,0,0
215101226,0,0,0,0,0,0
215101306,0,0,0,0,0,0
215101972,0,0,0,0,0,0
215102226,0,0,0,0,0,0
215102477,0,0,0,0,0,0
215102573,0,0,0,0,0,0
215103013,0,0,0,0,0,0
215103165,0,0,0,0,0,0
215104327,0,0,0,0,0,0
215104732,0,0,0,0,0,0
215105297,0,0,0,0,0,0
215106270,0,0,0,0,0,0
215106397,0,0,0,0,0,0
215106445,0,0,0,0,0,0
215107204,0,0,0,0,0,0
215108015,0,0,0,0,0,0
215108081,0,0,0,0,0,0
215108200,0,0,0,0,0,0
215108211,0,0,0,0,0,0
215108241,0,0,0,0,0,0
215108733,0,0,0,0,0,0
215108815,0,0,0,0,0,0
215109424,0,0,0,0,0,0
215109618,0,0,0,0,0,0
215109847,0,0,0,0,0,0
215109926,0,0,0,0,0,0
215110211,0,0,0,0,0,0
215110813,0,0,0,0,0,0
215110947,0,0,0,0,0,0
215111017,0,0,0,0,0,0
215111655,0,0,0,0,0,0
215112261,0,0,0,0,0,0
215113534,0,0,0,0,0,0
215113616,0,0,0,0,0,0
215113691,0,0,0,0,0,0
215113785,0,0,0,0,0,0
215113944,0,0,0,0,0,0
215114429,0,0,0,0,0,0
215114864,0,0,0,0,0,0
215115111,0,0,0,0,0,0
215115186,0,0,0,0,0,0
215115323,0,0,0,0,0,0
215115651,0,0,0,0,0,0
215116013,0,0,0,0,0,0
215116033,0,0,0,0,0,0
215116048,0,0,0,0,0,0
215116629,0,0,0,0,0,0
215116778,0,0,0,0,0,0
215116785,0,0,0,0,0,0
215116967,0,0,0,0,0,0
215117265,0,0,0,0,0,0
215117345,0,0,0,0,0,0
215117509,0,0,0,0,0,0
215117843,0,0,0,0,0,0
215117972,0,0,0,0,0,0
215117995,0,0,0,0,0,0
215118116,0,0,0,0,0,0
215118450,0,0,0,0,0,0
215118502,0,0,0,0,0,0
215118853,0,0,0,0,0,0
215118957,0,0,0,0,0,0
215119006,0,0,0,0,0,0
215119071,0,0,0,0,0,0
215119124,0,0,0,0,0,0
215119160,0,0,0,0,0,0
215119182,0,0,0,0,0,0
215119204,0,0,0,0,0,0
215119305,0,0,0,0,0,0
215119717,0,0,0,0,0,0
215119828,0,0,0,0,0,0
215120063,0,0,0,0,0,0
215120293,0,0,0,0,0,0
215120576,0,0,0,0,0,0
215121033,0,0,0,0,0,0
215121497,0,0,0,0,0,0
215121823,0,0,0,0,0,0
215121853,0,0,0,0,0,0
215121921,0,0,0,0,0,0
215122070,0,0,0,0,0,0
215122161,0,0,0,0,0,0
215122424,0,0,0,0,0,0
215123620,0,0,0,0,0,0
215124670,0,0,0,0,0,0
215124740,0,0,0,0,0,0
215124840,0,0,0,0,0,0
215124856,0,0,0,0,0,0
215125108,0,0,0,0,0,0
215125394,0,0,0,0,0,0
215125458,0,0,0,0,0,0
215125608,0,0,0,0,0,0
215125637,0,0,0,0,0,0
215126408,0,0,0,0,0,0
215127095,0,0,0,0,0,0
215127406,0,0,0,0,0,0
215127730,0,0,0,0,0,0
215128615,0,0,0,0,0,0
215128851,0,0,0,0,0,0
215129421,0,0,0,0,0,0
215129428,0,0,0,0,0,0
215129606,0,0,0,0,0,0
215130232,0,0,0,0,0,0
215130388,0,0,0,0,0,0
215131252,0,0,0,0,0,0
215131703,0,0,0,0,0,0
215131959,0,0,0,0,0,0
215132034,0,0,0,0,0,0
215132243,0,0,0,0,0,0
215132699,0,0,0,0,0,0
215132772,0,0,0,0,0,0
215132820,0,0,0,0,0,0
215133422,0,0,0,0,0,0
215134020,0,0,0,0,0,0
215134083,0,0,0,0,0,0
215134739,0,0,0,0,0,0
215134824,0,0,0,0,0,0
215135397,0,0,0,0,0,0
215135814,0,0,0,0,0,0
215136079,0,0,0,0,0,0
215136205,0,0,0,0,0,0
215136736,0,0,0,0,0,0
215137144,0,0,0,0,0,0
215137287,0,0,0,0,0,0
215137783,0,0,0,0,0,0
215137800,0,0,0,0,0,0
215138606,0,0,0,0,0,0
215138793,0,0,0,0,0,0
215138812,0,0,0,0,0,0
215139173,0,0,0,0,0,0
215139426,0,0,0,0,0,0
215139775,0,0,0,0,0,0
215140107,0,0,0,0,0,0
215140150,0,0,0,0,0,0
215141320,0,0,0,0,0,0
215141627,0,0,0,0,0,0
215141874,0,0,0,0,0,0
215142268,0,0,0,0,0,0
215142912,0,0,0,0,0,0
215142916,0,0,0,0,0,0
215143008,0,0,0,0,0,0
215143026,0,0,0,0,0,0
215143501,0,0,0,0,0,0
215143560,0,0,0,0,0,0
215143706,0,0,0,0,0,0
215143838,0,0,0,0,0,0
215144048,0,0,0,0,0,0
215144248,0,0,0,0,0,0
215144742,0,0,0,0,0,0
215145020,0,0,0,0,0,0
215145046,0,0,0,0,0,0
215145088,0,0,0,0,0,0
215145342,0,0,0,0,0,0
215145622,0,0,0,0,0,0
215145633,0,0,0,0,0,0
215145663,0,0,0,0,0,0
215146010,0,0,0,0,0,0
215146020,0,0,0,0,0,0
215146061,0,0,0,0,0,0
215146346,0,0,0,0,0,0
215146402,0,0,0,0,0,0
215146772,0,0,0,0,0,0
215146800,0,0,0,0,0,0
215147780,0,0,0,0,0,0
215147965,0,0,0,0,0,0
215147969,0,0,0,0,0,0
215148079,0,0,0,0,0,0
215148133,0,0,0,0,0,0
215148181,0,0,0,0,0,0
215148220,0,0,0,0,0,0
215148250,0,0,0,0,0,0
215148735,0,0,0,0,0,0
215149274,0,0,0,0,0,0
215149821,0,0,0,0,0,0
215150031,0,0,0,0,0,0
215150068,0,0,0,0,0,0
215150474,0,0,0,0,0,0
215150538,0,0,0,0,0,0
215150688,0,0,0,0,0,0
215150788,0,0,0,0,0,0
215151323,0,0,0,0,0,0
215151872,0,0,0,0,0,0
215152042,0,0,0,0,0,0
215152389,0,0,0,0,0,0
215152438,0,0,0,0,0,0
215152554,0,0,0,0,0,0
215152628,0,0,0,0,0,0
215153519,0,0,0,0,0,0
215153870,0,0,0,0,0,0
215155229,0,0,0,0,0,0
215155802,0,0,0,0,0,0
215156339,0,0,0,0,0,0
215156631,0,0,0,0,0,0
215156905,0,0,0,0,0,0
215156974,0,0,0,0,0,0
215158133,0,0,0,0,0,0
215158434,0,0,0,0,0,0
215158543,0,0,0,0,0,0
215158928,0,0,0,0,0,0
215159358,0,0,0,0,0,0
215159395,0,0,0,0,0,0
215159946,0,0,0,0,0,0
215160040,0,0,0,0,0,0
215160161,0,0,0,0,0,0
215160373,0,0,0,0,0,0
215160377,0,0,0,0,0,0
215160606,0,0,0,0,0,0
215160709,0,0,0,0,0,0
215160968,0,0,0,0,0,0
215161605,0,0,0,0,0,0
215162241,0,0,0,0,0,0
215162335,0,0,0,0,0,0
215162843,0,0,0,0,0,0
215163193,0,0,0,0,0,0
215163214,0,0,0,0,0,0
215163244,0,0,0,0,0,0
215163350,0,0,0,0,0,0
215163750,0,0,0,0,0,0
215163858,0,0,0,0,0,0
215164258,0,0,0,0,0,0
215164548,0,0,0,0,0,0
215164871,0,0,0,0,0,0
215165152,0,0,0,0,0,0
215165759,0,0,0,0,0,0
215165832,0,0,0,0,0,0
215166090,0,0,0,0,0,0
215166093,0,0,0,0,0,0
215167103,0,0,0,0,0,0
215167352,0,0,0,0,0,0
215167773,0,0,0,0,0,0
215167834,0,0,0,0,0,0
215168399,0,0,0,0,0,0
215169896,0,0,0,0,0,0
215170298,0,0,0,0,0,0
215170340,0,0,0,0,0,0
215170377,0,0,0,0,0,0
215170578,0,0,0,0,0,0
215172375,0,0,0,0,0,0
215172467,0,0,0,0,0,0
215172531,0,0,0,0,0,0
215172642,0,0,0,0,0,0
215172751,0,0,0,0,0,0
215173138,0,0,0,0,0,0
215173525,0,0,0,0,0,0
215173738,0,0,0,0,0,0
215174442,0,0,0,0,0,0
215174553,0,0,0,0,0,0
215174656,0,0,0,0,0,1
215174683,0,0,0,0,0,0
215174924,0,0,0,0,0,0
215175194,0,0,0,0,0,0
215175279,0,0,0,0,0,0
215175768,0,0,0,0,0,0
215176116,0,0,0,0,0,0
215176126,0,0,0,0,0,0
215176659,0,0,0,0,0,0
215176802,0,0,0,0,0,0
215177167,0,0,0,0,0,0
215177305,0,0,0,0,0,0
215177413,0,0,0,0,0,0
215177423,0,0,0,0,0,0
215178283,0,0,0,0,0,0
215178405,0,0,0,0,0,0
215178664,0,0,0,0,0,0
215179614,0,0,0,0,0,0
215179688,0,0,0,0,0,0
215179731,0,0,0,0,0,0
215179951,0,0,0,0,0,0
215180057,0,0,0,0,0,0
215181454,0,0,0,0,0,0
215181980,0,0,0,0,0,0
215182235,0,0,0,0,0,0
215182242,0,0,0,0,0,0
215182477,0,0,0,0,0,0
215182506,0,0,0,0,0,0
215182591,0,0,0,0,0,0
215182760,0,0,0,0,0,0
215183119,0,0,0,0,0,0
215183793,0,0,0,0,0,0
215184102,0,0,0,0,0,0
215184436,0,0,0,0,0,0
215184643,0,0,0,0,0,0
215185023,0,0,0,0,0,0
215185245,0,0,0,0,0,0
215185789,0,0,0,0,0,0
215186425,0,0,0,0,0,0
215186619,0,0,0,0,0,0
215187423,0,0,0,0,0,0
215187516,0,0,0,0,0,0
215188538,0,0,0,0,0,0
215189068,0,0,0,0,0,0
215189168,0,0,0,0,0,0
215189249,0,0,0,0,0,0
215189421,0,0,0,0,0,0
215189451,0,0,0,0,0,0
215189500,0,0,0,0,0,0
215189717,0,0,0,0,0,0
215190060,0,0,0,0,0,0
215190377,0,0,0,0,0,0
215190497,0,0,0,0,0,0
215190952,0,0,0,0,0,0
215191010,0,0,0,0,0,0
215191085,0,0,0,0,0,0
215191359,0,0,0,0,0,0
215191863,0,0,0,0,0,0
215192232,0,0,0,0,0,0
215192446,0,0,0,0,0,0
215192451,0,0,0,0,0,0
215193020,0,0,0,0,0,0
215193126,0,0,0,0,0,0
215193624,0,0,0,0,0,0
215194403,0,0,0,0,0,0
215194442,0,0,0,0,0,0
215194679,0,0,0,0,0,0
215194864,0,0,0,0,0,0
215195477,0,0,0,0,0,0
215195958,0,0,0,0,0,0
215196121,0,0,0,0,0,0
215196646,0,0,0,0,0,0
215197083,0,0,0,0,0,0
215197521,0,0,0,0,0,0
215197935,0,0,0,0,0,0
215198126,0,0,0,0,0,0
215198399,0,0,0,0,0,0
215198491,0,0,0,0,0,0
215198521,0,0,0,0,0,0
215198612,0,0,0,0,0,0
215198703,0,0,0,0,0,0
215198923,0,0,0,0,0,0
215199190,0,0,0,0,0,0
215199595,0,0,0,0,0,0
215200101,0,0,0,0,0,0
215201629,0,0,0,0,0,0
215202298,0,0,0,0,0,0
215202436,0,0,0,0,0,0
215203349,0,0,0,0,0,0
215203383,0,0,0,0,0,0
215203566,0,0,0,0,0,0
215204536,0,0,0,0,0,0
215205125,0,0,0,0,0,0
215205413,0,0,0,0,0,0
215205804,0,0,0,0,0,0
215205864,0,0,0,0,0,0
215207387,0,0,0,0,0,0
215207542,0,0,0,0,0,0
215208923,0,0,0,0,0,0
215208958,0,0,0,0,0,0
215209483,0,0,0,0,0,0
215210388,0,0,0,0,0,0
215210486,0,0,0,0,0,0
215210993,0,0,0,0,0,0
215211410,0,0,0,0,0,0
215211821,0,0,0,0,0,0
215211884,0,0,0,0,0,0
215212342,0,0,0,0,0,0
215212389,0,0,0,0,0,0
215213220,0,0,0,0,0,0
215213372,0,0,0,0,0,0
215213784,0,0,0,0,0,0
215213955,0,0,0,0,0,0
215214095,0,0,0,0,0,0
215214211,0,0,0,0,0,0
215214294,0,0,0,0,0,0
215215188,0,0,0,0,0,0
215216543,0,0,0,0,0,0
215217464,0,0,0,0,0,0
215217851,0,0,0,0,0,0
215217998,0,0,0,0,0,0
215218035,0,0,0,0,0,0
215218410,0,0,0,0,0,0
215218534,0,0,0,0,0,0
215219317,0,0,0,0,0,0
215219987,0,0,0,0,0,0
215220240,0,0,0,0,0,0
215220546,0,0,0,0,0,0
215220618,0,0,0,0,0,0
215220647,0,0,0,0,0,0
215220697,0,0,0,0,0,0
215221083,0,0,0,0,0,0
215221517,0,0,0,0,0,0
215222094,0,0,0,0,0,0
215222163,0,0,0,0,0,0
215222574,0,0,0,0,0,0
215222742,0,0,0,0,0,0
215224082,0,0,0,0,0,0
215224178,0,0,0,0,0,1
215224181,0,0,0,0,0,0
215224301,0,0,0,0,0,0
215224528,0,0,0,0,0,0
215224592,0,0,0,0,0,0
215225057,0,0,0,0,0,0
215225387,0,0,0,0,0,0
215225447,0,0,0,0,0,0
215226271,0,0,0,0,0,0
215226408,0,0,0,0,0,0
215226491,0,0,0,0,0,0
215226567,0,0,0,0,0,0
215226992,0,0,0,0,0,0
215227524,0,0,0,0,0,0
215228133,0,0,0,0,0,0
215228179,0,0,0,0,0,0
215228182,0,0,0,0,0,0
215228239,0,0,0,0,0,0
215228316,0,0,0,0,0,0
215228551,0,0,0,0,0,0
215229398,0,0,0,0,0,0
215229731,0,0,0,0,0,0
215229831,0,0,0,0,0,0
215229907,0,0,0,0,0,0
215229946,0,0,0,0,0,0
215230196,0,0,0,0,0,0
215230503,0,0,0,0,0,0
215230773,0,0,0,0,0,0
215230824,0,0,0,0,0,0
215231055,0,0,0,0,0,0
215231193,0,0,0,0,0,0
215231477,0,0,0,0,0,0
215231493,0,0,0,0,0,0
215231541,0,0,0,0,0,0
215231627,0,0,0,0,0,0
215231708,0,0,0,0,0,0
215232113,0,0,0,0,0,0
215232357,0,0,0,0,0,0
215232551,0,0,0,0,0,0
215233130,0,0,0,0,0,0
215233254,0,0,0,0,0,0
215233461,0,0,0,0,0,0
215233695,0,0,0,0,0,0
215233792,0,0,0,0,0,0
215233916,0,0,0,0,0,0
215234101,0,0,0,0,0,0
215234690,0,0,0,0,0,0
215235177,0,0,0,0,0,0
215235354,0,0,0,0,0,0
215236056,0,0,0,0,0,0
215237468,0,0,0,0,0,0
215237710,0,0,0,0,0,0
215238089,0,0,0,0,0,0
215238110,0,0,0,0,0,0
215239073,0,0,0,0,0,0
215239086,0,0,0,0,0,0
215239973,0,0,0,0,0,0
215240194,0,0,0,0,0,0
215240409,0,0,0,0,0,0
215240564,0,0,0,0,0,0
215240598,0,0,0,0,0,0
215241415,0,0,0,0,0,0
215241663,0,0,0,0,0,0
215241706,0,0,0,0,0,0
215242685,0,0,0,0,0,0
215242775,0,0,0,0,0,0
215243067,0,0,0,0,0,0
215243611,0,0,0,0,0,0
215243987,0,0,0,0,0,0
215244031,0,0,0,0,0,0
215244209,0,0,0,0,0,0
215244433,0,0,0,0,0,0
215244436,0,0,0,0,0,0
215244473,0,0,0,0,0,0
215244736,0,0,0,0,0,0
215245544,0,0,0,0,0,0
215245891,0,0,0,0,0,0
215245911,0,0,0,0,0,0
215246344,0,0,0,0,0,0
215246618,0,0,0,0,0,0
215246676,0,0,0,0,0,0
215247662,0,0,0,0,0,0
215247668,0,0,0,0,0,0
215247776,0,0,0,0,0,0
215248975,0,0,0,0,0,0
215249249,0,0,0,0,0,0
215249286,0,0,0,0,0,0
215249419,0,0,0,0,0,0
215249597,0,0,0,0,0,0
215250088,0,0,0,0,0,0
215250315,0,0,0,0,0,0
215250760,0,0,0,0,0,0
215250843,0,0,0,0,0,0
215250902,0,0,0,0,0,0
215251069,0,0,0,0,0,0
215251370,0,0,0,0,0,0
215251439,0,0,0,0,0,0
215251620,0,0,0,0,0,0
215252993,0,0,0,0,0,0
215253051,0,0,0,0,0,0
215253129,0,0,0,0,0,0
215253157,0,0,0,0,0,0
215253246,0,0,0,0,0,0
215253417,0,0,0,0,0,0
215253565,0,0,0,0,0,0
215253729,0,0,0,0,0,0
215253978,0,0,0,0,0,0
215254787,0,0,0,0,0,0
215255167,0,0,0,0,0,0
215255702,0,0,0,0,0,0
215255716,0,0,0,0,0,0
215256225,0,0,0,0,0,0
215256354,0,0,0,0,0,0
215256531,0,0,0,0,0,0
215257011,0,0,0,0,0,0
215257225,0,0,0,0,0,0
215257394,0,0,0,0,0,0
215258004,0,0,0,0,0,0
215258059,0,0,0,0,0,0
215258203,0,0,0,0,0,0
215258496,0,0,0,0,0,0
215258606,0,0,0,0,0,0
215259114,0,0,0,0,0,0
215259877,0,0,0,0,0,0
215260562,0,0,0,0,0,0
215260673,0,0,0,0,0,0
215261057,0,0,0,0,0,0
215261741,0,0,0,0,0,0
215262272,0,0,0,0,0,0
215262360,0,0,0,0,0,0
215262509,0,0,0,0,0,0
215262517,0,0,0,0,0,0
215263029,0,0,0,0,0,0
215263840,0,0,0,0,0,0
215263842,0,0,0,0,0,0
215264067,0,0,0,0,0,0
215264131,0,0,0,0,0,0
215264552,0,0,0,0,0,0
215266868,0,0,0,0,0,0
215267267,0,0,0,0,0,0
215267848,0,0,0,0,0,0
215268471,0,0,0,0,0,0
215268754,0,0,0,0,0,0
215268814,0,0,0,0,0,0
215269254,0,0,0,0,0,0
215269888,0,0,0,0,0,0
215270181,0,0,0,0,0,0
215270878,0,0,0,0,0,0
215271112,0,0,0,0,0,0
215271409,0,0,0,0,0,0
215271840,0,0,0,0,0,0
215271963,0,0,0,0,0,0
215272026,0,0,0,0,0,0
215272461,0,0,0,0,0,0
215272651,0,0,0,0,0,0
215272724,0,0,0,0,0,0
215273257,0,0,0,0,0,0
215273424,0,0,0,0,0,0
215273520,0,0,0,0,0,0
215273579,0,0,0,0,0,0
215273705,0,0,0,0,0,0
215274081,0,0,0,0,0,0
215274568,0,0,0,0,0,0
215274794,0,0,0,0,0,0
215275650,0,0,0,0,0,0
215275900,0,0,0,0,0,0
215276125,0,0,0,0,0,0
215276132,0,0,0,0,0,0
215276566,0,0,0,0,0,0
215276895,0,0,0,0,0,0
215277397,0,0,0,0,0,0
215278335,0,0,0,0,0,0
215278567,0,0,0,0,0,0
215278852,0,0,0,0,0,0
215279085,0,0,0,0,0,0
215279302,0,0,0,0,0,0
215279360,0,0,0,0,0,0
215279491,0,0,0,0,0,0
215279651,0,0,0,0,0,0
215279815,0,0,0,0,0,0
215280071,0,0,0,0,0,0
215280568,0,0,0,0,0,0
215280702,0,0,0,0,0,0
215280752,0,0,0,0,0,0
215282648,0,0,0,0,0,0
215282893,0,0,0,0,0,0
215283116,0,0,0,0,0,0
215283248,0,0,0,0,0,0
215283909,0,0,0,0,0,0
215284281,0,0,0,0,0,0
215285374,0,0,0,0,0,0
215285625,0,0,0,0,0,0
215286163,0,0,0,0,0,0
215287029,0,0,0,0,0,0
215287068,0,0,0,0,0,0
215287295,0,0,0,0,0,0
215287710,0,0,0,0,0,0
215288116,0,0,0,0,0,0
215290008,0,0,0,0,0,0
215290730,0,0,0,0,0,0
215290790,0,0,0,0,0,0
215291246,0,0,0,0,0,0
215291464,0,0,0,0,0,0
215291602,0,0,0,0,0,0
215291783,0,0,0,0,0,0
215291894,0,0,0,0,0,0
215292758,0,0,0,0,0,0
215292923,0,0,0,0,0,0
215293292,0,0,0,0,0,0
215293549,0,0,0,0,0,0
215293618,0,0,0,0,0,0
215293748,0,0,0,0,0,0
215294079,0,0,0,0,0,0
215294197,0,0,0,0,0,0
215294695,0,0,0,0,0,0
215294818,0,0,0,0,0,0
215294977,0,0,0,0,0,0
215295239,0,0,0,0,0,0
215295863,0,0,0,0,0,0
215296461,0,0,0,0,0,0
215296463,0,0,0,0,0,0
215296914,0,0,0,0,0,0
215298993,0,0,0,0,0,0
215298997,0,0,0,0,0,0
215299132,0,0,0,0,0,0
215299214,0,0,0,0,0,0
215299218,0,0,0,0,0,0
215299638,0,0,0,0,0,0
215299749,0,0,0,0,0,0
215299931,0,0,0,0,0,0
215300066,0,0,0,0,0,0
215300410,0,0,0,0,0,0
215300596,0,0,0,0,0,0
215301859,0,0,0,0,0,0
215302733,0,0,0,0,0,0
215302853,0,0,0,0,0,0
215303361,0,0,0,0,0,0
215304238,0,0,0,0,0,0
215304727,0,0,0,0,0,0
215305195,0,0,0,0,0,0
215305481,0,0,0,0,0,0
215306144,0,0,0,0,0,0
215306689,0,0,0,0,0,0
215307346,0,0,0,0,0,0
215307955,0,0,0,0,0,0
215308006,0,0,0,0,0,0
215308081,0,0,0,0,0,0
215308490,0,0,0,0,0,0
215309231,0,0,0,0,0,0
215309461,0,0,0,0,0,0
215309591,0,0,0,0,0,0
215310672,0,0,0,0,0,0
215311235,0,0,0,0,0,0
215311402,0,0,0,0,0,0
215311403,0,0,0,0,0,0
215312258,0,0,0,0,0,0
215313107,0,0,0,0,0,0
215314001,0,0,0,0,0,0
215314241,0,0,0,0,0,0
215314441,0,0,0,0,0,0
215316277,0,0,0,0,0,0
215316637,0,0,0,0,0,0
215316729,0,0,0,0,0,0
215316901,0,0,0,0,0,0
215317018,0,0,0,0,0,0
215317168,0,0,0,0,0,0
215317333,0,0,0,0,0,0
215318116,0,0,0,0,0,0
215318735,0,0,0,0,0,0
215319310,0,0,0,0,0,0
215320154,0,0,0,0,0,0
215320416,0,0,0,0,0,0
215321567,0,0,0,0,0,0
215322218,0,0,0,0,0,0
215323207,0,0,0,0,0,0
215324229,0,0,0,0,0,0
215325007,0,0,0,0,0,0
215325240,0,0,0,0,0,0
215326212,0,0,0,0,0,0
215327324,0,0,0,0,0,0
215328786,0,0,0,0,0,0
215328813,0,0,0,0,0,0
215328842,0,0,0,0,0,0
215328871,0,0,0,0,0,0
215329219,0,0,0,0,0,0
215329358,0,0,0,0,0,0
215329782,0,0,0,0,0,0
215330354,0,0,0,0,0,0
215331615,0,0,0,0,0,0
215331808,0,0,0,0,0,0
215332263,0,0,0,0,0,0
215332436,0,0,0,0,0,0
215333439,0,0,0,0,0,0
215333720,0,0,0,0,0,0
215334073,0,0,0,0,0,0
215334491,0,0,0,0,0,0
215334986,0,0,0,0,0,0
215335272,0,0,0,0,0,0
215335638,0,0,0,0,0,0
215336225,0,0,0,0,0,0
215336854,0,0,0,0,0,0
215337658,0,0,0,0,0,0
215337676,0,0,0,0,0,0
215337766,0,0,0,0,0,0
215338266,0,0,0,0,0,0
215339723,0,0,0,0,0,0
215339919,0,0,0,0,0,0
215340429,0,0,0,0,0,0
215340513,0,0,0,0,0,0
215340911,0,0,0,0,0,0
215341210,0,0,0,0,0,0
215341701,0,0,0,0,0,0
215342290,0,0,0,0,0,0
215342468,0,0,0,0,0,0
215343309,0,0,0,0,0,0
215343379,0,0,0,0,0,0
215343459,0,0,0,0,0,0
215343469,0,0,0,0,0,0
215343946,0,0,0,0,0,0
215344567,0,0,0,0,0,0
215345033,0,0,0,0,0,0
215345594,0,0,0,0,0,0
215345919,0,0,0,0,0,0
215346008,0,0,0,0,0,0
215346411,0,0,0,0,0,0
215346649,0,0,0,0,0,0
215347237,0,0,0,0,0,0
215347590,0,0,0,0,0,0
215348960,0,0,0,0,0,0
215349172,0,0,0,0,0,0
215349258,0,0,0,0,0,0
215349657,0,0,0,0,0,0
215350154,0,0,0,0,0,0
215350435,0,0,0,0,0,0
215350889,0,0,0,0,0,0
215351040,0,0,0,0,0,0
215351162,0,0,0,0,0,0
215351441,0,0,0,0,0,0
215351520,0,0,0,0,0,0
215352337,0,0,0,0,0,0
215353000,0,0,0,0,0,0
215353267,0,0,0,0,0,0
215353502,0,0,0,0,0,0
215353785,0,0,0,0,0,0
215354241,0,0,0,0,0,0
215354416,0,0,0,0,0,0
215355157,0,0,0,0,0,0
215355401,0,0,0,0,0,0
215355958,0,0,0,0,0,0
215356661,0,0,0,0,0,0
215356698,0,0,0,0,0,0
215357110,0,0,0,0,0,0
215357353,0,0,0,0,0,0
215358688,0,0,0,0,0,0
215360036,0,0,0,0,0,0
215361454,0,0,0,0,0,0
215362253,0,0,0,0,0,0
215362408,0,0,0,0,0,0
215362507,0,0,0,0,0,0
215363496,0,0,0,0,0,0
215363539,0,0,0,0,0,0
215363903,0,0,0,0,0,0
215364084,0,0,0,0,0,0
215364090,0,0,0,0,0,0
215364388,0,0,0,0,0,0
215364711,0,0,0,0,0,0
215364806,0,0,0,0,0,0
215365193,0,0,0,0,0,0
215365337,0,0,0,0,0,0
215365865,0,0,0,0,0,0
215366494,0,0,0,0,0,0
215367533,0,0,0,0,0,0
215367823,0,0,0,0,0,0
215368033,0,0,0,0,0,0
215368394,0,0,0,0,0,0
215368435,0,0,0,0,0,0
215368976,0,0,0,0,0,0
215369032,0,0,0,0,0,0
215369749,0,0,0,0,0,0
215369800,0,0,0,0,0,0
215370513,0,0,0,0,0,0
215370945,0,0,0,0,0,0
215371839,0,0,0,0,0,0
215372787,0,0,0,0,0,0
215373042,0,0,0,0,0,0
215373606,0,0,0,0,0,0
215374090,0,0,0,0,0,0
215375466,0,0,0,0,0,0
215376222,0,0,0,0,0,0
215376352,0,0,0,0,0,0
215377653,0,0,0,0,0,0
215377943,0,0,0,0,0,0
215377963,0,0,0,0,0,0
215378768,0,0,0,0,0,0
215379049,0,0,0,0,0,0
215380154,0,0,0,0,0,0
215380807,0,0,0,0,0,0
215381481,0,0,0,0,0,0
215381672,0,0,0,0,0,0
215382648,0,0,0,0,0,0
215383079,0,0,0,0,0,0
215384682,0,0,0,0,0,0
215385238,0,0,0,0,0,0
215385623,0,0,0,0,0,0
215386288,0,0,0,0,0,0
215387397,0,0,0,0,0,0
215388243,0,0,0,0,0,0
215388788,0,0,0,0,0,0
215389578,0,0,0,0,0,0
215389601,0,0,0,0,0,0
215390455,0,0,0,0,0,0
215395994,0,0,0,0,0,0
215396408,0,0,0,0,0,0
215397054,0,0,0,0,0,0
215398798,0,0,0,0,0,0
215399913,0,0,0,0,0,0
215401962,0,0,0,0,0,0
215402354,0,0,0,0,0,0
215403005,0,0,0,0,0,0
215403810,0,0,0,0,0,0
215405152,0,0,0,0,0,0
215406756,0,0,0,0,0,0
215406822,0,0,0,0,0,0
215407335,0,0,0,0,0,0
215408714,0,0,0,0,0,0
215409188,0,0,0,0,0,0
215409797,0,0,0,0,0,0
215411780,0,0,0,0,0,0
215411991,0,0,0,0,0,0
215412130,0,0,0,0,0,0
215412248,0,0,0,0,0,0
215412333,0,0,0,0,0,0
215413231,0,0,0,0,0,0
215416679,0,0,0,0,0,0
215418308,0,0,0,0,0,0
215418964,0,0,0,0,0,0
215424653,0,0,0,0,0,0
215425643,0,0,0,0,0,0
215425995,0,0,0,0,0,0
215426884,0,0,0,0,0,0
215427891,0,0,0,0,0,0
215429391,0,0,0,0,0,0
215429885,0,0,0,0,0,0
215433758,0,0,0,0,0,0
215442650,0,0,0,0,0,0
215444862,0,0,0,0,0,0
215467944,0,0,0,0,0,0
215471148,0,0,0,0,0,0
215475853,0,0,0,0,0,0
215480436,0,0,0,0,0,0
215509762,0,0,0,0,0,0
215510130,0,0,0,0,0,0
215523485,0,0,0,0,0,0
215538232,0,0,0,0,0,0
215543518,0,0,0,0,0,0
215544440,0,0,0,0,0,0
215576347,0,0,0,0,0,0
215577153,0,0,0,0,0,0
215598389,0,0,0,0,0,0
215617687,0,0,0,0,0,0
215633966,0,0,0,0,0,0
215672017,0,0,0,0,0,0
215677252,0,0,0,0,0,0
215679506,0,0,0,0,0,0
215684948,0,0,0,0,0,0
215696360,0,0,0,0,0,0
215706851,0,0,0,0,0,0
215719443,0,0,0,0,0,0
215721068,0,0,0,0,0,0
215726140,0,0,0,0,0,0
215729754,0,0,0,0,0,0
215746263,0,0,0,0,0,1
215746984,0,0,0,0,0,0
215748645,0,0,0,0,0,0
215768568,0,0,0,0,0,0
215781342,0,0,0,0,0,0
215818642,0,0,0,0,0,0
215823881,0,0,0,0,0,0
215852389,0,0,0,0,0,0
215857222,0,0,0,0,0,0
215900519,0,0,0,0,0,0
215907072,0,0,0,0,0,0
215913106,0,0,0,0,0,0
215914302,0,0,0,0,0,0
215926003,0,0,0,0,0,0
215954170,0,0,0,0,0,0
215981312,0,0,0,0,0,0
216003328,0,0,0,0,0,0
216017793,0,0,0,0,0,0
216027249,0,0,0,0,0,0
216069946,0,0,0,0,0,0
216088323,0,0,0,0,0,0
216091826,0,0,0,0,0,0
216104408,0,0,0,0,0,0
216116609,0,0,0,0,0,0
216139559,0,0,0,0,0,0
216156734,0,0,0,0,0,0
216165791,0,0,0,0,0,0
216170007,0,0,0,0,0,0
216173710,0,0,0,0,0,0
216183239,0,0,0,0,0,0
216193531,0,0,0,0,0,0
216195813,0,0,0,0,0,0
216212734,0,0,0,0,0,0
216221275,0,0,0,0,0,0
216233297,0,0,0,0,0,0
216240097,0,0,0,0,0,0
216243640,0,0,0,0,0,0
216275902,0,0,0,0,0,0
216278706,0,0,0,0,0,0
216290770,0,0,0,0,0,0
216296115,0,0,0,0,0,0
216301346,0,0,0,0,0,0
216301454,0,0,0,0,0,0
216303702,0,0,0,0,0,0
216305211,0,0,0,0,0,0
216317365,0,0,0,0,0,0
216319407,0,0,0,0,0,0
216324938,0,0,0,0,0,0
216326890,0,0,0,0,0,0
216329027,0,0,0,0,0,0
216335763,0,0,0,0,0,0
216339198,0,0,0,0,0,0
216341777,0,0,0,0,0,0
216345275,0,0,0,0,0,0
216347786,0,0,0,0,0,0
216349242,0,0,0,0,0,0
216350198,0,0,0,0,0,0
216352116,0,0,0,0,0,0
216353057,0,0,0,0,0,0
216363629,0,0,0,0,0,0
216366147,0,0,0,0,0,0
216368770,0,0,0,0,0,0
216369852,0,0,0,0,0,0
216371504,0,0,0,0,0,0
216374575,0,0,0,0,0,0
216378277,0,0,0,0,0,0
216383552,0,0,0,0,0,0
216385634,0,0,0,0,0,0
216394733,0,0,0,0,0,0
216395469,0,0,0,0,0,0
216397080,0,0,0,0,0,0
216397896,0,0,0,0,0,0
216399286,0,0,0,0,0,0
216401327,0,0,0,0,0,0
216405287,0,0,0,0,0,0
216406103,0,0,0,0,0,0
216409584,0,0,0,0,0,0
216412227,0,0,0,0,0,0
216414229,0,0,0,0,0,0
216415507,0,0,0,0,0,0
216418664,0,0,0,0,0,0
216418756,0,0,0,0,0,0
216419330,0,0,0,0,0,0
216420158,0,0,0,0,0,0
216421802,0,0,0,0,0,0
216423410,0,0,0,0,0,0
216426902,0,0,0,0,0,0
216429297,0,0,0,0,0,0
216430658,0,0,0,0,0,0
216432298,0,0,0,0,0,0
216434599,0,0,0,0,0,0
216434905,0,0,0,0,0,0
216435205,0,0,0,0,0,0
216437161,0,0,0,0,0,0
216439618,0,0,0,0,0,0
216442097,0,0,0,0,0,0
216443032,0,0,0,0,0,0
216449143,0,0,0,0,0,0
216451393,0,0,0,0,0,0
216451422,0,0,0,0,0,0
216451605,0,0,0,0,0,0
216451736,0,0,0,0,0,0
216452592,0,0,0,0,0,0
216454198,0,0,0,0,0,0
216456403,0,0,0,0,0,0
216457264,0,0,0,0,0,0
216457637,0,0,0,0,0,0
216459371,0,0,0,0,0,0
216464727,0,0,0,0,0,0
216464790,0,0,0,0,0,0
216467901,0,0,0,0,0,0
216468885,0,0,0,0,0,0
216469690,0,0,0,0,0,0
216471150,0,0,0,0,0,0
216471217,0,0,0,0,0,0
216471424,0,0,0,0,0,0
216472905,0,0,0,0,0,0
216474689,0,0,0,0,0,0
216476199,0,0,0,0,0,0
216476446,0,0,0,0,0,0
216480613,0,0,0,0,0,0
216482471,0,0,0,0,0,0
216483199,0,0,0,0,0,0
216485405,0,0,0,0,0,0
216486699,0,0,0,0,0,0
216490944,0,0,0,0,0,0
216491015,0,0,0,0,0,0
216494459,0,0,0,0,0,0
216497275,0,0,0,0,0,0
216498220,0,0,0,0,0,0
216498252,0,0,0,0,0,0
216499314,0,0,0,0,0,0
216499321,0,0,0,0,0,0
216499670,0,0,0,0,0,0
216503878,0,0,0,0,0,0
216504046,0,0,0,0,0,0
216505521,0,0,0,0,0,0
216506548,0,0,0,0,0,0
216508318,0,0,0,0,0,0
216511900,0,0,0,0,0,0
216518802,0,0,0,0,0,0
216529468,0,0,0,0,0,0
216529648,0,0,0,0,0,0
216529679,0,0,0,0,0,0
216533160,0,0,0,0,0,0
216534934,0,0,0,0,0,0
216538755,0,0,0,0,0,0
216538763,0,0,0,0,0,0
216540233,0,0,0,0,0,0
216542091,0,0,0,0,0,0
216542098,0,0,0,0,0,0
216542429,0,0,0,0,0,0
216542887,0,0,0,0,0,0
216543118,0,0,0,0,0,0
216543343,0,0,0,0,0,0
216545527,0,0,0,0,0,0
216547836,0,0,0,0,0,0
216549344,0,0,0,0,0,1
216552259,0,0,0,0,0,0
216552798,0,0,0,0,0,0
216553641,0,0,0,0,0,0
216554914,0,0,0,0,0,0
216555726,0,0,0,0,0,0
216557256,0,0,0,0,0,0
216559343,0,0,0,0,0,0
216565890,0,0,0,0,0,0
216566279,0,0,0,0,0,0
216569796,0,0,0,0,0,0
216570606,0,0,0,0,0,0
216571596,0,0,0,0,0,0
216571710,0,0,0,0,0,0
216572410,0,0,0,0,0,0
216574193,0,0,0,0,0,0
216575823,0,0,0,0,0,0
216576315,0,0,0,0,0,0
216576368,0,0,0,0,0,0
216576682,0,0,0,0,0,0
216579657,0,0,0,0,0,0
216580183,0,0,0,0,0,0
216584113,0,0,0,0,0,0
216584653,0,0,0,0,0,0
216587116,0,0,0,0,0,0
216591702,0,0,0,0,0,0
216593895,0,0,0,0,0,0
216594155,0,0,0,0,0,0
216595399,0,0,0,0,0,0
216595548,0,0,0,0,0,0
216595589,0,0,0,0,0,0
216597976,0,0,0,0,0,0
216599099,0,0,0,0,0,0
216600419,0,0,0,0,0,0
216602237,0,0,0,0,0,0
216602276,0,0,0,0,0,0
216604136,0,0,0,0,0,0
216606883,0,0,0,0,0,0
216607515,0,0,0,0,0,0
216607965,0,0,0,0,0,0
216608683,0,0,0,0,0,0
216609130,0,0,0,0,0,0
216609886,0,0,0,0,0,0
216611494,0,0,0,0,0,0
216614623,0,0,0,0,0,0
216616961,0,0,0,0,0,0
216618220,0,0,0,0,0,0
216620463,0,0,0,0,0,0
216624692,0,0,0,0,0,0
216625431,0,0,0,0,0,0
216625769,0,0,0,0,0,0
216625809,0,0,0,0,0,0
216628941,0,0,0,0,0,0
216633277,0,0,0,0,0,0
216635174,0,0,0,0,0,0
216638409,0,0,0,0,0,0
216640915,0,0,0,0,0,0
216641517,0,0,0,0,0,0
216641765,0,0,0,0,0,0
216642829,0,0,0,0,0,0
216642840,0,0,0,0,0,0
216646950,0,0,0,0,0,0
216646954,0,0,0,0,0,0
216647844,0,0,0,0,0,0
216651172,0,0,0,0,0,0
216651378,0,0,0,0,0,0
216652124,0,0,0,0,0,0
216653885,0,0,0,0,0,0
216654172,0,0,0,0,0,0
216656135,0,0,0,0,0,0
216659122,0,0,0,0,0,0
216659595,0,0,0,0,0,0
216663341,0,0,0,0,0,0
216664000,0,0,0,0,0,0
216665127,0,0,0,0,0,0
216666838,0,0,0,0,0,0
216667912,0,0,0,0,0,0
216670296,0,0,0,0,0,0
216674111,0,0,0,0,0,0
216674458,0,0,0,0,0,0
216674580,0,0,0,0,0,0
216675145,0,0,0,0,0,0
216675593,0,0,0,0,0,0
216676486,0,0,0,0,0,0
216677726,0,0,0,0,0,0
216678713,0,0,0,0,0,0
216681124,0,0,0,0,0,0
216681956,0,0,0,0,0,0
216684657,0,0,0,0,0,0
216685146,0,0,0,0,0,0
216685945,0,0,0,0,0,0
216691991,0,0,0,0,0,0
216693899,0,0,0,0,0,0
216698456,0,0,0,0,0,0
216698709,0,0,0,0,0,0
216699129,0,0,0,0,0,0
216702658,0,0,0,0,0,0
216702799,0,0,0,0,0,0
216703455,0,0,0,0,0,0
216703862,0,0,0,0,0,0
216705343,0,0,0,0,0,0
216711147,0,0,0,0,0,0
216712630,0,0,0,0,0,0
216714040,0,0,0,0,0,0
216718375,0,0,0,0,0,0
216719858,0,0,0,0,0,0
216720939,0,0,0,0,0,0
216721691,0,0,0,0,0,0
216722473,0,0,0,0,0,0
216723381,0,0,0,0,0,0
216723867,0,0,0,0,0,0
216724394,0,0,0,0,0,0
216725772,0,0,0,0,0,0
216725775,0,0,0,0,0,0
216727347,0,0,0,0,0,0
216728513,0,0,0,0,0,0
216729187,0,0,0,0,0,0
216729795,0,0,0,0,0,0
216730746,0,0,0,0,0,0
216731606,0,0,0,0,0,0
216736291,0,0,0,0,0,0
216737790,0,0,0,0,0,0
216739590,0,0,0,0,0,0
216739637,0,0,0,0,0,0
216739976,0,0,0,0,0,0
216740057,0,0,0,0,0,0
216740974,0,0,0,0,0,0
216741597,0,0,0,0,0,0
216742503,0,0,0,0,0,0
216744583,0,0,0,0,0,0
216747419,0,0,0,0,0,0
216750730,0,0,0,0,0,0
216751257,0,0,0,0,0,0
216752666,0,0,0,0,0,0
216753129,0,0,0,0,0,0
216754815,0,0,0,0,0,0
216757266,0,0,0,0,0,0
216758133,0,0,0,0,0,0
216760929,0,0,0,0,0,0
216762485,0,0,0,0,0,0
216765943,0,0,0,0,0,0
216766690,0,0,0,0,0,0
216768369,0,0,0,0,0,0
216773086,0,0,0,0,0,0
216773535,0,0,0,0,0,0
216774442,0,0,0,0,0,0
216774496,0,0,0,0,0,0
216775827,0,0,0,0,0,0
216776253,0,0,0,0,0,0
216779547,0,0,0,0,0,0
216779629,0,0,0,0,0,0
216782551,0,0,0,0,0,0
216786105,0,0,0,0,0,0
216786820,0,0,0,0,0,0
216787270,0,0,0,0,0,0
216790918,0,0,0,0,0,0
216793365,0,0,0,0,0,0
216793751,0,0,0,0,0,0
216795707,0,0,0,0,0,0
216797958,0,0,0,0,0,0
216802182,0,0,0,0,0,0
216803445,0,0,0,0,0,0
216803744,0,0,0,0,0,0
216805068,0,0,0,0,0,0
216806220,0,0,0,0,0,0
216807923,0,0,0,0,0,0
216808539,0,0,0,0,0,0
216808973,0,0,0,0,0,0
216809356,0,0,0,0,0,0
216816376,0,0,0,0,0,0
216818281,0,0,0,0,0,0
216819205,0,0,0,0,0,0
216819249,0,0,0,0,0,0
216820029,0,0,0,0,0,0
216820359,0,0,0,0,0,0
216821180,0,0,0,0,0,0
216822436,0,0,0,0,0,0
216822514,0,0,0,0,0,0
216822878,0,0,0,0,0,0
216825766,0,0,0,0,0,0
216832850,0,0,0,0,0,0
216832992,0,0,0,0,0,0
216833133,0,0,0,0,0,0
216833861,0,0,0,0,0,0
216834844,0,0,0,0,0,0
216835028,0,0,0,0,0,0
216835728,0,0,0,0,0,0
216836064,0,0,0,0,0,0
216841882,0,0,0,0,0,0
216842755,0,0,0,0,0,0
216846421,0,0,0,0,0,0
216847177,0,0,0,0,0,0
216847286,0,0,0,0,0,0
216848322,0,0,0,0,0,0
216849808,0,0,0,0,0,0
216849873,0,0,0,0,0,0
216850606,0,0,0,0,0,0
216854633,0,0,0,0,0,0
216854692,0,0,0,0,0,0
216858812,0,0,0,0,0,0
216860973,0,0,0,0,0,0
216862513,0,0,0,0,0,0
216864078,0,0,0,0,0,0
216864991,0,0,0,0,0,0
216865813,0,0,0,0,0,0
216866271,0,0,0,0,0,0
216866490,0,0,0,0,0,0
216866559,0,0,0,0,0,0
216867386,0,0,0,0,0,0
216867552,0,0,0,0,0,0
216868600,0,0,0,0,0,0
216869509,0,0,0,0,0,0
216869670,0,0,0,0,0,0
216870623,0,0,0,0,0,0
216879343,0,0,0,0,0,0
216881265,0,0,0,0,0,0
216881293,0,0,0,0,0,0
216882046,0,0,0,0,0,0
216886089,0,0,0,0,0,0
216886303,0,0,0,0,0,0
216886722,0,0,0,0,0,0
216889689,0,0,0,0,0,0
216890960,0,0,0,0,0,0
216891571,0,0,0,0,0,0
216892772,0,0,0,0,0,0
216892980,0,0,0,0,0,0
216893817,0,0,0,0,0,0
216895026,0,0,0,0,0,0
216895983,0,0,0,0,0,0
216897112,0,0,0,0,0,0
216897327,0,0,0,0,0,0
216900508,0,0,0,0,0,0
216900722,0,0,0,0,0,0
216901372,0,0,0,0,0,0
216902820,0,0,0,0,0,0
216903137,0,0,0,0,0,0
216905395,0,0,0,0,0,0
216906553,0,0,0,0,0,0
216909390,0,0,0,0,0,0
216910450,0,0,0,0,0,0
216912158,0,0,0,0,0,0
216912218,0,0,0,0,0,0
216912648,0,0,0,0,0,0
216912898,0,0,0,0,0,0
216913143,0,0,0,0,0,0
216913338,0,0,0,0,0,0
216915221,0,0,0,0,0,0
216916035,0,0,0,0,0,0
216924120,0,0,0,0,0,0
216924709,0,0,0,0,0,0
216931652,0,0,0,0,0,0
216931973,0,0,0,0,0,0
216934765,0,0,0,0,0,0
216934833,0,0,0,0,0,0
216936512,0,0,0,0,0,0
216941111,0,0,0,0,0,0
216941514,0,0,0,0,0,0
216941598,0,0,0,0,0,0
216943828,0,0,0,0,0,0
216944629,0,0,0,0,0,0
216944811,0,0,0,0,0,0
216948895,0,0,0,0,0,0
216948942,0,0,0,0,0,0
216951522,0,0,0,0,0,0
216954349,0,0,0,0,0,0
216958113,0,0,0,0,0,0
216959181,0,0,0,0,0,0
216959220,0,0,0,0,0,0
216961189,0,0,0,0,0,0
216961668,0,0,0,0,0,0
216962998,0,0,0,0,0,0
216963498,0,0,0,0,0,0
216966032,0,0,0,0,0,0
216967985,0,0,0,0,0,0
216969383,0,0,0,0,0,0
216969403,0,0,0,0,0,0
216973071,0,0,0,0,0,0
216973851,0,0,0,0,0,0
216977870,0,0,0,0,0,0
216978145,0,0,0,0,0,0
216979455,0,0,0,0,0,0
216979926,0,0,0,0,0,0
216980422,0,0,0,0,0,0
216982375,0,0,0,0,0,0
216984785,0,0,0,0,0,0
216985357,0,0,0,0,0,0
216986259,0,0,0,0,0,0
216988739,0,0,0,0,0,0
216990706,0,0,0,0,0,0
216993370,0,0,0,0,0,0
216996057,0,0,0,0,0,0
216997275,0,0,0,0,0,0
217001083,0,0,0,0,0,0
217002634,0,0,0,0,0,0
217003707,0,0,0,0,0,0
217004150,0,0,0,0,0,0
217004739,0,0,0,0,0,0
217006442,0,0,0,0,0,0
217007938,0,0,0,0,0,0
217007986,0,0,0,0,0,0
217009988,0,0,0,0,0,0
217010011,0,0,0,0,0,0
217011987,0,0,0,0,0,0
217012402,0,0,0,0,0,0
217012836,0,0,0,0,0,0
217015518,0,0,0,0,0,0
217016357,0,0,0,0,0,0
217018210,0,0,0,0,0,0
217022279,0,0,0,0,0,0
217024221,0,0,0,0,0,0
217026432,0,0,0,0,0,0
217030091,0,0,0,0,0,0
217030253,0,0,0,0,0,0
217030881,0,0,0,0,0,0
217033699,0,0,0,0,0,0
217036639,0,0,0,0,0,1
217037658,0,0,0,0,0,0
217040343,0,0,0,0,0,0
217041397,0,0,0,0,0,0
217042517,0,0,0,0,0,0
217043113,0,0,0,0,0,0
217046973,0,0,0,0,0,0
217047364,0,0,0,0,0,0
217050858,0,0,0,0,0,0
217051390,0,0,0,0,0,0
217052035,0,0,0,0,0,0
217052154,0,0,0,0,0,0
217053130,0,0,0,0,0,0
217055782,0,0,0,0,0,0
217058449,0,0,0,0,0,0
217058498,0,0,0,0,0,0
217059984,0,0,0,0,0,0
217062587,0,0,0,0,0,0
217062816,0,0,0,0,0,0
217063177,0,0,0,0,0,0
217063335,0,0,0,0,0,0
217063822,0,0,0,0,0,0
217064373,0,0,0,0,0,0
217064641,0,0,0,0,0,0
217065161,0,0,0,0,0,0
217067150,0,0,0,0,0,0
217067513,0,0,0,0,0,0
217070255,0,0,0,0,0,0
217074815,0,0,0,0,0,0
217076115,0,0,0,0,0,0
217076457,0,0,0,0,0,0
217078108,0,0,0,0,0,0
217079136,0,0,0,0,0,0
217083076,0,0,0,0,0,0
217084719,0,0,0,0,0,0
217084873,0,0,0,0,0,0
217085309,0,0,0,0,0,0
217086312,0,0,0,0,0,0
217086535,0,0,0,0,0,0
217088350,0,0,0,0,0,0
217088564,0,0,0,0,0,0
217090413,0,0,0,0,0,0
217095175,0,0,0,0,0,0
217095190,0,0,0,0,0,0
217095684,0,0,0,0,0,0
217100402,0,0,0,0,0,0
217102292,0,0,0,0,0,0
217103537,0,0,0,0,0,0
217107467,0,0,0,0,0,0
217108364,0,0,0,0,0,0
217108740,0,0,0,0,0,0
217112276,0,0,0,0,0,0
217113661,0,0,0,0,0,0
217113719,0,0,0,0,0,0
217114349,0,0,0,0,0,0
217117124,0,0,0,0,0,0
217117703,0,0,0,0,0,0
217121530,0,0,0,0,0,0
217123534,0,0,0,0,0,0
217124710,0,0,0,0,0,0
217125111,0,0,0,0,0,0
217128278,0,0,0,0,0,0
217128668,0,0,0,0,0,0
217129550,0,0,0,0,0,0
217134324,0,0,0,0,0,0
217134614,0,0,0,0,0,0
217136820,0,0,0,0,0,0
217140065,0,0,0,0,0,0
217140319,0,0,0,0,0,0
217141667,0,0,0,0,0,0
217142463,0,0,0,0,0,0
217142910,0,0,0,0,0,0
217146839,0,0,0,0,0,0
217153875,0,0,0,0,0,0
217157775,0,0,0,0,0,0
217158111,0,0,0,0,0,0
217160078,0,0,0,0,0,0
217160664,0,0,0,0,0,0
217161686,0,0,0,0,0,0
217162076,0,0,0,0,0,0
217162289,0,0,0,0,0,0
217164855,0,0,0,0,0,0
217169506,0,0,0,0,0,0
217170417,0,0,0,0,0,0
217175168,0,0,0,0,0,0
217177927,0,0,0,0,0,0
217177982,0,0,0,0,0,0
217179343,0,0,0,0,0,0
217181452,0,0,0,0,0,0
217182005,0,0,0,0,0,0
217184681,0,0,0,0,0,0
217185492,0,0,0,0,0,0
217187045,0,0,0,0,0,0
217187989,0,0,0,0,0,0
217189024,0,0,0,0,0,0
217193378,0,0,0,0,0,0
217194137,0,0,0,0,0,0
217195292,0,0,0,0,0,0
217195887,0,0,0,0,0,0
217197010,0,0,0,0,0,0
217201889,0,0,0,0,0,0
217204701,0,0,0,0,0,0
217207499,0,0,0,0,0,0
217208118,0,0,0,0,0,0
217208204,0,0,0,0,0,0
217211255,0,0,0,0,0,0
217213321,0,0,0,0,0,0
217214341,0,0,0,0,0,0
217215724,0,0,0,0,0,0
217215839,0,0,0,0,0,0
217216020,0,0,0,0,0,0
217216102,0,0,0,0,0,0
217216816,0,0,0,0,0,0
217217833,0,0,0,0,0,0
217221558,0,0,0,0,0,0
217223694,0,0,0,0,0,0
217224975,0,0,0,0,0,0
217226402,0,0,0,0,0,0
217228485,0,0,0,0,0,0
217229539,0,0,0,0,0,0
217233503,0,0,0,0,0,0
217236208,0,0,0,0,0,0
217237421,0,0,0,0,0,0
217237750,0,0,0,0,0,0
217239654,0,0,0,0,0,0
217240193,0,0,0,0,0,0
217241017,0,0,0,0,0,0
217241104,0,0,0,0,0,0
217245736,0,0,0,0,0,0
217245851,0,0,0,0,0,0
217247683,0,0,0,0,0,0
217257168,0,0,0,0,0,0
217261905,0,0,0,0,0,0
217264234,0,0,0,0,0,0
217267879,0,0,0,0,0,0
217270722,0,0,0,0,0,0
217271013,0,0,0,0,0,0
217271519,0,0,0,0,0,0
217272946,0,0,0,0,0,0
217273777,0,0,0,0,0,0
217274918,0,0,0,0,0,0
217275313,0,0,0,0,0,0
217276878,0,0,0,0,0,0
217290399,0,0,0,0,0,0
217291302,0,0,0,0,0,0
217291777,0,0,0,0,0,0
217294389,0,0,0,0,0,0
217295006,0,0,0,0,0,0
217295838,0,0,0,0,0,0
217298480,0,0,0,0,0,0
217302845,0,0,0,0,0,0
217305862,0,0,0,0,0,0
217307056,0,0,0,0,0,0
217307863,0,0,0,0,0,0
217309792,0,0,0,0,0,0
217316252,0,0,0,0,0,0
217317107,0,0,0,0,0,0
217317177,0,0,0,0,0,0
217321042,0,0,0,0,0,0
217325552,0,0,0,0,0,0
217330673,0,0,0,0,0,0
217331342,0,0,0,0,0,0
217332086,0,0,0,0,0,0
217349067,0,0,0,0,0,0
217350101,0,0,0,0,0,0
217351923,0,0,0,0,0,0
217354691,0,0,0,0,0,0
217356160,0,0,0,0,0,0
217359333,0,0,0,0,0,0
217362827,0,0,0,0,0,0
217364634,0,0,0,0,0,0
217367886,0,0,0,0,0,0
217372790,0,0,0,0,0,0
217378501,0,0,0,0,0,0
217379564,0,0,0,0,0,0
217387782,0,0,0,0,0,0
217390333,0,0,0,0,0,0
217392342,0,0,0,0,0,0
217404866,0,0,0,0,0,0
217427147,0,0,0,0,0,0
217449001,0,0,0,0,0,0
217463948,0,0,0,0,0,0
217474602,0,0,0,0,0,0
217479918,0,0,0,0,0,0
217512990,0,0,0,0,0,0
217528252,0,0,0,0,0,0
217528460,0,0,0,0,0,0
217555432,0,0,0,0,0,0
217559050,0,0,0,0,0,0
217568894,0,0,0,0,0,0
217573852,0,0,0,0,0,0
217601944,0,0,0,0,0,0
217604286,0,0,0,0,0,0
217621224,0,0,0,0,0,0
217626463,0,0,0,0,0,0
217635436,0,0,0,0,0,0
217637423,0,0,0,0,0,0
217637778,0,0,0,0,0,0
217639436,0,0,0,0,0,0
217662635,0,0,0,0,0,0
217741506,0,0,0,0,0,0
217744916,0,0,0,0,0,0
217779909,0,0,0,0,0,0
217781235,0,0,0,0,0,0
217797032,0,0,0,0,0,0
217825534,0,0,0,0,0,0
217939503,0,0,0,0,0,0
217941732,0,0,0,0,0,0
217949053,0,0,0,0,0,0
217955111,0,0,0,0,0,0
217984454,0,0,0,0,0,0
217995053,0,0,0,0,0,0
217998769,0,0,0,0,0,0
218003092,0,0,0,0,0,0
218029400,0,0,0,0,0,0
218051033,0,0,0,0,0,0
218065399,0,0,0,0,0,0
218081931,0,0,0,0,0,0
218133540,0,0,0,0,0,0
218144287,0,0,0,0,0,0
218195559,0,0,0,0,0,0
218201025,0,0,0,0,0,0
218203322,0,0,0,0,0,0
218212249,0,0,0,0,0,0
218245561,0,0,0,0,0,0
218256029,0,0,0,0,0,0
218283893,0,0,0,0,0,0
218295012,0,0,0,0,0,0
218302429,0,0,0,0,0,0
218315918,0,0,0,0,0,0
218355202,0,0,0,0,0,0
218357055,0,0,0,0,0,0
218371763,0,0,0,0,0,0
218432848,0,0,0,0,0,0
218457282,0,0,0,0,0,0
219612205,0,0,0,0,0,0
