221627078
221635051
221636642
221640019
221640964
221641066
221644442
221645941
221646742
221648000
221648608
221650854
221653696
221656390
221657394
221660193
221661032
221661951
221662640
221662851
221663372
221666416
736827252
736827826
736828896
736829036
736829501
736829802
736830202
736830551
736830693
736831225
737193242
737193438
737193498
737193844
737193969
737194613
737194965
737195016
737195127
737195138
737195411
737195483
737195548
737195681
737195968
737196128
737196917
737198668
737199160
737199291
737199451
737200155
737200308
737200847
737201197
737201376
737201638
737552399
737552449
737552514
737552615
737552697
737552924
737552926
737553123
737553197
737554128
737554156
737554757
737554805
737555514
737555673
737556246
737556755
737557170
737557369
737557523
737557768
737557870
737558315
737558934
737559244
737559615
737559939
737560107
737560289
737560480
737560592
737560934
737560973
737560993
737561173
737561201
737561524
737561618
737913554
737913676
737913800
737913802
737913912
737914043
737914068
737914119
737914129
737914216
737914338
737914532
737914585
737914997
737915098
737915295
737915378
737916062
737916261
737916792
737916983
737917628
737917649
737918561
737919617
737919950
737919990
737920309
737920313
737920459
737920714
737920745
737920965
737921302
737921442
737921519
737921680
737922227
737922762
738274001
738274398
738274456
738274587
738274817
738275084
738275202
738275261
738275463
738275976
738276034
738276235
738276444
738276906
738277189
738277267
738278543
738278658
738278669
738278674
738278827
738279081
738279391
738279541
738279840
738279865
738280243
738280806
738280977
738281532
738282056
738282287
738639601
738640894
738641002
738642089
738642564
738642744
738643388
738643604
738643811
738644121
