CoRoT_ID
102692778
102714305
102717889
102721925
102726655
102726683
102736607
100500736
100557143
100596299
100596333
100597609
100610961
100634123
100656223
100669650
100695601
100715650
100724734
100733229
100733870
100736747
100737659
100753330
100761750
110639075
100784327
100786882
100792637
100813799
100821572
100825090
100826123
100853452
100856697
100864569
100867895
100871490
100871487
100876287
100888944
100896207
100905864
100916579
100922474
100933860
100938641
100945340
100958710
100968755
100970488
100974118
100983148
100983871
100995922
101001640
101019830
101023768
101023918
101039834
101048831
110575212
101080756
101100065
101101232
101107995
101118111
101122421
101174384
101193334
101196772
101561050
101594554
101602989
101617139
101627819
101636040
101718602
101737168
102686832
102688059
102689111
102690389
102694654
102694833
102696260
102696481
102697244
102699325
102699436
105914434
102702789
102703138
102704719
102705435
102706542
102707030
102707647
102708694
102709329
102713358
102713587
102713613
102714078
105925666
102716951
102717436
102719063
102719470
102720804
102721333
102721804
102723508
102723554
102724044
102725641
102725714
102726093
102726228
105934644
102726859
102726957
105934981
102729262
105937436
102730409
105937929
102731757
102733914
102734650
102736038
102738619
102741313
102741315
102751782
102754972
102755814
100412751
100424769
100429067
100430381
100434589
100434968
100435383
100436122
100440565
100441421
100443773
100447257
100447972
100448189
100454011
100456356
100457878
100459954
100461311
100463858
100465392
100467706
100472493
100473026
100473769
100474072
100474717
100475529
100479902
100480743
100481515
100482793
100483847
100486326
100486330
100486393
100486651
100488168
100490893
100491332
100492072
100493629
100495801
100497523
100499165
100500888
100502412
100502521
100504332
100506021
100506084
100507051
100509949
100511611
100512063
100512729
100513356
100513648
100515333
100515307
100516210
100516586
100516923
100518121
100518346
100518590
100519141
100519314
100520462
100520804
100522697
100523200
100524627
100525640
100527471
100527823
100528128
100528464
100530143
100530353
100530452
100531937
100531945
100532041
100533283
100537046
100537042
100537382
100539109
100540063
100541503
100542191
100542282
100543605
100545483
100546067
100546678
100549378
100549816
100550014
100552455
100553065
100553631
100555132
100555173
100556055
100556225
100558288
100559538
100559857
100562083
100562699
100564195
100564275
100564910
100569501
100569730
100569913
100570134
100571104
100571796
100572177
100572997
100573760
100573791
100573991
100574722
100574837
100575086
100576007
100576701
100577200
100578632
100580176
100581775
100582397
100583554
100585212
100585803
100586342
100586437
100586687
100586736
100586764
100587646
100588424
100589010
100590217
100591536
100592031
100592544
100593268
100593396
100594680
100595695
100596079
100597075
100598266
100599037
100599319
100599472
100599950
100601351
100602088
100603798
100604434
100604632
100605772
100606331
100607464
100611257
100611809
100614123
100614937
100615971
100616070
100616348
100616888
100616973
100618821
100618836
100618993
100619141
100619346
100619605
100620280
100621039
100622658
100623372
100623599
100624022
100624488
100624805
100625650
100627823
100630339
100630562
100630893
100631782
100632130
100633271
100633367
100634602
100634756
100637482
100637704
100639276
100639402
100639608
100639856
100640357
100641080
100644163
100644407
100645091
100645531
100645725
100646856
100647168
100649207
100651358
100651361
100651432
100652335
100654833
100655964
100656600
100656893
100657953
100658523
100658659
100659673
100659925
100660818
100661267
100661520
100661594
100662481
100663356
100664474
100664918
100665243
100665990
100666057
100666265
100667041
100667742
110565966
100670365
100671741
110566539
100674754
100674800
100674963
100675902
100677098
100677116
100678181
100678257
100678357
110567305
100678977
100679411
100679434
100679514
100679950
100681913
100682488
100683022
100683038
100683037
100683441
100684691
100684950
100685056
100685536
100685860
100686488
100687785
100688417
100688591
100689830
100690805
110603474
100692726
100692839
100693008
100693072
100694237
100694582
100694617
100694950
100695261
100696317
100697490
100697924
110604483
100699232
100699379
100700028
100700534
100700723
100700889
100702445
110636385
100702718
100703030
100703727
100704765
100705166
100705263
100705443
100705852
110636852
110636868
100706173
100706197
100707045
100707843
100707854
100707942
100707921
100707944
100708127
100708370
100709062
110637319
100710014
100711091
100711595
100712669
100712922
100714007
110638240
100715525
100715650
110638309
100716556
100716817
100717125
100717414
110568153
110568218
110568317
110568351
110568348
100720357
100721397
100722040
100722608
100722680
100722779
110568893
100723448
100724103
110569379
110569726
100725658
100725706
100726037
100726311
100726332
100726708
100728572
100729157
100729582
100729832
100729865
100730133
100730209
100730715
100731097
100732789
100733126
100733420
100735258
100736020
100736206
100736308
100736677
100737175
100737490
100738670
100739374
100739465
100740071
100740291
100740579
100740782
100741559
100741819
100742554
100743129
100743170
100743215
100743618
100743629
100744199
100745423
100747150
100747800
100749854
100750862
100751168
100752538
100752683
100753330
100753573
100754623
100754501
100754810
100755724
100756005
100756188
100757574
100758033
100758218
100760306
100760319
100760500
100760596
100761253
100761750
100763244
100763473
100763918
100765179
100766101
100767569
100767842
100768145
100768215
100768419
100768664
100769469
100770313
100770682
110639179
100772259
100773163
100773383
100773973
100775099
100775918
100776102
100777684
100777706
100777961
100778417
100778891
100779178
100779810
100779931
100781372
100782155
100783082
100783233
100783336
100783474
100783769
100784138
100784327
100784623
100784648
100784929
100785045
100785167
100785447
100786882
100787298
100788194
100788173
100788709
100789151
100789792
100790069
100790447
100790832
100791478
100791621
100791653
100792216
100792219
100792262
100792360
100792831
100793294
100793542
100793550
100793654
100794108
100795824
100796424
100796542
100796557
100797308
100797502
100797661
100797800
100798365
100799248
100799763
100799876
100800259
100802007
100802610
100802855
100802960
100803483
100804679
100805120
100805169
100805878
100807132
100809178
100809477
100810636
100811045
100811116
100811436
100811526
100812153
100813027
100813059
100813221
100814083
100815161
110639247
100816413
100817208
100817573
100818938
100819035
100819374
100819869
100820430
100820820
100822231
100822267
100822285
100822549
100823397
100823484
100823963
100824047
100824402
100824668
100825251
100825691
100826011
100825994
100827073
100827393
100827490
100827988
100828924
100829018
100830101
100830831
100831655
100833522
100833521
100833646
100834084
100834457
100834566
100834705
100834834
100835475
100835789
100835849
100836094
100836469
100836619
100838680
100839384
100840079
100840394
100841417
100841854
100842382
100842720
100843035
100843424
100843723
100845452
100845950
100846885
100846912
100847451
100847588
100848222
100848236
100849151
100849696
100849897
100850383
100851058
100852656
100853066
100853455
100853482
100853561
100853950
100854542
100855308
100856234
110606223
100858053
100858245
100858455
100858860
100859016
100859170
100860672
100860627
100861153
100865718
100866202
100866462
100868130
100868683
100869279
110606390
100870249
100870938
100872377
100872604
100872657
100873083
100873140
100874332
100874526
100875383
100875453
100876287
100876865
100877109
100877184
100877430
100877647
100878901
100879950
100880049
100881744
100882082
100882118
100882233
100883250
100883990
100883983
100884642
100886280
100886479
100886873
100886908
100886956
100887082
100888576
100888732
100888930
100889173
100889521
100889638
100889895
100890444
100890912
100891088
100891489
100891554
100893186
100893649
100893811
100893975
100894899
100894912
100895476
100896428
100896955
100897428
100898425
100898794
100898884
100899628
100899919
100900153
100900303
100900545
100901683
100901733
100901855
100901998
100902459
100902585
100903163
100903647
100903894
100904102
100904432
100905664
100905913
100908305
100908597
100910083
100910195
100910552
100910530
100911592
100911883
100911815
100912932
100913907
100914092
100914315
100914473
100914526
100915882
100915956
100916197
100917027
100918173
100918351
100918609
100919702
100920387
100920557
100920975
100921343
100921311
100921429
100922030
100922068
100922626
100922750
100922926
100923459
100923801
100923809
100924125
100924134
100925577
100925833
100926223
100926672
100927265
100928016
100928422
100928677
100928979
100929178
100929688
100929824
100930600
100930613
100930748
100930946
100931150
100931311
100931554
100932414
100932485
100933827
100934605
100934790
100934925
100934957
100935274
100935484
100935688
100937703
100938236
100938599
100940297
100940650
100940756
100942060
100942722
100943381
100943332
100943957
100944333
100945052
100945495
100945727
100946704
100946822
100948608
100949783
100949965
100950551
100950848
100951045
100951862
100952398
100952535
100952593
100952646
100953329
100953471
100953642
100954277
100954695
100955881
100956040
100956056
100956122
100956384
100956593
100956970
100958231
100958373
100958423
100958414
100958533
100958571
100958810
100958936
100959120
100959348
100959426
100960341
100961485
100962149
100962719
100962769
100965012
100965093
100965926
100966896
100968567
100968865
100969340
100969446
100970357
100971044
100971166
100971161
100971529
100971899
100972059
100973240
100975111
100975597
100976059
100976169
100976490
100977363
100978562
100978665
100978737
100978953
100979436
100979498
100979817
100980199
100981486
100981597
100982080
100982512
100982865
100982950
100982923
100983048
100983913
100984159
100985455
100985849
100985894
100985906
100986046
100987276
100987890
100988199
100988379
100988656
100988725
100988784
100988877
100989249
100989736
100990681
100990938
100991107
100991403
100992301
100992920
100993180
100993976
100993961
100994005
100994098
100994184
100994232
100995219
100995338
100995442
100996430
100997312
100997493
100998233
100998221
100998265
100998571
100999054
100999289
100999366
100999501
100999813
101000245
101001054
101001445
101001571
101001640
101002182
101002236
101002771
101002968
101004092
101004170
101004910
101004960
101005232
101006095
101006162
101006207
101006249
101006294
101006668
101006779
101007463
101007791
101007975
101008578
101008795
101009154
101009305
101009395
101010259
101010512
101010780
101010792
101010882
101011556
101011950
101012588
101012664
101013833
101014323
101015597
101015642
101015866
101016202
101016219
101016583
101017249
101017465
101017915
101018171
101018406
101018393
101018702
101018830
101018923
101019285
101019759
101019972
101020134
101020218
101020409
101021406
101021957
101022006
101022193
101022219
101022482
101022843
101023030
101024307
101024376
101024578
101024645
101024742
101025128
101025335
101026493
101027239
101027263
101027600
101028443
101029039
101029042
101029567
101029606
101029802
101030065
101030167
101030346
101030522
101031646
101031804
101032048
101032169
101032237
101032686
101032803
101033606
101033706
101033811
101034025
101034061
101034096
101034702
101034772
101034839
101034920
101034958
101035518
101035622
101035653
101035705
101035898
101035994
101036127
101036744
101036832
101037093
101037083
101037331
101038280
101038728
101039140
101039409
101039485
101039506
101039742
101041026
101041405
101041591
101041993
101042011
101042410
101042438
101042450
101042491
101042816
101043587
101044136
101044194
101044206
101044218
101044249
101044674
101044836
101045095
101045344
101045746
101046075
101046397
101046557
101046788
101047420
101047814
101048448
101048887
101048993
101049428
101049760
101049975
101050198
101050209
101050391
101051096
101051332
101052073
101052466
101052922
101053188
101053620
101053632
101053915
101054022
101054266
101054647
101055543
101055629
101056032
101056429
101057165
101057228
101057563
101057666
101057734
101057741
101057845
101058348
101058365
101058380
101058756
101058881
101059048
101059151
101059381
101059693
101060051
101060194
101060534
101060565
101061242
101061329
101061510
101061650
101061869
101061851
101061858
101061976
101062044
101062109
101063049
110572915
101063716
101064191
101064607
101064930
101066377
101067729
101068082
101068234
101068210
101068609
101068837
101068850
101069089
101069146
110573943
101069502
101069492
101070153
101070357
101070834
101070926
101071033
101071649
101071707
101071939
101072104
110575258
110575328
110575513
110575530
101073790
101073867
101074925
101075343
101075367
110575752
101075555
101075794
101077188
101077731
101077853
101078244
101078636
101079439
101079723
101080047
110607949
101081391
101081783
101082967
101083033
101083592
101083600
101084649
101084795
101085064
101085119
101085433
101086349
101086711
101087033
101087129
101087697
101087927
101087921
101088031
101088646
101089004
101088995
101088983
101089532
101089854
101090091
101090411
101090725
101090781
101090896
101091849
101092280
101092874
101093281
101093295
101093284
101093520
101093636
101093867
101094114
101094218
101094339
101094463
101094487
101095286
101095273
101095507
101095938
101097409
101097512
101098078
101098150
101099173
101099365
101100069
101100354
101100415
101100520
101100674
101101409
101101508
101102519
101103214
101104409
101104787
101105486
101106018
101106269
101106249
101106520
101107208
101108203
101108419
101109390
101109436
101109587
110642155
101110012
101110203
101110121
101110242
101111013
101111286
101111980
101111963
101112500
101112654
101112682
101112939
101113010
101113235
101113269
101113274
101113718
101114132
101114515
101114620
101115531
101116014
101116158
101116176
101116727
101117404
101119005
101119260
101119632
101120009
101120047
101120240
101120312
101120987
101121241
101122206
101123236
101123395
101124085
101124107
101124774
101125031
101126924
101127318
101127623
101127667
101128597
101129018
101129499
101130163
101130812
101131976
101132134
101132802
101132836
101133203
101134476
101135303
101135536
101136209
101136279
101136922
101137046
101137056
101137245
101138908
101138968
101139304
101139361
101139965
101140836
101141109
101141382
101141624
101141966
101142053
101142586
101142575
101142786
101143447
101144251
101144190
101144409
101144671
101144818
101144866
101145057
101147693
101147749
101148718
101148734
101148841
101149095
101149674
101150004
101150324
101150411
101150580
101151570
101152878
101153117
101153191
101153652
101153906
101155258
101155346
101155400
101156223
101157347
101158612
101159314
101159855
101159836
101160733
101160865
101161664
101162220
101162791
101163109
101162942
101163372
101163635
101164110
101164298
101165652
101166167
101166180
101166448
101166514
101167433
101167976
101168430
101168597
101171579
101171650
101172152
101172950
101173822
101174211
101175503
101175808
101176093
101176553
101177353
101177631
101179520
101180741
101182132
101182710
101182891
101182979
101184282
101184873
101186380
101187406
101188765
101189140
101189447
101189849
101191335
101192533
101192695
101193769
101195199
101196210
101196591
101198654
101200995
101201188
101201987
101204408
101204491
101204499
101205443
101205718
101207160
101207447
101211466
101214930
101217274
101218344
101218979
101219553
101221835
101222796
101227450
101228505
101228535
101229534
101229907
101231842
101240091
101240165
101244262
101246426
101254001
101498790
101499895
101507450
101507681
101507943
101509636
101512611
101517296
101521193
101524183
101526428
101527699
101529298
101530738
101536782
101538346
101539271
101542494
101545081
101546388
101547820
101550759
101556127
101556315
101558380
101560790
101561081
101562508
101566346
101572620
101575415
101579183
101579544
101580696
101583545
101583577
101587191
101587768
101588604
101588678
101588795
101589258
101589376
101589521
101590367
101590562
101593684
101596213
101597682
101597940
101598218
101598978
101599905
101601037
101601634
101601779
101602880
101603445
101604056
101604782
101605034
101605076
101605215
101605978
101606132
101607837
101608900
101610286
101610551
101610749
101611339
101612289
101613620
101614283
101614469
101614830
101615631
101615922
101616400
101617787
101618398
101618461
101618534
101619414
101619665
101620066
101620478
101621148
101621441
101622423
101623747
101623805
101624626
101625522
101625873
101625996
101626655
101627326
101628552
101629794
101631234
101632313
101633119
101633963
101634748
101634822
101637047
101637990
101638173
101638419
101638741
101639358
101640662
101642089
101642233
101644738
101645583
101645576
101645783
101646504
101647046
101649216
101650702
101650816
101650885
101650995
101651023
101651087
101651225
101651616
101651930
101653417
101654400
101656532
101657424
101657661
101661577
101661600
101661981
101662635
101662805
101663605
101664965
101665008
101665518
101666120
101666900
101667305
101668840
101670181
101671750
101674913
101675435
101675703
101675964
101676181
101678496
101679247
101679532
101680528
101680578
101680568
101680616
101681840
101682460
101682762
101683084
101685987
101686099
101686314
101687268
101689183
101691861
101692695
101692807
101694166
101694903
101696836
101699139
101701086
101701954
101704045
101704784
101705602
101706360
101707763
101710192
101717138
101717669
101722930
101726503
101727881
101729233
101730528
101730616
101735328
101736243
101739237
101741393
101745808
101748322
101748524
101753179
101753747
101755251
101756305
101765190
101766389
101766652
101768071
101770891
101773153
101777064
101778418
