%!PS-Adobe-2.0 EPSF-1.2
%%Creator: MATLAB, The MathWorks, Inc. Version 7.14.0.739 (R2012a). Operating System: Linux 3.13.0-53-generic #88-Ubuntu SMP Wed May 13 18:10:29 UTC 2015 x86_64.
%%Title: ./5__PSD_006035199.pow.eps
%%CreationDate: 05/23/2015  14:03:24
%%DocumentNeededFonts: Helvetica
%%DocumentProcessColors: Cyan Magenta Yellow Black
%%Extensions: CMYK
%%Pages: 1
%%BoundingBox:    37   281   569   529
%%EndComments

%%BeginProlog
% MathWorks dictionary
/MathWorks 160 dict begin
% definition operators
/bdef {bind def} bind def
/ldef {load def} bind def
/xdef {exch def} bdef
/xstore {exch store} bdef
% operator abbreviations
/c  /clip ldef
/cc /concat ldef
/cp /closepath ldef
/gr /grestore ldef
/gs /gsave ldef
/mt /moveto ldef
/np /newpath ldef
/cm /currentmatrix ldef
/sm /setmatrix ldef
/rm /rmoveto ldef
/rl /rlineto ldef
/s {show newpath} bdef
/sc {setcmykcolor} bdef
/sr /setrgbcolor ldef
/sg /setgray ldef
/w /setlinewidth ldef
/j /setlinejoin ldef
/cap /setlinecap ldef
/rc {rectclip} bdef
/rf {rectfill} bdef
% page state control
/pgsv () def
/bpage {/pgsv save def} bdef
/epage {pgsv restore} bdef
/bplot /gsave ldef
/eplot {stroke grestore} bdef
% orientation switch
/portraitMode 0 def /landscapeMode 1 def /rotateMode 2 def
% coordinate system mappings
/dpi2point 0 def
% font control
/FontSize 0 def
/FMS {/FontSize xstore findfont [FontSize 0 0 FontSize neg 0 0]
  makefont setfont} bdef
/reencode {exch dup where {pop load} {pop StandardEncoding} ifelse
  exch dup 3 1 roll findfont dup length dict begin
  { 1 index /FID ne {def}{pop pop} ifelse } forall
  /Encoding exch def currentdict end definefont pop} bdef
/isroman {findfont /CharStrings get /Agrave known} bdef
/FMSR {3 1 roll 1 index dup isroman {reencode} {pop pop} ifelse
  exch FMS} bdef
/csm {1 dpi2point div -1 dpi2point div scale neg translate
 dup landscapeMode eq {pop -90 rotate}
  {rotateMode eq {90 rotate} if} ifelse} bdef
% line types: solid, dotted, dashed, dotdash
/SO { [] 0 setdash } bdef
/DO { [.5 dpi2point mul 4 dpi2point mul] 0 setdash } bdef
/DA { [6 dpi2point mul] 0 setdash } bdef
/DD { [.5 dpi2point mul 4 dpi2point mul 6 dpi2point mul 4
  dpi2point mul] 0 setdash } bdef
% macros for lines and objects
/L {lineto stroke} bdef
/MP {3 1 roll moveto 1 sub {rlineto} repeat} bdef
/AP {{rlineto} repeat} bdef
/PDlw -1 def
/W {/PDlw currentlinewidth def setlinewidth} def
/PP {closepath eofill} bdef
/DP {closepath stroke} bdef
/MR {4 -2 roll moveto dup  0 exch rlineto exch 0 rlineto
  neg 0 exch rlineto closepath} bdef
/FR {MR stroke} bdef
/PR {MR fill} bdef
/L1i {{currentfile picstr readhexstring pop} image} bdef
/tMatrix matrix def
/MakeOval {newpath tMatrix currentmatrix pop translate scale
0 0 1 0 360 arc tMatrix setmatrix} bdef
/FO {MakeOval stroke} bdef
/PO {MakeOval fill} bdef
/PD {currentlinewidth 2 div 0 360 arc fill
   PDlw -1 eq not {PDlw w /PDlw -1 def} if} def
/FA {newpath tMatrix currentmatrix pop translate scale
  0 0 1 5 -2 roll arc tMatrix setmatrix stroke} bdef
/PA {newpath tMatrix currentmatrix pop	translate 0 0 moveto scale
  0 0 1 5 -2 roll arc closepath tMatrix setmatrix fill} bdef
/FAn {newpath tMatrix currentmatrix pop translate scale
  0 0 1 5 -2 roll arcn tMatrix setmatrix stroke} bdef
/PAn {newpath tMatrix currentmatrix pop translate 0 0 moveto scale
  0 0 1 5 -2 roll arcn closepath tMatrix setmatrix fill} bdef
/vradius 0 def /hradius 0 def /lry 0 def
/lrx 0 def /uly 0 def /ulx 0 def /rad 0 def
/MRR {/vradius xdef /hradius xdef /lry xdef /lrx xdef /uly xdef
  /ulx xdef newpath tMatrix currentmatrix pop ulx hradius add uly
  vradius add translate hradius vradius scale 0 0 1 180 270 arc 
  tMatrix setmatrix lrx hradius sub uly vradius add translate
  hradius vradius scale 0 0 1 270 360 arc tMatrix setmatrix
  lrx hradius sub lry vradius sub translate hradius vradius scale
  0 0 1 0 90 arc tMatrix setmatrix ulx hradius add lry vradius sub
  translate hradius vradius scale 0 0 1 90 180 arc tMatrix setmatrix
  closepath} bdef
/FRR {MRR stroke } bdef
/PRR {MRR fill } bdef
/MlrRR {/lry xdef /lrx xdef /uly xdef /ulx xdef /rad lry uly sub 2 div def
  newpath tMatrix currentmatrix pop ulx rad add uly rad add translate
  rad rad scale 0 0 1 90 270 arc tMatrix setmatrix lrx rad sub lry rad
  sub translate rad rad scale 0 0 1 270 90 arc tMatrix setmatrix
  closepath} bdef
/FlrRR {MlrRR stroke } bdef
/PlrRR {MlrRR fill } bdef
/MtbRR {/lry xdef /lrx xdef /uly xdef /ulx xdef /rad lrx ulx sub 2 div def
  newpath tMatrix currentmatrix pop ulx rad add uly rad add translate
  rad rad scale 0 0 1 180 360 arc tMatrix setmatrix lrx rad sub lry rad
  sub translate rad rad scale 0 0 1 0 180 arc tMatrix setmatrix
  closepath} bdef
/FtbRR {MtbRR stroke } bdef
/PtbRR {MtbRR fill } bdef
/stri 6 array def /dtri 6 array def
/smat 6 array def /dmat 6 array def
/tmat1 6 array def /tmat2 6 array def /dif 3 array def
/asub {/ind2 exch def /ind1 exch def dup dup
  ind1 get exch ind2 get sub exch } bdef
/tri_to_matrix {
  2 0 asub 3 1 asub 4 0 asub 5 1 asub
  dup 0 get exch 1 get 7 -1 roll astore } bdef
/compute_transform {
  dmat dtri tri_to_matrix tmat1 invertmatrix 
  smat stri tri_to_matrix tmat2 concatmatrix } bdef
/ds {stri astore pop} bdef
/dt {dtri astore pop} bdef
/db {2 copy /cols xdef /rows xdef mul dup 3 mul string
  currentfile exch readhexstring pop
  dup 0 3 index getinterval /rbmap xdef
  dup 2 index dup getinterval /gbmap xdef
  1 index dup 2 mul exch getinterval /bbmap xdef pop pop}bdef
/it {gs np dtri aload pop moveto lineto lineto cp c
  cols rows 8 compute_transform 
  rbmap gbmap bbmap true 3 colorimage gr}bdef
/il {newpath moveto lineto stroke}bdef
currentdict end def
%%EndProlog

%%BeginSetup
MathWorks begin

0 cap

end
%%EndSetup

%%Page: 1 1
%%BeginPageSetup
%%PageBoundingBox:    37   281   569   529
MathWorks begin
bpage
%%EndPageSetup

%%BeginObject: obj1
bplot

/dpi2point 12 def
portraitMode 0216 7344 csm

  238   989  6378  2981 MR c np
27 dict begin %Colortable dictionary
/c0 { 0.000000 0.000000 0.000000 sr} bdef
/c1 { 1.000000 1.000000 1.000000 sr} bdef
/c2 { 0.900000 0.000000 0.000000 sr} bdef
/c3 { 0.000000 0.820000 0.000000 sr} bdef
/c4 { 0.000000 0.000000 0.800000 sr} bdef
/c5 { 0.910000 0.820000 0.320000 sr} bdef
/c6 { 1.000000 0.260000 0.820000 sr} bdef
/c7 { 0.000000 0.820000 0.820000 sr} bdef
c0
1 j
1 sg
   0    0 6913 5186 PR
6 w
0 2593 5875 0 0 -2593 691 3630 4 MP
PP
-5875 0 0 2593 5875 0 0 -2593 691 3630 5 MP stroke
gs 691 1037 5876 2594 MR c np
/c8 { 0.727273 0.000000 0.272727 sr} bdef
c8
1 2 0 -9 1 9 0 -6 1 3 0 -2 1 14 0 38 
1 -60 1 22 0 -21 1 18 0 -12 1 -6 0 12 1 -13 
0 5 1 12 0 -13 1 11 1 12 0 -25 1 12 0 -5 
1 -1 0 -1 1 -4 0 -1 1 8 0 4 1 -11 0 9 
1 1 1 -8 0 -4 1 -1 0 1 1 13 0 2 1 35 
0 -40 1 16 0 -20 1 1 0 -5 1 8 1 30 0 -40 
1 -1 0 20 1 -13 0 5 1 1 0 15 1 12 0 -26 
1 -14 0 17 1 12 1 -26 0 1 1 21 0 -7 1 3 
0 -7 1 -11 0 50 1 -41 0 -4 1 2 0 -10 1 6 
1 -4 0 -2 1 0 0 2 1 9 0 11 1 -12 0 56 
1 -66 0 15 1 -8 1 20 0 -12 1 -6 0 26 1 -31 
0 -3 1 20 0 -4 1 -17 1 8 0 -6 1 28 1 -22 
1 1 -1 0 2 32 6512 3588 100 MP stroke
0 -29 1 27 0 -30 1 -6 0 1 1 16 0 -9 1 -2 
1 2 0 -11 1 19 0 -16 1 5 0 1 1 1 0 -6 
1 5 0 16 1 0 0 -17 1 -7 1 6 0 12 1 2 
0 -12 1 -7 0 42 1 -38 0 16 1 -19 0 6 1 5 
0 -4 1 47 1 -48 0 5 1 -13 0 3 1 4 0 -4 
1 0 0 29 1 -23 0 23 1 -18 1 -10 0 -5 1 5 
0 -1 1 -1 0 21 1 -17 0 -7 1 13 0 -5 1 -8 
0 5 1 1 1 13 0 -18 1 1 0 -1 1 18 0 -11 
1 -4 0 4 1 -3 0 -1 1 2 0 -3 1 12 1 -5 
0 30 1 -38 0 5 1 -5 0 -2 1 5 0 -3 1 27 
0 -29 1 6 0 2 1 -3 1 -5 0 1 1 7 0 -6 
1 7 0 7 1 21 0 -32 1 16 0 -16 1 10 0 16 
1 -25 1 6 0 -11 6459 3628 100 MP stroke
1 5 0 21 1 -17 0 -2 1 13 0 -14 1 -2 0 9 
1 -4 1 2 0 3 1 -15 0 1 1 8 0 2 1 -6 
0 9 1 -5 0 8 1 -16 0 8 1 10 1 0 0 -2 
1 -16 0 -1 1 3 0 12 1 -4 0 -8 1 -3 0 25 
1 -23 0 69 1 -20 1 -38 0 22 1 -18 0 -12 1 -4 
0 3 1 30 0 -26 1 -7 0 21 1 -18 0 23 1 -20 
1 4 0 -10 1 8 0 31 1 -17 0 -18 1 -5 0 3 
1 1 0 -3 1 8 0 -9 1 0 1 5 0 -4 1 16 
0 -7 1 -3 0 -6 1 16 0 -12 1 1 0 8 1 -4 
1 -7 0 15 1 -18 0 10 1 -6 0 -1 1 24 0 -21 
1 -2 0 5 1 -8 0 29 1 -28 1 10 0 8 1 2 
0 15 1 -31 0 -5 1 0 0 20 1 -3 0 2 1 -19 
0 7 1 12 1 -12 6405 3621 100 MP stroke
0 -7 1 18 1 -8 0 -11 1 4 0 11 1 -2 0 -13 
1 10 0 -8 1 10 1 -4 0 -5 1 25 0 -3 1 -17 
0 8 1 -9 0 2 1 16 0 -25 1 40 0 -40 1 1 
1 7 0 -7 1 16 0 -6 1 -9 0 7 1 -2 0 8 
1 -15 0 12 1 -12 1 11 0 -10 1 1 0 4 1 8 
0 -7 1 0 0 16 1 -15 0 -7 1 5 0 11 1 -9 
1 -8 0 5 1 27 0 -26 1 3 0 12 1 2 0 -23 
1 4 0 4 1 -2 0 8 1 -4 1 -9 0 8 1 -9 
0 18 1 -6 0 -3 1 11 0 -11 1 8 0 -14 1 -3 
0 14 1 -1 1 23 0 -32 1 -2 0 4 1 -6 0 19 
1 7 0 -25 1 36 0 -37 1 3 1 4 0 4 1 -9 
0 1 1 6 0 7 1 0 0 10 1 -13 1 1 0 7 
1 -1 1 7 0 -27 6351 3629 100 MP stroke
1 26 0 1 1 -19 0 -7 1 48 0 -46 1 3 0 13 
1 -19 0 2 1 2 1 5 0 -9 1 2 0 -1 1 19 
0 -6 1 -7 1 4 0 37 1 -25 0 13 1 -30 1 8 
0 -10 1 15 0 -4 1 -12 0 10 1 -6 0 -2 1 33 
0 -30 1 5 0 -13 1 19 1 -6 0 -5 1 -5 1 -3 
0 7 1 -6 1 0 0 3 1 1 1 -4 0 7 1 -3 
0 -5 1 18 0 -8 1 10 0 -18 1 2 0 13 1 -1 
0 -5 1 -3 1 17 0 -24 1 21 0 -4 1 -7 0 5 
1 48 0 -47 1 -14 0 14 1 -3 0 -14 1 0 1 9 
0 -7 1 1 0 16 1 -7 0 -12 1 1 0 18 1 -2 
0 -11 1 30 0 -34 1 5 1 11 0 -17 1 19 0 -5 
1 -7 1 12 0 -14 1 38 0 -39 1 3 0 -8 1 4 
1 -2 0 -1 1 22 6295 3606 100 MP stroke
0 -15 1 -7 0 9 1 -6 0 -2 1 4 0 -2 1 10 
1 -5 0 -3 1 -5 0 22 1 -18 0 -5 1 0 0 6 
1 -3 0 -2 1 10 0 6 1 -8 1 -9 0 3 1 5 
0 -4 1 3 0 1 1 2 0 14 1 -23 1 20 0 -20 
1 -1 1 8 0 -8 1 5 0 4 1 20 1 -24 0 -5 
1 50 0 -14 1 -32 0 -2 1 -1 1 4 0 -3 1 12 
0 -6 1 29 0 -23 1 -8 0 4 1 -3 0 5 1 -2 
0 -10 1 6 1 1 0 16 1 -20 0 20 1 -2 0 -20 
1 -1 0 3 1 9 0 2 1 -10 1 27 0 -26 1 35 
0 -36 1 0 0 -3 1 16 0 -9 1 -2 0 16 1 -14 
0 15 1 -17 1 10 0 -9 1 4 0 15 1 -20 0 -2 
1 30 0 -23 1 -9 0 28 1 -27 0 4 1 -6 1 30 
0 -30 1 0 0 26 6241 3602 100 MP stroke
1 -27 0 8 1 -3 0 1 1 -1 0 -3 1 6 0 -5 
1 6 1 -9 0 7 1 -5 0 -1 1 16 0 -5 1 -11 
0 2 1 10 0 -11 1 7 0 11 1 -16 1 0 0 -3 
1 8 0 -7 1 3 0 19 1 -14 0 -7 1 0 0 4 
1 -2 1 11 0 -14 1 22 0 -23 1 4 0 1 1 5 
0 2 1 -7 0 -6 1 26 0 -23 1 7 1 0 0 4 
1 7 0 -12 1 -8 0 16 1 -8 0 -8 1 2 0 -3 
1 3 0 5 1 27 1 -35 0 22 1 -22 0 18 1 -11 
0 19 1 -9 0 -17 1 5 0 2 1 27 0 -13 1 28 
1 -45 0 12 1 -13 0 -1 1 7 0 3 1 18 0 -27 
1 2 0 -5 1 11 0 -9 1 1 1 5 0 -3 1 -2 
0 64 1 -65 0 18 1 -4 0 -10 1 8 0 -12 1 3 
1 1 0 9 1 1 6187 3613 100 MP stroke
0 -9 1 13 0 -20 1 1 0 18 1 -2 0 -3 1 -7 
0 4 1 5 1 5 0 -13 1 -7 0 31 1 -25 0 -2 
1 14 0 -18 1 -1 0 24 1 8 0 -19 1 -12 1 9 
0 -10 1 13 0 -8 1 6 0 -7 1 -2 1 9 0 -11 
1 4 0 9 1 20 1 -27 0 -1 1 11 0 -14 1 9 
0 -8 1 1 0 13 1 -10 0 -4 1 29 0 -30 1 13 
1 -11 1 -3 0 1 1 13 0 -5 1 -10 0 1 1 35 
0 -28 1 -3 1 -5 0 51 1 -33 0 -15 1 11 0 -8 
1 -6 0 12 1 -10 0 -2 1 8 0 21 1 -19 1 -1 
0 19 1 -16 0 -6 1 5 0 -9 1 0 0 29 1 -16 
0 28 1 -36 0 -5 1 1 1 47 0 -38 1 -4 0 29 
1 -10 0 -8 1 -15 0 -4 1 5 0 -1 1 -2 0 4 
1 3 1 8 0 -10 6133 3622 100 MP stroke
1 16 0 -19 1 18 0 -18 1 2 0 -5 1 11 0 -12 
1 1 1 16 0 -16 1 27 0 -25 1 30 0 -17 1 -16 
0 1 1 18 0 -7 1 -10 0 1 1 21 1 -1 0 -17 
1 7 0 -13 1 2 0 2 1 4 0 -3 1 0 0 4 
1 -1 0 -2 1 7 1 -13 0 32 1 -25 0 -6 1 17 
0 9 1 -13 0 18 1 -29 0 8 1 5 0 -13 1 1 
1 -3 0 -1 1 32 0 -25 1 -6 0 14 1 -8 0 -4 
1 47 0 -30 1 -14 0 15 1 -21 1 1 0 13 1 -9 
0 -1 1 1 0 -5 1 0 0 11 1 2 0 -5 1 -5 
1 25 0 -22 1 -6 0 9 1 -7 0 5 1 -5 0 5 
1 3 0 3 1 -11 0 2 1 3 1 5 0 -2 1 32 
0 -36 1 4 0 -9 1 25 0 -16 1 -10 0 17 1 -10 
0 -7 1 7 1 -4 6079 3626 100 MP stroke
0 10 1 -13 0 8 1 5 0 -1 1 7 0 -16 1 13 
0 -7 1 -6 0 -2 1 22 1 11 0 -10 1 -17 1 -4 
-1 0 2 5 0 -8 1 1 0 5 1 -6 0 13 1 -2 
1 -8 0 9 1 -1 0 61 1 -66 0 13 1 16 0 -31 
1 -1 0 -3 1 4 1 26 0 -9 1 -18 0 10 1 -12 
1 17 0 -13 1 -4 1 0 0 6 1 -6 1 9 0 -6 
1 0 0 22 1 -22 0 15 1 -12 0 11 1 -8 0 -9 
1 11 0 -9 1 14 1 8 0 10 1 -30 0 -2 1 10 
0 -10 1 11 0 -11 1 -2 0 22 1 12 0 -28 1 -3 
1 -4 0 20 1 -11 0 -2 1 1 0 -1 1 22 0 -21 
1 -2 0 9 1 -13 0 7 1 -6 1 0 0 4 1 -2 
0 5 1 -4 0 -2 1 43 0 -41 1 15 0 17 1 -36 
1 10 0 28 1 -40 6024 3629 100 MP stroke
0 17 1 12 0 -23 1 18 0 -21 1 30 0 -27 1 9 
1 -13 1 4 0 46 1 -46 0 31 1 -18 0 1 1 -4 
0 11 1 -26 0 17 1 -13 0 3 1 53 1 -46 0 17 
1 -28 1 34 0 -30 1 14 0 -3 1 -12 0 17 1 -1 
0 -18 1 -4 1 2 0 13 1 -13 0 10 1 19 0 -28 
1 -1 0 5 1 1 0 6 1 -6 0 5 1 -12 1 7 
0 -9 1 8 0 -4 1 2 0 -6 1 20 0 -10 1 -5 
0 13 1 -12 1 -5 0 -1 1 23 0 -1 1 -5 0 -17 
1 2 0 -2 1 6 0 2 1 -8 0 17 1 -15 1 25 
0 8 1 -26 0 11 1 -19 0 -1 1 6 0 -4 1 4 
1 1 0 13 1 -18 1 0 0 14 1 -14 0 -2 1 31 
0 -17 1 9 0 1 1 -18 0 -6 1 14 0 -12 1 2 
1 -2 0 -1 1 21 5969 3607 100 MP stroke
0 -20 1 3 0 21 1 -8 0 4 1 -13 0 4 1 13 
0 16 1 -32 1 -5 0 13 1 -16 0 25 1 -23 0 3 
1 5 0 -10 1 -1 1 4 1 -2 0 42 1 -40 0 2 
1 1 0 -6 1 3 0 7 1 -12 0 3 1 8 0 -9 
1 2 1 1 0 12 1 -9 0 2 1 -5 0 2 1 13 
0 -19 1 11 0 -7 1 17 0 -21 1 11 1 -1 0 -2 
1 7 0 -9 1 7 0 -10 1 -4 0 17 1 -17 0 5 
1 -1 0 4 1 -6 1 10 0 35 1 -39 0 -4 1 5 
0 -9 1 26 0 -23 1 -3 0 20 1 -9 0 12 1 -17 
1 13 0 -3 1 -2 0 14 1 -26 0 4 1 13 0 -11 
1 -3 0 1 1 -6 1 13 0 5 1 -16 0 8 1 4 
0 10 1 -14 0 15 1 -20 0 4 1 -4 0 2 1 -6 
1 6 0 -3 1 -4 5915 3629 100 MP stroke
0 8 1 9 0 -5 1 -10 0 2 1 -2 0 -1 1 9 
0 -7 1 10 1 -9 0 -2 1 2 0 10 1 -7 0 -4 
1 4 0 -7 1 21 0 7 1 -28 1 4 1 0 0 10 
1 -9 0 3 1 11 0 -19 1 12 0 -10 1 -1 1 47 
0 -45 1 16 1 -7 0 -1 1 -3 0 10 1 -17 0 22 
1 -10 0 -5 1 -1 0 50 1 -54 1 3 0 6 1 -4 
0 -4 1 -2 0 1 1 3 0 -2 1 3 0 11 1 -18 
0 14 1 -13 1 3 0 23 1 2 0 -24 1 2 0 -2 
1 -5 1 3 0 24 1 -24 0 38 1 -31 1 7 0 -13 
1 18 0 1 1 -14 0 -8 1 3 0 1 1 8 0 -12 
1 0 0 5 1 6 1 18 0 8 1 -18 0 -7 1 11 
0 -19 1 6 0 -10 1 0 0 4 1 26 1 -10 0 -19 
1 16 0 16 1 -26 5860 3621 100 MP stroke
0 -5 1 -2 0 17 1 -15 0 1 1 4 1 -4 1 2 
0 -4 1 -1 0 22 1 -22 0 -1 1 1 0 9 2 11 
0 -16 1 0 1 36 0 -41 1 25 0 -25 1 5 0 -2 
1 -2 0 -1 1 1 0 7 1 2 0 5 1 -12 1 -2 
1 7 0 -2 1 -4 0 24 1 -17 0 34 1 -35 0 -8 
1 1 0 1 1 9 1 -4 0 -1 1 -1 0 -4 1 17 
0 -17 1 16 0 7 1 -9 0 3 1 -14 1 -1 0 7 
1 1 0 22 1 -19 0 -6 1 -6 0 14 1 3 0 -2 
1 -13 0 13 1 -6 1 -10 0 15 1 2 0 -11 1 -5 
0 20 1 -4 0 -13 1 7 0 11 1 -16 0 1 1 -8 
1 11 0 -10 1 4 0 17 1 -4 0 -18 1 17 0 3 
1 -20 1 6 0 14 1 -14 1 -3 0 1 1 -3 0 -1 
1 1 0 42 1 -43 5804 3629 100 MP stroke
0 33 1 -25 0 -6 1 4 0 22 1 -24 1 -2 0 1 
1 2 0 -3 1 16 0 6 1 -14 0 -9 1 38 0 -37 
1 24 1 -19 0 -6 1 2 0 13 1 -15 0 19 1 -17 
0 6 1 -2 0 15 1 -18 0 1 1 7 1 -10 0 16 
1 -5 0 -7 1 21 0 -21 1 9 0 2 1 -15 0 -2 
1 9 0 -6 1 -3 1 0 0 10 1 20 0 -29 1 0 
0 4 1 13 1 7 0 -3 1 -9 0 8 1 -5 1 -15 
0 15 1 -9 0 -5 1 18 0 -19 2 3 0 -4 1 19 
0 -13 1 -3 1 -1 0 16 1 -14 1 14 0 -15 1 23 
0 -24 1 2 0 7 1 -4 1 11 0 -17 1 6 0 30 
1 -35 0 7 1 -8 1 5 0 8 1 -11 0 3 1 22 
1 31 0 -58 1 1 0 3 1 19 0 -19 1 -4 0 18 
1 -15 0 4 1 29 5748 3592 100 MP stroke
0 -27 1 32 1 -34 0 -5 1 3 0 16 1 -21 0 10 
1 -9 0 -2 1 6 0 8 1 -7 0 14 1 -18 1 14 
0 -15 1 13 0 -15 1 5 0 -4 1 1 0 15 1 -2 
1 -7 0 -2 1 4 1 10 0 -18 1 10 0 2 1 12 
0 -10 1 -3 0 -12 1 26 0 -15 1 11 1 -4 0 -3 
1 -7 0 -3 1 -6 0 36 1 -12 0 -14 1 -7 0 12 
1 4 0 -2 1 -2 1 -10 0 19 1 -22 0 -1 1 1 
0 17 1 5 0 -9 1 -14 0 2 1 -3 0 3 1 5 
1 0 0 -7 1 8 0 16 1 -6 0 -17 1 13 0 -11 
1 6 0 29 1 -34 1 1 1 4 0 -2 1 1 1 6 
0 10 1 -6 0 -10 1 5 0 -9 1 -3 0 11 1 -8 
1 -4 0 7 1 -7 0 5 1 -4 0 23 1 -22 0 1 
1 -1 0 17 1 3 5693 3606 100 MP stroke
1 -17 0 -6 1 18 0 -12 1 26 0 -14 1 -14 0 -2 
1 -2 0 38 1 -26 0 -9 1 31 1 -26 0 5 1 -13 
0 40 1 -38 0 11 1 -13 0 9 1 10 0 -7 1 -7 
0 31 1 -21 1 -5 0 -9 1 8 0 2 1 -11 0 12 
1 -10 0 -2 1 22 0 -12 1 3 0 18 1 22 1 -43 
0 -7 1 -1 0 20 1 1 0 -13 1 15 0 -23 1 14 
0 16 1 -23 0 23 1 -31 1 9 0 28 1 -26 0 3 
1 -2 0 4 1 31 0 -40 1 -5 0 3 1 -5 1 16 
0 -14 1 -2 0 15 1 -13 0 -2 1 -1 1 0 0 6 
1 26 0 -8 1 -19 1 -2 0 3 1 17 0 -12 1 0 
0 -9 1 7 0 13 1 12 0 -11 1 -9 0 -9 1 -3 
1 29 0 -17 1 5 0 -13 1 -5 0 3 1 0 0 -4 
1 1 0 41 1 -39 5639 3626 100 MP stroke
0 -1 1 9 1 6 0 -1 1 -15 0 2 1 5 0 3 
1 -8 0 16 1 28 0 -45 1 -2 0 1 1 4 1 -5 
0 35 1 -21 0 8 1 -14 0 4 1 -7 0 -5 1 0 
0 9 1 -3 1 -3 0 -3 1 0 0 7 1 8 0 -7 
1 -4 1 12 0 -1 1 -9 0 -1 1 27 1 6 0 -35 
1 0 0 8 1 14 0 -11 1 -11 0 2 1 -4 0 16 
1 -10 0 -4 1 3 1 -5 0 3 1 -3 0 2 1 3 
0 10 1 -2 0 -13 1 3 0 3 1 5 0 -3 1 -4 
1 -3 0 2 1 16 0 -17 1 4 0 8 1 4 0 -1 
1 -15 0 7 1 -3 1 -2 0 17 1 -11 0 15 1 -26 
1 1 0 5 1 25 0 -15 1 17 0 15 1 -48 1 25 
0 -25 1 11 1 -10 0 -1 1 6 0 16 1 -16 0 3 
1 43 0 -52 1 10 5584 3619 100 MP stroke
1 22 0 -22 1 3 0 2 1 3 0 -13 1 0 0 -4 
1 6 0 8 1 -4 0 -11 1 14 1 -13 0 5 1 17 
0 -21 1 25 1 -8 0 -17 1 -2 0 5 1 1 0 -6 
1 2 1 -1 0 2 1 24 0 -9 1 -12 0 -6 1 4 
1 -3 0 2 1 12 1 21 0 -16 1 -17 0 -3 1 4 
0 1 1 21 0 -23 1 15 0 -14 1 -3 0 4 1 0 
1 4 0 -5 1 0 0 6 1 33 0 -30 1 -3 0 4 
1 -13 0 17 1 -7 0 3 1 -9 1 16 0 -15 1 -5 
0 22 1 -3 0 -20 1 22 0 -8 1 -2 0 -10 1 6 
0 7 1 -11 1 2 0 20 1 -11 0 26 1 -34 0 -4 
1 -1 0 2 1 7 0 -8 1 9 0 12 1 -21 1 27 
0 -18 1 -12 0 9 1 8 0 5 1 -13 0 -9 1 5 
0 11 1 -5 1 -10 5529 3628 100 MP stroke
0 1 1 12 0 -7 1 -1 0 12 1 -3 0 -3 1 -3 
0 15 1 -13 0 -4 1 2 1 6 0 -11 1 -1 0 7 
1 -6 0 20 1 -24 0 5 1 -5 0 1 1 17 0 7 
1 -20 1 0 0 7 1 4 0 -13 1 -1 0 2 1 2 
0 3 1 -6 0 19 1 -21 0 13 1 -3 1 11 0 7 
1 -2 0 -24 1 8 0 -5 1 0 0 28 1 -30 0 6 
1 -10 0 2 1 -1 1 29 0 3 1 -33 0 8 1 -6 
1 -1 0 12 1 -7 0 -6 1 1 1 27 0 -28 1 68 
0 -57 1 15 0 -17 1 19 0 -16 1 -1 0 16 1 -21 
0 13 1 -18 1 4 0 1 1 -5 0 -1 1 7 0 7 
1 -12 1 9 0 8 1 -5 0 -8 1 7 1 13 0 -19 
1 -7 0 20 1 -11 0 -1 1 -8 0 5 1 7 0 5 
1 -9 0 11 1 -6 5475 3616 100 MP stroke
1 -6 0 -4 1 13 0 -5 1 1 0 7 1 -16 0 15 
1 47 0 -41 1 -21 0 -2 1 16 1 -6 0 2 1 -10 
0 42 1 -30 0 -14 1 1 0 3 1 17 0 37 1 -44 
1 -10 0 21 1 -18 0 -3 1 11 0 4 1 -19 0 8 
1 -6 0 2 1 -3 0 10 1 -12 1 8 0 11 1 5 
0 -18 1 -6 0 5 1 3 1 -2 0 -3 1 5 0 -2 
1 16 1 -19 0 10 1 -9 0 2 1 -6 0 3 1 5 
0 -7 1 1 0 40 1 -39 0 10 1 -8 1 1 0 -6 
1 4 0 16 1 -17 0 35 1 -30 0 11 1 -14 0 -4 
1 119 0 -118 1 12 1 5 0 2 1 -11 0 -6 1 -2 
0 6 1 -5 0 3 1 2 0 -4 1 0 1 23 0 -27 
1 2 0 1 1 -3 0 8 1 -8 0 2 1 2 0 3 
1 6 0 -1 1 5 5421 3612 100 MP stroke
1 -8 0 -5 1 36 0 -28 1 27 0 -25 1 -9 0 26 
1 -19 0 -7 1 12 0 -14 1 13 1 -16 0 4 1 0 
0 -4 1 9 0 -9 1 1 0 4 1 -4 0 6 1 -7 
0 18 1 1 1 -8 0 2 1 -1 0 24 1 -28 0 5 
1 -12 0 6 1 11 0 -17 1 7 0 10 1 -13 1 15 
1 -20 0 14 1 -13 0 -1 1 5 0 -1 1 1 1 -5 
1 5 0 -5 1 37 0 -27 1 -3 0 20 1 -14 0 18 
1 -21 0 10 1 0 0 -10 1 52 1 -62 0 1 1 18 
0 -8 1 -10 0 43 1 -44 0 2 1 35 0 -35 1 7 
0 -2 1 35 1 -42 1 0 0 17 1 -17 0 3 1 2 
0 -5 1 10 0 6 1 -12 0 11 1 -15 1 0 0 22 
1 -21 0 7 1 24 0 -15 1 -17 0 17 1 -12 0 31 
1 -15 1 -17 0 4 5366 3621 100 MP stroke
1 2 0 20 1 -28 0 21 1 -23 0 6 1 5 0 9 
1 -13 0 7 1 -7 1 5 0 -10 1 15 0 -17 1 1 
0 12 1 -3 0 -5 1 0 0 8 1 -13 0 59 1 -43 
1 -8 0 1 1 19 0 -22 1 1 0 -1 1 32 0 -21 
1 -7 1 -8 0 3 1 -3 1 10 0 1 1 33 0 -44 
1 27 0 -18 1 5 0 -10 1 -4 0 -1 1 10 0 -10 
1 0 1 8 1 1 0 -5 1 -5 0 2 1 3 1 5 
0 1 1 -8 1 2 0 5 1 5 0 2 1 5 0 3 
1 -22 0 -3 1 6 0 12 1 -14 0 -3 1 0 1 33 
0 -34 1 1 0 20 1 -12 0 -6 1 1 0 4 1 -1 
0 -5 1 19 0 -3 1 -18 1 9 0 -1 1 5 0 22 
1 -34 0 11 1 -12 0 9 1 16 0 -10 1 -9 0 11 
1 20 1 -37 0 4 5311 3625 100 MP stroke
1 12 0 -9 1 -4 0 11 1 -10 0 -1 1 41 0 -32 
1 9 0 -19 1 34 1 -33 0 7 1 -7 1 8 0 -5 
1 -2 0 3 1 -1 0 -1 1 -5 1 1 0 2 1 4 
1 4 0 20 1 -29 1 1 0 5 1 9 0 26 1 -32 
1 1 0 -6 1 -6 0 20 1 -15 0 -4 1 0 0 13 
1 -6 0 -6 1 4 0 1 1 5 1 -1 0 11 1 -21 
0 5 1 -1 0 10 1 0 0 -10 1 7 0 -7 1 1 
0 -4 1 8 1 -2 0 9 1 21 0 -38 1 3 0 13 
1 5 0 -17 1 8 0 12 1 -2 0 4 1 -16 1 -9 
1 1 1 -1 0 39 1 0 0 -30 1 -1 0 -3 1 -4 
1 -2 0 9 1 10 0 -13 1 -2 0 2 1 -4 0 3 
1 -5 0 11 1 -11 0 9 1 20 1 -24 0 31 1 -36 
0 10 1 4 0 27 5255 3588 100 MP stroke
1 -39 0 37 1 -35 0 -3 1 21 0 -15 1 -6 1 28 
0 -19 1 12 0 -21 1 14 0 -13 1 7 0 -4 1 -1 
0 2 1 5 0 -11 1 21 1 -15 0 -2 1 4 0 -7 
1 13 0 -11 1 11 0 -13 1 47 0 -48 1 27 0 -17 
1 -10 1 2 0 -2 1 14 0 2 1 -12 0 -4 1 25 
0 -10 1 -15 0 20 1 -2 1 -15 0 6 1 -9 0 1 
2 3 0 -1 1 -3 0 21 1 -18 0 12 1 8 1 -16 
0 -6 1 9 0 2 1 -11 1 9 0 27 1 -12 0 3 
1 -20 0 8 1 14 1 -24 0 -1 1 1 0 17 1 -7 
0 -15 1 4 0 11 1 -16 0 1 1 30 0 -27 1 -1 
1 4 1 -3 0 5 1 -3 0 3 1 -6 0 7 1 -9 
0 -1 1 11 0 -7 1 -4 1 1 0 25 1 -23 0 17 
1 -14 0 14 1 -3 5199 3612 100 MP stroke
0 -13 1 9 0 6 1 -11 1 7 0 -10 1 1 0 29 
1 -26 0 3 1 8 0 -19 1 29 0 11 1 -31 0 -8 
1 11 1 26 0 -32 1 -4 0 3 1 -1 0 3 1 6 
0 -14 1 10 0 1 1 -7 0 11 1 -15 1 2 0 3 
1 -2 0 -3 1 16 0 -15 1 1 0 -1 1 20 0 -5 
1 -16 0 1 1 21 1 -5 0 -14 1 18 0 -19 1 5 
0 16 1 -21 0 3 1 21 0 -26 1 1 0 12 1 7 
1 -12 0 4 1 18 0 -22 1 -1 0 6 1 -13 0 6 
1 -6 0 11 1 -7 1 -3 0 25 1 -26 0 15 1 -5 
0 -10 1 10 0 2 1 8 0 17 1 -15 0 -16 1 -6 
1 2 0 13 1 -2 0 -11 1 10 0 -7 1 -1 0 2 
1 6 0 -7 1 14 0 5 1 -14 1 8 0 -3 1 -7 
0 1 1 3 0 6 5146 3611 100 MP stroke
1 3 0 -19 1 -1 0 28 1 -29 0 51 1 -45 1 -2 
0 -1 1 7 0 1 1 -10 1 -1 0 21 1 -13 1 17 
0 -24 1 3 1 -2 0 7 1 24 0 -23 1 -4 0 1 
1 2 0 -8 1 0 0 17 1 -7 1 3 0 -11 1 9 
0 1 1 -10 0 3 1 5 0 -3 1 2 0 -2 1 16 
0 -17 1 -4 1 11 0 -2 1 7 0 -10 1 -8 0 7 
1 -7 0 6 1 -4 0 7 1 -4 0 11 1 -15 1 -2 
1 8 0 -4 1 5 0 -5 1 6 0 -3 1 9 0 2 
1 -3 0 -10 1 -5 1 7 0 -6 1 11 0 -5 1 -7 
0 9 1 5 0 -14 1 1 0 3 1 -4 1 65 0 -60 
1 -3 0 4 1 7 0 -7 1 4 0 25 1 -22 0 20 
1 -14 0 -6 1 -10 1 4 0 -5 1 -1 0 4 1 -5 
0 28 1 -17 0 -9 5091 3627 100 MP stroke
1 1 0 7 1 -9 0 1 1 -2 1 7 0 2 1 -6 
0 -3 1 24 0 -21 1 0 0 43 1 -46 0 1 1 4 
0 10 1 -4 1 5 0 28 1 -34 0 -2 1 -6 0 22 
1 -23 0 10 1 -4 0 -5 1 8 0 -1 1 -3 1 -3 
0 6 1 1 0 7 1 -12 0 -5 1 27 0 34 1 -29 
1 -32 1 9 1 -2 0 -5 1 -1 0 -1 1 5 0 4 
1 -4 0 21 1 -8 0 -15 1 11 1 -12 0 -1 1 7 
0 -8 1 5 0 -5 1 0 0 17 1 -13 0 2 1 19 
0 -16 1 -5 1 1 0 3 1 0 0 -8 1 15 0 -14 
1 4 0 27 1 -14 0 -15 1 28 0 -19 1 -3 1 18 
0 -25 1 1 0 8 1 4 0 -2 1 7 0 -19 1 -1 
0 7 1 18 0 -23 1 61 1 -61 0 -1 1 7 0 3 
1 -1 0 8 1 -3 5036 3614 100 MP stroke
0 -14 1 11 0 -8 1 6 1 42 0 -41 1 -9 1 14 
0 3 1 -19 0 10 1 -8 0 -1 1 15 0 -9 1 0 
1 -1 0 11 1 1 0 5 1 -15 0 -2 1 3 0 -7 
1 61 0 -51 1 6 0 -13 1 23 1 -1 0 -9 1 14 
0 -19 1 7 0 5 1 -25 0 2 1 -1 0 13 1 12 
0 -21 1 7 1 -10 0 11 1 43 0 -56 1 15 0 -6 
1 -9 0 8 1 -6 0 1 1 13 0 -16 1 3 1 3 
0 42 1 -22 0 -10 1 -7 0 21 1 -23 0 1 1 15 
0 -4 1 -3 1 -11 0 1 1 7 0 -12 1 13 0 -10 
1 -3 0 14 1 -6 0 45 1 -40 0 -13 1 9 1 5 
0 4 1 12 0 -21 1 -2 0 41 1 -35 0 -12 1 18 
0 -2 1 -11 0 10 1 -13 1 -3 1 -1 0 12 1 4 
0 -11 1 3 0 -7 4982 3628 100 MP stroke
1 -1 0 1 1 7 0 -6 1 1 1 8 0 -3 1 -6 
0 4 1 15 0 -14 1 12 0 -16 1 -3 0 13 1 -11 
0 25 1 -12 1 -10 0 -4 1 0 0 14 1 3 0 19 
1 -4 0 -15 1 -12 0 -5 1 0 1 4 0 14 1 8 
0 -17 1 -5 0 -4 1 16 0 -11 1 16 0 -14 1 12 
0 17 1 -30 1 -5 0 21 1 23 0 -35 1 -7 0 -2 
1 0 0 6 1 -3 0 9 1 -10 1 -1 1 -1 0 3 
1 3 0 -8 1 9 0 -5 1 2 0 1 1 -4 0 10 
1 -7 0 7 1 -4 1 -2 0 15 1 -14 0 4 1 -10 
0 -2 1 33 0 -12 1 -15 0 -3 1 3 0 -4 1 25 
1 -21 0 -1 1 -1 0 23 1 -23 0 6 1 30 0 -33 
1 -7 1 1 1 4 0 1 1 -4 0 14 1 -2 0 -9 
1 -1 0 -3 1 2 4927 3626 100 MP stroke
0 -3 1 3 1 21 1 -24 0 3 1 8 0 -9 1 -2 
0 15 1 1 0 -15 1 5 0 -5 1 0 0 34 1 -33 
1 4 0 5 1 -8 0 10 1 -11 0 27 1 10 0 -18 
1 -19 0 6 1 30 0 -35 1 -1 1 0 0 3 1 2 
0 20 1 -20 0 -3 1 -1 0 20 1 -22 0 10 1 17 
0 -10 1 4 1 -20 0 -2 1 26 0 -6 1 13 0 -33 
1 6 0 1 1 -3 0 4 1 -1 1 7 0 23 1 -22 
0 3 1 -11 0 -7 1 14 0 -6 1 3 0 6 1 -4 
0 -7 1 2 1 24 0 -29 1 -3 0 14 1 -13 0 17 
1 -14 0 -2 1 -1 0 50 1 -21 0 -11 1 -18 1 9 
0 6 1 1 0 12 1 -10 0 -14 1 -1 0 5 1 -6 
0 9 1 0 0 -8 1 -2 1 29 0 -19 1 -6 0 -4 
1 100 0 -99 1 27 4873 3599 100 MP stroke
0 -23 1 -7 0 11 1 -10 0 18 1 -18 1 28 0 -23 
1 31 0 -20 1 -14 0 16 1 -17 0 48 1 -34 0 -2 
1 -9 1 -3 0 20 1 -20 1 -1 0 13 1 -9 0 -3 
1 0 0 22 1 3 0 -1 1 -9 1 -1 0 -9 1 -5 
1 4 0 17 1 -9 0 -14 1 24 0 -14 1 17 0 -9 
1 -15 1 1 0 41 1 -45 0 11 1 -6 0 24 1 -20 
0 8 1 -15 0 -2 1 4 0 -3 1 3 1 7 0 8 
1 -10 0 -2 1 -5 0 63 1 -61 0 1 1 6 0 -11 
1 30 1 -13 0 20 1 -19 0 -6 1 13 0 -18 1 -3 
0 47 1 -24 0 -14 1 -11 0 8 1 -5 1 8 0 -12 
1 5 0 10 1 -4 0 -7 1 6 1 4 0 -8 1 7 
0 -10 1 -2 1 2 0 4 1 -5 0 5 1 12 0 -20 
1 52 0 -50 1 -1 4818 3628 100 MP stroke
0 6 1 14 0 -12 1 37 1 -34 0 -6 1 -3 0 14 
1 1 0 4 1 -15 0 36 1 -39 0 2 1 -2 1 -2 
1 4 0 -6 1 18 0 -17 1 3 0 -3 1 18 0 -19 
1 0 0 27 1 8 1 -31 1 0 0 3 1 12 0 10 
1 -25 0 19 1 -13 0 -10 1 5 0 5 1 -7 1 9 
0 -1 1 -6 0 45 1 -33 0 -16 1 21 0 26 1 -41 
0 10 1 59 0 -72 1 23 1 -17 0 -6 1 9 0 -10 
1 0 0 9 1 -11 0 9 1 -4 0 -4 1 29 0 -10 
1 -17 1 12 0 -16 1 40 0 -28 1 -10 1 14 0 -7 
1 -2 0 28 1 -33 0 2 1 5 1 1 0 -8 1 22 
0 -8 1 -14 0 5 1 -2 0 -3 1 7 0 9 1 4 
1 -2 0 -16 1 14 0 -6 1 2 0 8 1 -3 0 -9 
1 -9 0 11 1 0 4763 3617 100 MP stroke
0 -7 1 -5 1 57 0 -57 1 57 0 -31 1 -23 0 -3 
1 11 0 -4 1 -1 0 -5 1 4 0 8 1 -10 1 -2 
0 -1 1 10 0 3 1 -11 0 -1 1 29 0 -30 1 1 
0 27 1 45 0 -69 1 0 1 0 0 3 1 16 0 -20 
1 -1 0 -2 1 23 0 4 1 -24 0 6 1 32 0 -22 
1 -16 1 3 0 -3 1 -3 0 1 1 3 0 -4 1 2 
0 41 1 -2 0 -41 1 0 1 8 0 6 1 -12 0 14 
1 -11 0 -4 1 18 0 -18 1 6 0 2 1 -8 0 1 
1 3 1 -5 0 4 1 20 0 -17 1 3 0 -5 1 34 
0 -33 1 -1 0 6 1 12 0 -17 1 -5 1 3 0 35 
1 -6 0 -16 1 2 0 -17 1 -2 0 7 1 2 0 -5 
1 -2 0 9 1 16 1 13 0 -39 1 6 0 55 1 -39 
0 -18 1 0 0 5 4710 3619 100 MP stroke
1 -6 0 58 1 -39 0 -2 1 -13 1 10 0 2 1 -20 
0 22 1 -13 0 6 1 -10 1 -5 0 35 1 16 1 -51 
0 57 1 -43 0 38 1 -37 0 -12 1 4 0 -6 1 1 
0 2 1 23 0 4 1 -13 1 -9 0 1 1 -6 0 -3 
1 4 0 3 1 8 0 27 1 -43 1 1 0 11 1 7 
1 3 0 3 1 -12 0 10 1 -21 0 8 1 -7 0 54 
1 -28 0 24 1 -40 0 23 1 -11 1 -17 0 24 1 -19 
0 -11 1 9 0 -7 1 4 0 3 1 -11 0 23 1 -22 
0 16 1 -17 1 8 0 -6 1 0 0 10 1 -10 0 9 
1 -7 0 5 1 -3 0 10 1 -11 1 43 0 -43 1 35 
0 -24 1 -14 0 6 1 -1 0 3 1 -8 0 6 1 36 
0 -42 1 0 1 -1 0 6 1 13 0 12 1 -20 0 -11 
1 7 0 1 1 -8 4655 3628 100 MP stroke
0 16 1 -3 0 27 1 -14 1 -23 0 12 1 -15 1 16 
0 -2 1 8 0 -13 1 22 0 -31 1 9 0 7 1 -2 
1 7 1 -14 0 -7 1 26 0 -25 1 5 0 11 1 -12 
0 27 1 -31 0 6 1 -5 1 9 0 8 1 -15 0 18 
1 -21 0 5 1 13 0 -3 1 14 0 -19 1 -9 1 8 
0 4 1 -2 0 -7 1 11 0 -14 1 23 0 6 1 -17 
0 -12 1 8 0 -2 1 -6 1 -2 0 8 1 2 1 2 
0 8 1 18 0 -36 1 -1 0 10 1 17 0 -22 1 -7 
1 6 0 9 1 -8 0 -5 1 24 0 -20 1 3 0 -6 
1 7 0 4 1 5 0 3 1 -20 1 16 0 2 1 -20 
0 5 1 9 0 -5 1 -8 0 4 1 -4 0 22 1 -22 
1 1 0 2 1 -4 0 10 1 -2 0 37 1 -41 0 4 
1 -1 0 -6 1 -1 4600 3629 100 MP stroke
0 4 1 12 1 0 0 -6 1 -10 0 53 1 -52 0 14 
1 -9 0 -6 1 1 0 8 1 -8 0 2 1 11 1 -6 
0 7 1 -12 1 2 0 1 1 -4 0 16 1 -12 1 -5 
0 7 1 -7 1 -1 0 14 1 -1 1 -12 0 1 1 11 
0 -12 1 37 0 -38 1 27 0 -7 1 -19 1 12 0 -8 
1 17 0 -17 1 17 0 -19 1 5 0 -6 1 -1 0 6 
1 15 1 -22 0 12 1 -6 0 13 1 -14 0 -1 1 -1 
0 6 1 -9 0 30 1 2 0 -18 1 -5 1 11 0 -13 
1 -2 0 -3 1 9 0 10 1 -14 0 6 1 -2 0 29 
1 -39 0 13 1 5 1 -17 0 -1 1 10 0 -11 1 14 
0 -1 1 -12 0 25 1 -24 0 -2 1 2 0 5 1 9 
1 5 0 9 1 -6 0 9 1 -32 0 1 1 8 0 6 
1 -4 0 10 1 48 4545 3559 100 MP stroke
0 -65 1 -4 1 0 0 23 1 -15 0 -9 1 4 0 -3 
1 10 0 -8 1 3 0 -4 1 40 1 -33 0 -5 1 15 
0 -3 1 -6 0 -9 1 1 0 3 1 18 0 -9 1 24 
0 -28 1 4 1 -14 0 15 1 12 0 -12 1 -7 0 -8 
1 0 0 20 1 -7 0 -2 1 19 0 -18 1 -5 1 21 
0 -26 1 -2 0 38 1 -36 0 10 1 -11 0 4 1 -4 
0 43 1 -43 0 -1 1 9 1 12 0 -15 1 4 0 1 
1 -1 0 1 1 -3 0 -5 1 -3 0 7 1 -5 0 3 
1 47 1 -44 0 10 1 4 0 -19 1 -1 0 5 1 18 
0 24 1 -49 0 1 1 7 1 9 0 -6 1 -6 0 -1 
1 26 0 -6 1 -20 0 -2 1 12 0 13 1 -24 0 -2 
1 1 1 1 0 25 1 -26 1 34 0 -10 1 -24 0 31 
1 -31 0 -1 1 3 4491 3625 100 MP stroke
0 6 1 -9 1 -1 0 6 1 16 0 -10 1 -10 0 8 
1 -6 1 -2 0 10 1 -1 0 17 1 -21 1 -7 0 23 
1 -18 0 10 1 2 0 -16 1 5 0 38 1 -43 0 1 
1 -2 0 17 1 12 1 -8 0 -14 1 -4 0 4 1 3 
0 -1 1 -8 1 1 0 7 1 6 1 12 0 -20 1 -5 
0 -2 1 4 0 83 1 3 0 -75 1 4 0 6 1 -16 
0 -6 1 -1 1 8 0 -7 1 10 0 -12 1 3 0 25 
1 -24 0 52 1 -49 0 9 1 -16 0 6 1 7 1 -14 
0 42 1 -37 0 -2 1 -3 1 15 0 10 1 -25 0 18 
1 0 0 -16 1 -2 1 12 0 1 1 43 0 -45 1 16 
0 -27 1 11 0 18 1 -10 0 -3 1 2 0 -14 1 2 
1 -5 0 15 1 7 0 27 1 -29 0 -14 1 22 1 47 
0 -73 1 -3 1 29 4435 3600 100 MP stroke
0 6 1 -29 0 7 1 -4 0 13 1 -6 0 -7 1 4 
0 9 1 -22 0 4 1 8 1 -11 0 -1 1 35 0 -26 
1 -3 0 -3 1 -1 0 12 1 -13 0 38 1 -35 0 1 
1 4 1 0 0 -4 1 -1 0 9 1 -8 0 11 1 -13 
0 26 1 -24 0 12 1 -15 0 20 1 -19 1 10 0 -7 
1 -2 0 -2 1 5 0 -2 1 3 0 9 1 8 0 -21 
1 -4 0 44 1 -38 1 7 0 1 1 -11 0 16 1 -14 
0 2 1 0 0 76 1 -56 0 -24 1 7 1 -8 0 28 
1 -21 0 -3 1 1 0 -6 1 3 0 15 1 -18 0 4 
1 8 0 -10 1 2 1 2 0 -5 1 11 0 -11 1 3 
0 36 1 -34 0 4 1 -5 0 18 1 -5 0 -2 1 5 
1 -20 0 5 1 -1 0 9 1 -6 0 20 1 -17 1 -12 
0 1 1 9 0 4 4382 3615 100 MP stroke
1 -3 1 -11 0 19 1 -12 0 -5 1 -2 0 18 1 13 
0 -27 1 2 0 -5 1 19 0 -20 1 45 1 -45 0 11 
1 -11 0 6 1 4 0 -10 1 28 0 -19 1 -9 0 9 
1 -1 1 1 0 -1 1 -8 1 9 0 -7 1 11 0 -12 
1 14 0 -12 1 17 0 -17 1 -3 1 9 0 17 1 -25 
0 5 1 -3 0 5 1 8 0 -3 1 -2 0 -5 1 6 
0 -3 1 12 1 -13 0 -2 1 -5 1 -1 0 5 1 -3 
0 1 1 9 0 25 1 -37 0 1 1 21 1 -21 0 5 
1 6 0 -8 1 9 0 -10 1 12 0 -11 1 0 0 13 
1 -14 1 17 0 9 1 -21 0 -1 1 14 0 -17 1 -3 
0 46 1 -40 0 -5 1 2 0 10 1 -9 1 2 0 -3 
1 31 0 -29 1 0 1 -4 -1 0 2 14 0 7 1 -18 
0 9 1 -13 1 0 4326 3628 100 MP stroke
0 10 1 6 0 -4 1 -2 0 2 1 8 0 1 1 -10 
0 1 1 5 0 8 1 34 1 -49 0 -2 1 5 0 -2 
1 7 0 -8 1 18 0 -29 1 30 0 -12 1 -6 0 -7 
1 21 1 -14 1 23 0 -20 1 -12 0 4 1 0 0 16 
1 -10 0 -12 1 13 1 6 0 -4 1 -13 0 1 1 -2 
1 3 0 1 1 2 0 3 1 4 0 -7 1 2 1 20 
0 -22 1 10 0 -14 1 -4 0 1 1 14 0 -7 1 -7 
0 21 1 -22 0 20 1 19 1 -20 0 -15 1 18 0 -22 
1 2 0 9 1 -5 0 -5 1 12 0 -6 1 2 1 13 
1 -19 0 -2 1 -1 0 8 1 8 0 17 1 -4 0 -2 
1 8 0 -19 1 -14 0 3 1 0 1 3 0 5 1 -3 
0 2 1 2 0 -10 1 -2 1 -1 0 15 1 -11 1 5 
0 15 1 -20 0 -3 4271 3627 100 MP stroke
1 38 0 -38 1 14 0 -6 1 -6 1 5 0 -1 1 31 
1 -32 0 13 1 -15 0 25 1 -9 0 -20 1 11 0 -11 
1 12 0 30 1 -34 0 2 1 -3 1 -6 0 22 1 -6 
0 -8 1 -9 0 58 1 -55 0 -2 1 14 0 3 1 -9 
0 -10 1 2 1 3 0 4 1 11 0 -17 1 35 0 -38 
1 18 0 -11 1 16 0 -17 1 18 0 -3 1 -18 1 28 
0 -29 1 20 0 -16 1 -4 0 8 1 -3 0 -2 1 3 
0 -1 1 -4 1 23 0 -13 1 19 0 -22 1 5 0 -13 
1 3 0 10 1 -4 0 3 1 -5 0 -3 1 9 1 11 
0 -25 1 0 0 3 1 3 0 26 1 -28 0 -3 1 3 
0 9 1 -7 1 -6 1 17 0 -17 1 29 0 -17 1 2 
0 -12 1 2 0 -4 1 1 0 3 1 -3 0 -1 1 1 
1 4 1 47 0 -42 4216 3618 100 MP stroke
1 1 0 -12 1 2 0 -2 1 0 0 32 1 -32 0 2 
1 -1 1 2 0 6 1 -6 1 6 0 -8 1 11 0 -1 
1 -7 0 6 1 22 1 -19 0 -10 1 27 0 -19 1 1 
0 -7 1 5 0 -9 1 0 0 7 1 -8 0 2 1 29 
1 -8 0 -22 1 53 0 -45 1 -3 0 -3 1 3 0 13 
1 -14 0 -2 1 15 0 -13 1 -1 1 11 0 -15 1 0 
0 7 1 22 0 -24 1 17 0 -12 1 -3 0 10 1 2 
0 -13 1 19 1 -7 0 -7 1 -11 0 27 1 -18 0 -1 
1 3 0 -3 1 -8 0 34 1 -34 0 19 1 0 1 -18 
1 8 0 -5 1 3 0 1 1 -1 0 -3 1 1 1 24 
1 -28 0 22 1 -21 0 13 1 -5 0 -3 1 1 0 -2 
1 5 0 -8 1 1 0 6 1 -3 1 9 0 -14 1 5 
0 -3 1 3 0 14 4161 3608 100 MP stroke
1 -19 0 15 1 -13 0 2 1 -5 0 8 1 2 1 -4 
0 -3 1 -1 1 3 0 4 1 -10 0 2 1 -1 0 24 
1 -24 0 9 1 -3 1 -6 1 22 1 -11 0 -3 1 -2 
0 1 1 1 0 6 1 -13 0 3 1 9 1 -9 0 7 
1 -3 0 17 1 -15 0 9 1 -16 0 40 1 -38 0 -5 
1 0 1 22 0 -11 1 19 0 -24 1 -1 0 15 1 11 
0 -3 1 -21 0 -8 1 7 0 -4 1 52 1 -22 0 -29 
1 6 0 -3 1 -7 0 5 1 -4 0 3 1 8 0 9 
1 -21 0 4 1 29 1 -28 0 -5 1 0 0 51 1 -49 
0 3 1 1 0 49 1 -35 0 -14 1 -6 0 10 1 6 
1 -14 0 3 1 1 0 1 1 -4 1 38 0 -41 1 2 
0 5 1 23 0 -28 1 21 1 -15 0 -2 1 12 0 17 
1 -17 0 -10 1 -7 4105 3628 100 MP stroke
0 12 1 6 0 -3 1 -3 1 -10 0 20 1 -21 0 13 
1 -7 0 -4 1 -4 0 26 1 19 0 -37 1 12 0 -19 
1 8 1 -9 0 46 1 -37 0 -9 1 11 0 -9 1 -2 
0 5 1 6 0 -9 1 14 0 -15 1 8 1 0 0 -5 
1 -2 0 33 1 -24 0 15 1 7 0 -16 1 -6 0 -11 
1 3 0 1 1 -4 1 19 0 -3 1 12 0 18 1 -44 
0 11 1 -12 0 2 1 42 0 -37 1 -1 1 -7 0 45 
1 -10 0 -25 1 -10 0 5 1 -2 0 18 1 -20 0 2 
1 13 1 -1 1 31 0 -15 1 -31 1 6 0 52 1 -57 
0 10 1 -11 0 15 1 -14 0 16 1 1 1 -8 0 12 
1 -18 0 30 1 -26 0 14 1 4 0 -18 1 -4 0 30 
1 -22 0 16 1 -26 1 13 0 -13 1 12 0 32 1 -37 
0 8 1 -17 1 5 4050 3624 100 MP stroke
0 8 1 -12 0 17 1 -10 1 3 0 -11 1 14 1 17 
0 -3 1 -19 0 1 1 2 0 26 1 -26 1 8 0 -14 
1 -5 0 32 1 -33 0 18 1 -8 1 -4 1 1 0 9 
1 -10 1 -5 0 20 1 1 0 -14 1 -4 0 16 1 -18 
0 20 1 -19 0 5 1 0 0 -6 1 8 1 -7 0 12 
1 39 0 -50 1 6 0 32 1 -27 0 -15 1 0 0 17 
1 -10 0 8 1 -15 1 9 0 -7 1 3 0 24 1 -7 
0 -22 1 5 0 -3 1 2 0 28 1 -23 0 -5 1 -2 
1 21 0 -16 1 -6 0 5 1 0 0 -6 1 8 0 71 
1 -66 0 13 1 0 1 -6 0 -16 1 -1 0 3 1 8 
0 -12 1 1 0 22 1 -24 0 28 1 -19 0 -7 1 3 
1 -6 0 10 1 2 0 7 1 -17 0 17 1 -14 1 -4 
0 35 1 1 0 -31 3995 3623 100 MP stroke
1 0 1 -5 0 13 1 -10 0 1 1 -5 1 9 0 9 
1 -18 0 9 1 -5 0 2 1 21 1 -27 0 32 1 -28 
0 9 1 18 0 -28 1 31 0 -11 1 -13 0 -2 1 17 
0 -24 1 38 1 -38 0 32 1 -23 0 17 1 -25 1 13 
0 34 1 -45 0 7 1 32 1 -8 0 -32 1 -3 0 15 
1 7 0 8 1 -16 0 15 1 -22 0 -6 1 22 0 -17 
1 -4 1 48 0 -36 1 2 0 -5 1 -10 0 19 1 -3 
0 -5 1 6 0 -8 1 -4 0 -1 1 27 1 -27 1 26 
0 -21 1 13 0 -20 1 3 0 16 1 -21 0 -1 1 1 
0 41 1 -35 1 -6 0 7 1 -4 0 30 1 -20 0 -12 
1 11 0 -2 1 -5 0 -2 1 0 0 16 1 -18 1 -1 
0 4 1 -4 0 20 1 -1 0 -20 1 9 0 -8 1 2 
0 16 1 -12 1 9 3939 3613 100 MP stroke
0 -15 1 16 0 -7 1 -2 0 11 1 23 0 -14 1 -19 
0 -6 1 20 0 -23 1 4 1 -2 0 14 1 -15 0 22 
1 -18 0 15 1 -18 0 -2 1 1 0 27 1 -13 0 17 
1 -23 1 15 0 -22 1 7 0 -4 1 19 0 -3 1 -18 
1 1 1 0 0 -4 1 17 1 -11 1 -2 0 -3 1 13 
0 -10 1 9 0 -6 1 25 0 -23 1 -1 0 8 1 16 
1 -21 0 -8 1 8 0 18 1 -18 0 -6 1 35 0 -25 
1 -1 0 3 1 -13 1 2 0 -4 1 31 0 -33 1 3 
0 4 1 -3 0 -3 1 6 0 7 1 -11 0 6 1 -1 
1 -2 0 4 1 -9 1 -1 0 2 1 -2 0 7 1 5 
0 -9 1 4 0 4 1 2 1 -5 0 -3 1 11 0 13 
1 -20 0 14 1 -17 0 4 1 -6 0 37 1 -29 0 -9 
1 28 1 -17 1 -10 3883 3625 100 MP stroke
0 5 1 21 0 -24 1 16 0 -17 1 25 0 -19 1 -10 
0 -1 1 8 1 0 0 -4 1 4 0 2 1 -10 0 9 
1 -8 0 13 1 3 0 -17 1 1 1 1 0 9 1 16 
0 -18 1 -2 0 -4 1 -3 0 20 1 -3 0 -2 1 -3 
0 -8 1 -3 1 13 1 -10 -1 0 2 -4 0 18 1 16 
0 -25 1 9 0 -15 1 18 0 -19 1 17 1 -10 0 -5 
1 6 0 11 1 26 0 -44 1 0 0 6 1 -4 0 -4 
1 17 0 -3 1 -7 1 2 0 -2 1 2 0 -6 1 -4 
0 9 1 13 0 -17 1 6 0 15 1 -14 0 -7 1 15 
1 -20 0 20 1 -12 1 1 0 20 1 -16 0 -1 1 -12 
0 22 1 12 1 -16 0 3 1 -7 0 -8 1 9 0 5 
1 0 0 -14 1 -6 0 13 1 22 0 -9 1 -19 1 17 
0 -22 1 -1 1 24 3828 3604 100 MP stroke
0 -15 1 4 0 3 1 -10 0 11 1 -10 0 -3 1 1 
1 4 0 -10 1 2 0 12 1 -11 0 -3 1 0 0 5 
1 15 0 -11 1 3 0 -4 1 2 1 12 0 -14 1 1 
0 20 1 -7 0 -3 1 0 0 -11 1 -2 0 12 1 -17 
1 0 0 6 1 -3 0 12 1 24 0 -40 1 32 0 -24 
1 4 0 -9 1 26 0 -26 1 9 1 -7 0 4 1 -5 
0 5 1 -7 1 -1 0 2 1 26 0 7 1 -35 0 4 
1 -3 1 6 0 -1 1 1 0 -2 1 11 0 -14 1 -1 
0 -1 1 28 0 -27 1 2 0 9 1 -1 1 -10 0 -1 
1 4 0 -3 1 -2 1 5 1 17 0 -16 1 -3 0 4 
1 1 1 41 0 -19 1 -30 0 9 1 -2 0 -5 1 6 
0 -2 1 -5 0 -1 1 8 1 20 0 -21 1 -6 0 14 
1 -12 0 5 1 -2 3773 3623 100 MP stroke
0 -4 1 11 0 16 1 -13 0 -10 1 -4 1 4 0 14 
1 -1 0 -14 1 -1 0 2 1 10 0 -10 1 -1 0 24 
1 -9 0 52 1 -68 1 1 0 1 1 -5 0 9 1 -6 
0 4 1 -2 0 4 1 24 0 -34 1 12 0 4 1 -13 
1 -3 0 19 1 -12 0 18 1 -15 0 -9 1 2 0 2 
1 17 0 -11 1 -5 0 13 1 -1 1 -15 0 -2 1 7 
0 42 1 -49 0 42 1 -42 0 15 1 8 0 -9 1 -2 
1 -9 0 11 1 -10 0 -2 1 3 0 3 1 -5 0 23 
1 -22 0 17 1 -11 0 39 1 -50 1 2 0 10 1 -12 
1 19 0 -11 1 -1 0 3 1 15 0 -12 1 8 0 18 
1 -34 1 21 0 -14 1 -11 0 1 1 17 0 22 1 -39 
0 6 1 -2 0 -4 1 19 0 -15 1 4 1 6 0 -9 
1 12 0 21 1 -18 3719 3607 100 MP stroke
0 -18 1 4 0 12 1 -19 0 14 1 -9 0 25 1 -31 
1 1 0 3 1 12 0 4 1 -16 0 7 1 -4 0 -4 
1 -3 0 5 1 -5 1 3 0 21 1 14 0 -23 1 -7 
0 16 1 -12 0 -7 1 -2 0 -2 1 21 0 -14 1 -6 
1 20 0 7 1 -2 0 -8 1 -6 0 5 1 -14 0 31 
1 -34 0 32 1 -30 0 27 1 -17 1 20 0 -8 1 -17 
0 -7 1 3 0 4 1 -5 0 -1 1 36 0 -37 1 36 
0 -34 1 1 1 4 0 -5 1 4 0 10 1 16 0 -29 
1 10 0 -1 1 -9 0 24 1 -3 0 -24 1 9 1 5 
0 -15 1 3 0 3 1 0 0 17 1 -18 0 -3 1 20 
0 -19 1 7 1 -7 0 13 1 -14 0 4 1 3 0 -2 
1 12 0 -4 1 16 0 -15 1 0 0 -16 1 17 1 -10 
0 4 1 -4 0 6 3666 3616 100 MP stroke
1 -10 0 10 1 -7 0 31 1 -37 1 1 0 4 1 5 
1 -1 0 4 1 1 0 -6 1 23 0 -21 1 -6 0 -3 
1 16 0 -8 1 16 0 -19 1 1 1 -5 0 1 1 5 
0 9 1 -16 0 1 1 1 0 7 1 -4 0 3 1 17 
0 -20 1 5 1 -4 0 -6 1 9 0 -2 1 -7 0 3 
1 7 0 7 1 7 0 -24 1 2 1 0 0 16 1 -15 
0 -1 1 17 0 -14 1 2 0 -7 1 2 0 4 1 2 
0 -3 1 31 1 -10 0 -21 1 11 0 6 1 -18 0 2 
1 13 0 -19 1 13 0 38 1 -36 0 -15 1 0 1 23 
0 -4 1 -18 1 38 0 -12 1 -26 0 34 1 -33 0 -3 
1 17 0 -7 1 -2 1 12 0 -13 1 0 0 23 1 -29 
0 8 1 5 0 -13 1 5 0 -3 1 9 0 1 1 -1 
1 -9 0 7 1 36 3611 3583 100 MP stroke
0 -38 1 9 0 -12 1 0 0 16 1 -15 0 7 1 -9 
1 16 0 4 1 -4 0 -7 1 -10 0 13 1 -5 0 8 
1 9 0 -22 1 7 0 -9 1 -3 1 1 0 42 1 -35 
0 -6 1 0 0 18 1 -18 0 30 1 -31 0 3 1 5 
0 8 1 22 1 -37 1 -2 0 8 1 -6 0 18 1 -12 
0 16 1 -11 0 35 1 -46 0 17 1 -10 1 21 0 -30 
1 9 0 -4 1 -1 1 8 1 34 0 -46 1 -1 1 3 
0 10 1 1 0 -11 1 2 0 9 1 1 0 -7 1 4 
0 -5 1 -1 0 -1 1 8 1 -6 0 3 1 3 0 -13 
1 3 0 6 1 -4 0 4 1 1 0 -8 1 0 0 8 
1 -7 1 17 0 -6 1 -13 1 -1 0 40 1 -37 0 18 
1 -2 0 1 1 -18 0 6 1 -8 1 25 0 -20 1 0 
0 2 1 10 0 -5 3556 3617 100 MP stroke
1 -7 0 6 1 3 0 6 1 -20 0 1 1 9 1 -6 
0 17 1 10 0 -4 1 -12 0 15 1 -17 0 2 1 -8 
0 15 1 -19 1 24 0 -21 1 8 0 4 1 -15 0 15 
1 -10 0 -5 1 9 0 26 1 -37 0 1 1 6 1 14 
0 -21 1 8 0 40 1 -46 0 15 1 -13 0 3 1 -3 
0 -1 1 -2 0 19 1 -14 1 -6 0 22 1 -13 0 -5 
1 -1 0 14 1 -12 0 -6 1 2 0 3 1 28 0 -27 
1 -3 1 -1 0 -2 1 6 0 -1 1 -4 0 9 1 5 
0 -13 1 44 0 -46 1 21 0 29 1 -45 1 -5 0 1 
1 1 0 32 1 -6 0 -20 1 -2 0 -1 1 -2 0 1 
1 -3 1 6 0 -7 1 6 0 -2 1 10 0 2 1 -8 
0 -2 1 6 0 -8 1 -3 0 6 1 -1 1 -4 0 2 
1 9 0 4 1 5 3502 3607 100 MP stroke
0 -21 1 45 0 -44 1 7 1 -8 -1 0 2 -1 1 33 
0 -16 1 -17 0 15 1 -12 0 5 1 -7 0 9 1 -10 
0 1 1 44 0 -26 1 -1 1 -13 0 -4 1 15 0 -11 
1 -4 0 8 1 -9 0 24 1 -21 0 20 1 -22 0 8 
1 -1 1 1 1 -9 0 31 1 -18 0 17 1 -26 0 -4 
1 28 0 -19 1 -6 1 2 1 -1 0 41 1 -44 0 51 
1 -51 0 31 1 -17 0 5 1 -13 0 -2 1 -2 1 -2 
0 3 1 15 0 23 1 -27 0 -4 1 -5 0 21 1 -13 
0 26 1 -37 0 -1 1 13 1 -14 0 5 1 13 0 -18 
1 32 0 -4 1 -15 0 -12 1 -2 0 5 1 -3 0 2 
1 4 1 -3 0 8 1 -8 0 4 1 13 0 -21 1 3 
0 -4 1 9 0 34 1 -36 0 -2 1 -3 1 3 0 -2 
1 24 0 2 1 -27 3447 3627 100 MP stroke
0 2 1 11 0 -8 1 -2 0 12 1 -13 1 -1 0 25 
1 -27 0 10 1 12 0 -19 1 20 0 -16 1 4 0 -6 
1 -5 0 5 1 -5 1 21 0 -4 1 -10 0 24 1 -31 
0 3 1 -3 0 1 1 1 0 8 1 8 0 36 1 -41 
1 -2 0 -10 1 2 0 31 1 -17 0 -12 1 8 0 -5 
1 -3 1 -5 0 2 1 0 1 -1 0 1 1 -1 0 -2 
1 17 0 -12 1 25 0 -29 1 13 0 -5 1 5 0 15 
1 -25 1 -4 0 2 1 18 0 -13 1 -7 0 31 1 -25 
0 -1 1 -4 0 5 1 13 1 -14 0 3 1 -2 0 14 
1 -15 0 6 1 -10 0 4 1 15 0 -20 1 8 0 1 
1 33 1 8 0 -24 1 -23 0 12 1 -15 0 6 1 -2 
0 6 1 11 0 -6 1 5 0 12 1 -28 1 8 0 -11 
1 3 0 6 1 -9 3393 3628 100 MP stroke
0 31 1 -31 0 32 1 -31 0 -1 1 15 0 -13 1 4 
1 0 0 4 1 7 0 -15 1 3 0 -4 1 4 1 0 
0 15 1 -16 0 3 1 -8 1 26 0 -26 1 38 0 23 
1 -34 0 -25 1 3 0 -4 1 2 0 2 1 21 1 -11 
0 -4 1 -9 1 1 0 17 1 2 0 -6 1 0 0 -12 
1 2 0 -2 1 41 1 -40 0 -4 1 26 0 -17 1 4 
0 21 1 -18 0 -17 1 1 0 14 1 -5 0 -9 1 9 
1 -9 0 3 1 10 0 -6 1 -2 0 -3 1 4 0 -7 
1 7 0 4 1 -9 0 10 1 -6 1 15 0 -17 1 11 
0 -5 1 35 0 -39 1 2 0 27 1 -34 0 1 1 13 
0 6 1 5 1 -15 0 -10 1 15 0 -15 1 -1 0 2 
1 10 0 34 1 -45 0 17 1 -5 1 -10 0 29 1 -19 
0 2 1 -9 0 -2 3339 3625 100 MP stroke
1 3 0 -1 1 -1 0 -4 1 7 0 5 1 -8 1 12 
0 -16 1 12 0 -7 1 -4 0 9 1 3 0 -4 1 11 
0 -21 1 9 1 6 1 -12 0 23 1 -26 0 14 1 -11 
0 26 1 -18 0 -6 1 9 0 -10 1 -3 0 1 1 5 
1 1 0 4 1 9 0 -13 1 -4 1 -4 0 7 1 38 
0 -37 1 -8 1 40 0 -35 1 6 1 10 0 -21 1 24 
0 -11 1 -11 0 1 1 5 0 42 1 -21 1 -19 0 -2 
1 13 0 -20 1 9 0 -7 1 16 0 -9 1 -9 0 19 
1 -4 1 -1 1 -15 0 3 1 -1 0 2 1 -3 0 6 
1 16 0 -21 1 -2 0 4 1 10 0 -13 1 5 1 1 
1 -6 0 16 1 0 0 8 1 -18 0 8 1 16 0 -31 
1 8 0 -6 1 -2 1 0 0 5 1 -4 0 22 1 -20 
0 6 1 -9 1 5 3282 3624 100 MP stroke
0 4 1 -3 1 -5 0 29 1 -18 0 45 1 -40 0 5 
1 -13 0 -2 1 -1 0 -4 1 46 0 -44 1 4 1 8 
0 -7 1 -6 0 7 1 -1 0 -6 1 32 0 -32 1 2 
0 5 1 -10 1 7 1 37 0 -40 1 12 0 34 1 -28 
0 27 1 -40 0 -5 1 38 0 -41 1 16 0 25 1 -37 
1 -2 0 13 1 1 0 -15 1 19 0 -14 1 -5 1 1 
0 4 1 -2 0 -2 1 0 1 4 0 13 1 1 0 -15 
1 12 0 -10 1 -6 0 -1 1 32 0 -32 1 23 1 -5 
0 -16 1 -2 0 4 1 1 0 6 1 6 0 -7 1 15 
0 2 1 -27 0 63 1 -49 1 -11 0 2 1 -3 0 -3 
1 4 0 -4 1 6 0 24 1 -17 0 -6 1 -6 0 1 
1 -1 1 5 0 22 1 -25 0 33 1 -36 0 29 1 -28 
0 -1 1 4 0 33 3228 3592 100 MP stroke
1 8 0 -24 1 -14 1 9 0 -9 1 6 0 -10 1 6 
0 7 1 -4 0 36 1 -43 0 6 1 32 0 -42 1 1 
1 0 0 40 1 -30 0 11 1 2 0 -18 1 3 0 -6 
1 9 0 -13 1 26 1 -13 0 4 1 -2 0 24 1 -4 
0 -35 1 14 0 -3 1 -5 0 8 1 2 0 -13 1 7 
1 -8 1 27 0 -22 1 -7 0 14 1 -3 0 -10 1 9 
0 12 1 -11 0 37 1 -44 1 -1 0 49 1 -51 0 18 
1 -18 0 2 1 16 0 -14 1 20 0 -10 1 -5 0 8 
1 -14 1 18 0 17 1 -35 0 6 1 -3 0 -7 1 5 
0 22 1 -17 0 -2 1 -2 0 -3 1 34 1 -32 0 -5 
1 11 0 2 1 7 0 -18 1 0 0 7 1 3 0 -10 
1 21 1 -22 0 18 1 -3 0 -10 1 1 0 20 1 -3 
0 -16 1 12 0 -19 3174 3628 100 MP stroke
1 11 0 -6 1 1 1 44 0 -36 1 11 0 -16 1 -6 
0 15 1 -17 0 19 1 7 0 -19 1 -2 0 -2 1 7 
1 -1 0 31 1 -34 0 -5 1 3 0 42 1 -35 0 -8 
1 -5 0 23 1 9 0 -4 1 -24 1 -1 0 35 1 -16 
0 5 1 15 0 -41 1 7 0 -4 1 5 0 3 1 -7 
0 16 1 -20 1 19 0 4 1 -23 0 12 1 -13 0 9 
1 33 0 -42 1 1 0 4 1 1 1 -5 0 20 1 -13 
0 16 1 -14 0 6 1 -5 0 14 1 -25 0 3 1 -1 
0 2 1 21 1 -10 0 1 1 -14 0 7 1 -8 0 2 
1 3 1 17 0 5 1 -26 0 2 1 -1 1 16 0 -3 
1 -16 0 2 1 20 0 -12 1 25 0 -34 1 5 0 16 
1 -20 0 4 1 2 1 2 0 61 1 -64 0 23 1 -26 
0 -3 1 22 0 -6 3120 3612 100 MP stroke
1 -17 0 12 1 31 0 -31 1 0 1 23 0 -35 1 2 
1 34 0 -26 1 2 0 -5 1 -5 0 6 1 -4 1 6 
0 -3 1 -7 0 19 1 4 0 -19 1 18 0 -20 1 12 
0 -11 1 3 0 -5 1 5 1 -6 0 3 1 1 0 7 
1 -11 0 13 1 8 0 39 1 -22 0 -33 1 8 0 -12 
1 0 1 16 0 -11 1 -6 0 2 1 2 0 7 1 18 
0 -22 1 -5 0 32 1 -29 0 10 1 31 1 -46 0 3 
1 32 0 -33 1 19 0 -14 1 -2 0 -3 1 23 0 -25 
1 8 0 3 1 -3 1 -1 0 -6 1 13 0 -12 1 14 
1 4 0 -9 1 -6 0 52 1 -27 1 -27 0 29 1 -19 
0 -5 1 -1 0 8 1 19 0 -31 1 24 0 -24 1 1 
0 -3 1 13 1 -13 0 1 1 6 0 -7 1 35 0 -21 
1 3 0 -14 1 12 3065 3613 100 MP stroke
0 -13 1 6 0 -8 1 15 1 -11 0 -1 1 8 1 -9 
0 5 1 9 1 -17 -1 0 2 13 0 21 1 -24 1 -8 
0 12 1 -3 0 -2 1 -4 0 -5 1 14 0 -3 1 6 
0 -17 1 17 1 -15 0 2 1 -2 0 2 1 -2 0 -2 
1 1 0 32 1 -15 0 -11 1 32 0 -37 1 -2 1 8 
0 -1 1 13 0 3 1 -16 0 20 1 -23 0 8 1 26 
0 -38 1 8 0 -2 1 -5 1 42 0 -41 1 6 0 4 
1 -12 0 2 1 3 0 7 1 -12 0 2 1 2 0 4 
1 -6 1 0 0 5 1 10 0 17 1 -26 1 1 0 -7 
1 10 0 -5 1 -3 0 -1 1 1 1 -1 0 24 1 2 
0 -15 1 -7 0 -3 1 5 0 -6 1 13 0 -15 1 0 
1 7 0 13 1 -14 0 -7 1 19 0 -9 1 -7 0 2 
1 -1 0 10 1 11 3010 3604 100 MP stroke
0 -21 1 11 1 12 0 1 1 -21 0 -3 1 20 0 -23 
1 14 0 -13 1 9 0 5 1 -12 0 52 1 -56 1 2 
0 14 1 -2 0 9 1 -9 0 -9 1 9 0 -8 1 12 
0 -18 1 55 0 -55 1 3 1 -2 0 1 1 9 0 -6 
1 -2 0 2 1 11 0 -14 1 -2 0 1 1 16 0 -16 
1 12 1 0 0 -8 1 2 0 -1 1 3 0 28 1 -34 
0 -2 1 2 0 18 1 -8 1 21 0 2 1 -33 0 26 
1 -27 0 -2 1 1 0 3 1 -3 0 19 1 3 0 -21 
1 6 1 -5 0 1 1 -4 0 2 1 0 0 -2 1 12 
0 -9 1 1 0 -3 1 10 0 -3 1 -3 1 -3 0 -2 
1 6 0 -3 1 -2 0 6 1 -4 0 18 1 -12 0 10 
1 -10 0 -7 1 34 1 -23 0 2 1 26 0 -40 1 8 
0 3 1 -7 0 -2 2957 3626 100 MP stroke
1 4 0 -4 1 11 0 -14 1 1 1 0 0 11 1 -6 
0 14 1 -1 0 -18 1 3 0 6 1 -8 0 10 1 -9 
1 1 0 -4 1 2 0 1 1 2 0 7 1 -11 0 3 
1 8 0 -2 1 -9 0 3 1 15 1 -8 0 -9 1 1 
0 9 1 0 0 4 1 -6 0 -9 1 0 0 19 1 -18 
0 49 1 -31 1 -16 0 45 1 -34 0 -5 1 -4 0 -2 
1 15 0 5 1 -20 0 5 1 38 0 -40 1 -7 1 2 
0 14 1 -12 0 -2 1 17 0 -7 1 -3 0 35 1 -16 
0 -10 1 8 0 -19 1 8 1 -15 0 14 1 -5 0 -6 
1 8 0 -8 1 0 0 21 1 26 0 -49 1 6 1 7 
0 -11 1 9 0 -8 1 12 0 -13 1 5 0 -2 1 9 
0 -4 1 -1 0 -10 1 11 1 -6 0 -5 1 19 0 -17 
1 1 0 30 1 -13 2903 3609 100 MP stroke
0 -19 1 3 0 13 1 -17 0 16 1 17 1 -31 0 1 
1 2 0 -2 1 26 0 -28 1 10 0 4 1 7 0 -22 
1 1 0 3 1 5 1 1 0 -1 1 9 0 11 1 -27 
0 4 1 -4 0 1 1 4 0 -3 1 15 0 -18 1 1 
1 3 0 5 1 12 0 -12 1 7 0 -15 1 5 0 -3 
1 -2 0 37 1 -37 1 11 0 2 1 3 0 -2 1 -7 
0 12 1 -15 0 -4 1 1 0 10 1 30 0 -29 1 -9 
1 6 0 -1 1 6 0 -15 1 32 0 -32 1 24 1 -22 
0 21 1 -10 0 -10 1 -1 1 33 0 -31 1 8 0 -11 
1 21 0 -22 1 3 0 13 1 -17 1 1 0 4 1 2 
1 -5 0 2 1 -4 0 28 1 26 0 -54 1 14 0 -5 
1 3 0 12 1 -17 0 11 1 7 1 -1 0 -18 1 24 
0 -5 1 -24 0 6 2849 3622 100 MP stroke
1 8 0 -4 1 -7 0 -1 1 8 1 42 0 -52 1 22 
0 -13 1 1 0 -11 1 14 0 4 1 -13 0 12 1 -8 
0 46 1 -50 1 -4 0 8 1 -7 0 30 1 -22 0 -8 
1 -2 0 4 1 0 0 34 1 -16 0 -11 1 15 1 -16 
0 2 1 -1 0 -3 1 2 0 -6 1 11 0 -7 1 3 
0 -7 1 16 0 -17 1 -2 1 79 0 -73 1 0 0 11 
1 -17 0 25 1 -15 0 8 1 -4 0 -9 1 7 1 -11 
0 1 1 4 0 -2 1 18 0 -13 1 -1 0 27 1 -26 
0 -10 1 1 0 3 1 9 1 -11 0 2 1 3 0 -2 
1 -3 0 5 1 -6 0 1 1 4 0 7 1 0 0 41 
1 -47 1 -6 0 31 1 3 0 -35 1 15 0 31 1 -42 
0 -1 1 9 0 12 1 -24 0 43 1 -35 1 -8 0 3 
1 -3 0 19 1 -17 2795 3627 100 MP stroke
0 8 1 0 0 24 1 -34 0 32 1 -29 0 -2 1 22 
1 -10 0 -5 1 52 0 -37 1 -7 0 -3 1 -6 0 -4 
1 17 0 20 1 -38 1 -1 0 27 1 -25 0 22 1 -23 
0 -1 1 11 0 12 1 2 0 -23 1 2 0 2 1 -3 
1 6 0 -6 1 0 0 13 1 3 0 1 1 -15 0 9 
1 -3 0 -12 1 16 0 -16 1 4 1 -3 0 -1 1 5 
0 17 1 -21 0 11 1 20 0 -27 1 13 0 -17 1 23 
0 -23 1 15 1 -12 0 14 1 -7 0 4 1 -13 0 14 
1 -11 0 30 1 -18 0 9 1 -20 0 3 1 17 1 -19 
0 -2 1 8 0 -11 1 22 0 -7 1 -14 0 4 1 -2 
0 -5 1 20 1 -19 0 30 1 -6 0 10 1 -33 0 6 
1 10 1 -1 0 11 1 5 0 -7 1 -1 1 -24 0 20 
1 -12 0 -1 1 29 2741 3592 100 MP stroke
0 -21 1 14 0 -26 1 2 0 -5 1 -1 0 42 1 -25 
1 -12 0 18 1 -14 0 3 1 -10 0 23 1 -2 0 -20 
1 0 0 9 1 -4 0 5 1 -4 1 -7 0 3 1 2 
1 18 0 4 1 -21 0 4 1 11 0 -15 1 -5 0 3 
1 -6 1 8 0 -4 1 0 0 31 1 -30 0 -2 1 25 
0 -26 1 6 0 2 1 23 1 -11 0 5 1 -19 0 -2 
1 12 0 5 1 -17 0 13 1 -11 0 4 1 9 0 -20 
1 5 1 15 0 -20 1 13 0 -5 1 -7 0 -2 1 7 
0 -3 1 32 0 -18 1 -11 0 10 1 -7 1 -6 0 3 
1 -2 0 6 1 -7 0 -1 1 6 0 -3 1 3 0 4 
1 -1 0 35 1 -47 1 6 0 22 1 -23 0 33 1 -37 
0 22 1 -16 0 1 1 -2 0 24 1 -22 0 -6 1 0 
1 -1 0 4 1 4 2687 3620 100 MP stroke
0 -4 1 0 0 -4 1 37 0 -38 1 7 0 24 1 -30 
1 9 0 -10 1 16 0 -16 1 21 0 -8 1 -11 0 -1 
1 39 0 -40 1 8 0 4 1 -11 1 24 0 -18 1 -5 
1 1 0 9 1 -11 0 11 1 -8 0 10 1 -3 0 -4 
1 -5 1 23 0 -12 1 14 0 -27 1 0 0 4 1 -4 
0 3 1 -2 0 2 1 -3 1 19 1 4 0 10 1 -3 
0 -27 1 32 0 -18 1 -10 0 12 1 -12 1 -6 0 8 
1 7 1 -8 0 -5 1 37 0 -17 1 -21 0 -2 1 22 
0 -19 1 29 0 -25 1 33 1 -37 0 17 1 -15 0 12 
1 -1 0 -13 1 20 0 7 1 -18 0 -8 1 3 0 11 
1 -9 1 -5 0 8 1 -3 0 -9 1 15 0 -14 1 22 
0 -17 1 -4 0 26 1 0 0 -22 1 -5 1 7 0 1 
1 21 0 -27 1 -2 2632 3628 100 MP stroke
0 31 1 -10 0 -18 1 19 0 12 1 -29 1 -4 1 6 
0 4 1 24 0 -34 1 0 0 7 1 -5 0 9 1 -9 
0 17 1 10 0 -30 1 40 1 -39 0 -2 1 3 0 7 
1 7 0 7 1 -15 0 1 1 -9 0 2 1 11 1 -10 
0 -1 1 3 0 20 1 -12 0 4 1 -2 0 9 1 14 
0 -27 1 -12 0 19 1 -17 1 7 0 -8 1 22 0 -12 
1 19 0 -16 1 33 0 -45 1 38 0 -36 1 6 0 2 
1 1 1 -10 0 -2 1 4 0 -3 1 5 0 5 1 7 
0 -15 1 9 0 6 1 -12 0 -4 1 1 1 43 0 -44 
1 12 0 -3 1 -12 0 12 1 -12 0 10 1 6 0 -2 
1 2 0 -10 1 4 1 12 0 -16 1 -5 0 12 1 -13 
0 25 1 -15 0 -7 1 -1 0 -1 1 48 1 -43 0 20 
1 -9 0 -14 1 25 2578 3601 100 MP stroke
0 -21 1 18 0 4 1 -10 0 -12 1 30 0 -29 1 -8 
1 3 0 3 1 7 0 -5 1 11 0 4 1 -19 0 24 
1 -1 0 -17 1 -10 0 14 1 -6 1 4 0 10 1 -2 
0 -11 1 2 0 -11 1 7 0 2 1 0 0 10 1 -5 
0 -7 1 3 1 -3 0 1 1 12 0 -8 1 -10 0 -2 
1 6 0 1 1 10 0 3 1 11 1 -28 0 5 1 18 
0 -22 1 -1 0 6 1 -9 0 7 1 -1 0 15 1 -15 
0 26 1 -29 1 16 0 -11 1 0 0 6 1 0 0 -6 
1 2 0 -2 1 1 0 -8 1 19 0 -14 1 6 1 -1 
0 -1 1 -5 0 -5 1 1 0 3 1 3 0 -5 1 8 
0 9 1 9 0 -22 1 43 1 -49 0 1 1 13 0 -6 
1 -8 0 50 1 -17 0 -28 1 -1 0 17 1 -20 0 22 
1 -19 1 13 0 -15 2525 3627 100 MP stroke
1 48 0 -37 1 -10 0 13 1 -11 0 -3 1 -1 0 -1 
1 14 1 1 0 -10 1 7 0 4 1 -11 0 9 1 -11 
0 24 1 -16 0 -7 1 3 0 -5 1 21 1 -11 1 -8 
0 3 1 14 0 -21 1 8 0 53 1 -59 0 10 1 -4 
0 2 1 -3 1 -5 0 2 1 9 0 -2 1 -10 0 15 
1 -5 0 -10 1 7 0 32 1 -26 0 -11 1 2 1 1 
0 56 1 -55 0 50 1 -31 0 -26 1 3 0 8 1 3 
0 2 1 7 0 -22 1 4 1 15 0 -10 1 18 0 -18 
1 4 0 -14 1 19 0 13 1 -7 0 -12 1 2 1 -15 
0 9 1 -7 0 3 1 3 0 6 1 -14 1 4 1 14 
0 20 1 -37 1 38 0 -21 1 20 0 -22 1 -6 0 -10 
1 6 0 6 1 -11 0 -1 1 4 0 -1 1 2 1 2 
0 22 1 -24 0 -4 2470 3628 100 MP stroke
1 15 0 -12 1 5 0 -2 1 -2 0 11 1 13 0 -29 
1 0 1 6 0 -4 1 2 0 17 1 48 0 -52 1 -7 
0 8 1 -15 0 14 1 -16 0 7 1 6 1 7 0 -18 
1 25 0 -25 1 2 0 9 1 6 0 -13 1 1 0 9 
1 -4 1 -7 0 -2 1 5 1 -6 0 3 1 23 0 -14 
1 0 0 -10 1 3 0 11 1 -19 1 19 0 4 1 -17 
0 -1 1 10 0 18 1 -29 0 20 1 -24 0 19 1 -8 
0 -8 1 3 1 9 0 -12 1 4 0 22 1 18 0 -43 
1 26 0 -1 1 -2 0 8 1 -29 0 15 1 -13 1 -3 
0 -3 1 25 0 2 1 -22 0 18 1 -10 0 12 1 -19 
0 -4 1 9 0 -4 1 -9 1 1 0 4 1 -2 0 -3 
1 12 0 -2 1 1 0 -6 1 7 0 -1 1 9 1 11 
0 -28 1 1 0 -4 2416 3629 100 MP stroke
1 22 0 34 1 -11 0 -7 1 -32 0 22 1 -23 0 3 
1 11 1 36 0 -35 1 21 0 -38 1 4 0 -7 1 6 
0 4 1 0 0 -3 1 1 0 2 1 4 1 64 0 -69 
1 -2 0 -4 1 13 0 5 1 -12 0 4 1 -5 0 -6 
1 1 0 25 1 -28 1 49 0 -46 1 -3 0 12 1 -9 
0 33 1 -23 0 -13 1 5 0 24 1 -18 0 -7 1 -3 
1 4 0 11 1 -16 0 1 1 16 0 -8 1 -1 0 34 
1 -35 0 12 1 -5 1 -2 0 -8 1 20 0 -22 1 3 
0 13 1 -17 0 2 1 17 0 -2 1 -18 0 28 1 -8 
1 -17 0 4 1 1 0 11 1 7 0 -15 1 -2 0 -6 
1 18 0 -4 1 -9 0 -1 1 -6 1 33 0 -20 1 11 
0 -3 1 -16 0 10 1 -1 0 -15 1 0 0 14 1 5 
0 -13 1 2 1 10 2362 3611 100 MP stroke
0 -15 1 1 0 -3 1 2 0 12 1 -7 1 -8 1 9 
0 -5 1 7 1 -2 0 11 1 10 0 -30 1 14 0 -6 
1 5 0 14 1 -9 0 -6 1 -3 1 4 0 -5 1 -5 
1 1 0 5 1 -1 0 51 1 -52 0 -4 1 1 0 16 
1 -20 1 2 0 4 1 39 0 -39 1 -3 0 4 1 1 
0 -5 1 1 0 13 1 -10 0 5 1 -1 1 -4 0 4 
1 7 0 -10 1 -6 0 62 1 -54 0 -8 1 10 0 15 
1 -1 0 -23 1 -2 1 5 0 -6 1 1 0 3 1 6 
0 12 1 -19 0 2 1 1 0 -2 1 -3 0 10 1 -9 
1 12 0 18 1 -24 0 26 1 -32 0 4 1 -3 1 0 
-1 0 2 5 1 -6 0 35 1 -28 0 -6 1 5 0 -7 
1 4 0 -5 1 6 0 10 1 -13 0 -2 1 14 1 58 
0 -70 1 20 0 -17 2307 3623 100 MP stroke
1 5 0 5 1 -14 0 7 1 11 0 -19 1 5 0 -4 
1 0 1 8 0 3 1 -5 0 2 1 -3 0 -7 1 26 
0 -22 1 3 0 3 1 -4 0 46 1 -50 1 27 0 -12 
1 -12 0 6 1 -3 0 1 1 43 0 11 1 -62 0 17 
1 -5 1 8 0 -3 1 -17 0 -1 1 20 0 -18 1 -1 
0 -1 1 14 0 -11 1 11 0 -14 1 8 1 -2 0 -4 
1 1 0 7 1 -3 0 10 1 1 0 -1 1 -12 0 -4 
1 14 0 -7 1 22 1 -30 0 8 1 24 0 -24 1 -7 
0 12 1 -4 0 9 1 -7 0 16 1 -21 0 4 1 15 
1 -22 0 5 1 2 1 -8 0 8 1 -10 0 9 1 -9 
0 17 1 -7 0 32 1 -5 1 -36 0 6 1 6 0 -11 
1 28 0 -15 1 5 0 -18 1 7 0 -3 1 18 1 -13 
0 -9 1 18 0 -17 2253 3626 100 MP stroke
1 9 0 -12 1 2 0 1 1 12 0 29 1 -42 0 3 
1 -5 1 14 0 -14 1 76 0 -66 1 -6 0 6 1 16 
0 -18 1 33 0 -34 1 10 0 -17 1 27 1 -19 0 -7 
1 10 0 -9 1 9 0 -7 1 123 0 -114 1 30 0 -32 
1 5 0 8 1 12 1 -36 0 11 2 -4 0 -6 1 19 
0 -19 1 10 0 32 1 -32 1 -11 1 9 0 4 1 -9 
0 9 1 -4 0 -3 1 -1 0 39 1 -40 0 21 1 -2 
1 17 0 -34 1 8 0 -13 1 3 0 -4 1 34 0 -28 
1 5 1 -8 0 -2 1 0 1 -1 0 28 1 6 0 -25 
1 -3 0 8 1 12 0 19 1 -29 0 4 1 -1 0 -14 
1 5 1 23 0 -32 1 10 0 -9 1 26 0 -23 1 -1 
0 15 1 8 1 -11 0 17 1 -8 1 2 0 -23 1 -4 
0 2 1 6 0 -7 2197 3628 100 MP stroke
1 -1 0 8 1 4 0 -6 1 44 0 -44 1 3 1 13 
0 -11 1 -11 0 26 1 -22 0 23 1 -19 0 1 1 -8 
0 6 1 10 1 -17 0 19 1 -18 0 4 1 -4 0 5 
1 21 0 10 1 -10 0 3 1 -6 0 -21 1 -1 1 5 
0 43 1 -21 0 -3 1 19 0 -28 1 9 0 -18 1 20 
0 -21 1 -5 0 -1 1 38 1 -39 0 12 1 -9 0 8 
1 -7 1 13 0 -7 1 -6 1 -3 0 24 1 -22 1 5 
0 -2 1 2 0 25 1 -33 0 8 1 -7 0 24 1 -25 
1 1 0 7 1 -2 1 -6 0 31 1 -22 0 26 1 -23 
0 34 1 -29 0 4 1 -13 0 13 1 -17 1 2 0 -6 
1 3 0 -1 1 39 0 -34 1 5 0 -6 1 -2 0 -2 
1 13 0 -11 1 -1 1 3 1 -1 0 7 1 14 0 -11 
1 -14 0 1 1 6 2141 3621 100 MP stroke
0 -3 1 3 0 -5 1 23 1 2 0 -28 1 3 0 -2 
1 2 0 4 1 16 0 4 1 -16 0 -10 1 7 0 3 
1 -7 1 1 0 2 1 -1 0 4 1 -8 0 -2 1 0 
1 16 0 30 1 -17 0 -27 1 5 1 -5 0 26 1 -13 
0 -11 1 1 0 -2 1 3 0 2 1 -4 0 -4 1 5 
1 18 0 -12 1 -8 1 11 0 -6 1 -8 0 3 1 2 
1 1 0 12 1 -18 1 12 0 8 1 -20 0 54 1 -47 
0 21 1 -28 0 15 1 3 0 -4 1 8 0 -21 1 11 
1 -9 0 10 1 -4 0 -5 1 12 0 -11 1 6 0 28 
1 -36 0 -2 1 7 0 -2 1 17 1 -2 0 25 1 -13 
0 -7 1 -3 0 -21 1 -1 0 3 1 3 0 1 1 -7 
0 7 1 -8 1 33 0 -10 1 -13 0 -7 1 39 0 -40 
1 8 0 -10 1 15 2086 3614 100 MP stroke
0 -4 1 -9 1 3 0 62 1 -62 0 10 1 -13 0 44 
1 -45 0 -1 1 14 0 1 1 21 0 -5 1 -20 1 -8 
0 18 1 0 0 -12 1 4 0 6 1 8 0 -27 1 1 
0 33 1 -29 0 14 1 6 1 -22 0 19 1 -11 0 -8 
1 -1 0 18 1 -19 0 7 1 3 0 -6 1 -4 0 4 
1 29 1 -21 0 -13 1 18 0 8 1 34 0 -44 1 -8 
0 -4 1 -2 0 49 1 -25 1 -20 0 21 1 -8 0 -11 
1 0 0 11 1 -12 0 37 1 -34 1 1 0 2 1 -7 
1 33 0 -35 1 49 0 -53 1 25 0 -24 1 24 0 -22 
1 27 0 -26 1 10 0 -8 1 1 1 -6 0 29 1 -21 
0 -7 1 19 0 4 1 -21 1 -3 0 6 1 5 0 -12 
1 58 1 -26 0 -17 1 -9 0 19 1 -21 0 26 1 -30 
0 8 1 46 0 -45 2032 3620 100 MP stroke
1 -8 0 8 1 -6 1 30 0 -31 1 5 0 -5 1 7 
0 -3 1 -4 0 7 1 -2 0 -7 1 1 1 1 1 14 
0 -5 1 -1 0 3 1 -12 0 6 1 49 0 -49 1 6 
0 -6 1 49 1 -51 0 -2 1 10 0 25 1 -17 0 -2 
1 -15 0 7 1 -4 0 33 1 -22 0 -18 1 22 1 -13 
0 14 1 -10 0 17 1 -28 0 12 1 -12 0 4 1 -2 
0 -1 1 1 0 15 1 -11 1 1 0 -7 1 6 1 -1 
0 6 1 -6 0 2 1 0 0 3 1 29 0 -29 1 -4 
1 16 0 -23 1 5 0 -5 1 8 0 18 1 -2 0 -12 
1 -10 0 11 1 40 1 -52 0 -2 1 0 0 4 1 26 
0 -20 1 -6 0 13 1 14 0 8 1 -36 0 49 1 -43 
1 -4 0 10 1 -14 0 35 1 -3 0 -32 1 9 1 8 
0 10 1 -25 0 -3 1977 3629 100 MP stroke
1 6 1 7 0 19 1 54 0 -77 1 2 0 -10 1 6 
0 6 1 7 0 4 1 -24 0 11 1 -5 1 0 0 -6 
1 25 0 -17 1 6 0 -4 1 0 0 12 1 -19 0 -1 
1 13 0 28 1 -16 1 -27 0 8 1 -2 0 31 1 -25 
0 -8 1 6 0 16 1 -15 1 -7 1 7 0 -8 1 3 
1 -6 0 3 1 14 0 21 1 -29 0 1 1 -10 0 7 
1 -6 1 11 0 -8 1 16 0 -20 1 11 1 0 0 -5 
1 -6 1 0 0 33 1 -26 1 -4 0 -3 1 12 0 4 
1 18 0 -34 1 2 0 9 1 2 0 -11 1 -1 1 8 
1 12 0 -21 1 19 0 -7 1 20 0 -26 1 -3 0 6 
1 25 0 -23 1 -9 0 9 1 -1 1 -5 0 2 1 0 
0 -7 1 4 0 5 1 -7 0 7 1 -7 0 48 1 -29 
1 -20 1 22 0 9 1920 3597 100 MP stroke
1 -21 0 15 1 -2 0 -8 1 -6 0 20 1 -20 0 -7 
1 10 1 -11 0 6 1 -7 1 6 0 -4 1 0 0 12 
1 4 0 -13 1 -6 0 25 1 -13 1 -10 1 6 0 1 
1 8 0 21 1 -27 0 73 1 -73 0 -9 1 0 0 19 
1 -3 1 -18 0 16 1 -7 0 44 1 -51 0 14 1 0 
0 16 1 -22 0 -9 1 5 0 31 1 -17 1 -18 0 -2 
1 21 0 15 1 -3 0 -25 1 -4 0 2 1 2 0 -5 
1 9 1 -7 0 1 1 -6 1 25 0 -21 1 -3 0 30 
1 -9 0 -17 1 5 0 -5 1 40 1 -22 1 -12 -1 0 
2 -7 0 10 1 0 0 -11 1 7 0 -9 1 30 0 -27 
1 -1 1 13 0 -7 1 -3 0 7 1 3 0 -2 1 -4 
0 5 1 -4 0 33 1 -42 0 33 1 -19 1 -14 0 24 
1 -25 1 -1 0 19 1864 3610 100 MP stroke
1 -19 0 1 1 1 0 6 1 -4 0 2 1 13 1 -10 
0 12 1 -18 0 13 1 -10 0 -3 1 -1 0 14 1 -10 
0 -2 1 36 1 -32 0 -7 1 23 0 -16 1 -4 0 11 
1 -6 0 -6 1 0 0 -3 1 7 0 6 1 -4 1 8 
0 -10 1 -4 1 -1 0 -2 1 13 0 8 1 -20 0 12 
1 -7 0 21 1 -24 1 4 0 6 1 13 0 -5 1 -1 
0 21 1 -40 0 11 1 1 0 -12 1 16 0 -7 1 -3 
1 -7 0 7 1 5 0 -5 1 1 0 17 1 -15 0 -10 
1 19 0 -14 1 -5 0 19 1 -18 1 -1 0 1 1 2 
0 6 1 -6 0 -1 1 -1 0 6 1 13 0 38 1 -40 
1 -10 0 58 1 -23 0 -34 1 15 0 -20 1 17 1 22 
0 -40 1 1 0 29 1 -28 1 2 0 -1 1 8 0 -13 
1 3 0 -1 1 -1 1809 3627 100 MP stroke
0 10 1 -1 0 -11 1 5 0 -4 1 39 1 -39 0 28 
1 -7 0 -14 1 -8 0 4 1 7 0 6 1 -14 0 5 
1 -2 0 -2 1 28 1 7 0 -29 1 -10 0 21 1 -15 
0 53 1 -55 0 3 1 -1 0 1 1 10 1 -12 0 -4 
1 -1 0 1 1 5 0 -6 1 50 0 -43 1 -5 0 2 
1 6 0 -9 1 15 1 -13 0 37 1 -33 0 -7 1 41 
0 -23 1 -15 0 -1 1 7 0 -2 1 1 1 -7 1 5 
0 -1 1 38 0 -43 1 4 0 2 1 0 0 9 1 1 
0 -15 1 10 0 -6 1 -5 1 46 0 -43 1 12 0 28 
1 -40 0 24 1 -18 0 7 1 -10 0 4 1 42 0 4 
1 -44 1 8 0 -15 1 6 0 -11 1 2 0 6 1 -8 
0 14 1 -10 0 -3 1 2 1 22 0 -25 1 0 0 6 
1 2 0 -8 1 38 1755 3591 100 MP stroke
0 -25 1 4 0 -7 1 21 0 6 1 -3 1 -23 1 0 
0 14 1 3 0 -10 1 3 0 -6 1 14 0 -10 1 18 
0 -23 1 -12 1 15 0 -13 1 3 0 6 1 92 0 -100 
1 3 0 -2 1 -6 0 20 1 -17 0 7 1 26 1 -31 
0 -4 1 0 0 7 1 -1 0 -7 1 1 0 24 1 -24 
0 6 1 102 0 -106 1 3 1 3 0 17 1 -24 0 3 
1 1 0 -1 1 12 0 -12 1 18 0 -9 1 0 1 -11 
0 16 1 -12 0 5 1 -11 0 6 1 10 0 -4 1 -12 
1 -1 0 10 1 -9 1 1 0 20 1 -6 0 -15 1 -1 
0 6 1 11 0 -15 1 10 0 -11 1 18 0 -8 1 -9 
1 9 0 -9 1 5 0 9 1 -6 0 76 1 -85 0 15 
1 1 0 -5 1 -8 0 -3 1 6 1 2 0 -8 1 4 
0 9 1 -5 0 -6 1701 3626 100 MP stroke
1 14 0 -16 1 -1 0 3 1 -1 0 11 1 3 1 -3 
0 6 1 5 0 1 1 -22 0 3 1 0 0 -3 1 6 
0 -2 1 -7 1 1 0 9 1 -6 0 -4 1 11 0 -4 
1 -5 1 4 0 1 1 12 0 -6 1 -12 1 0 0 23 
1 -3 0 -14 1 -6 0 9 1 0 0 -6 1 9 0 -1 
1 -3 1 23 1 -2 0 -26 1 14 0 -5 1 -11 0 3 
1 -4 0 7 1 -4 0 -3 1 41 0 -42 1 1 1 6 
0 22 1 -19 0 -7 1 1 0 1 1 -4 0 5 1 -2 
0 83 1 -63 0 -21 1 8 1 6 0 -14 1 -3 0 9 
1 55 0 -32 1 -28 0 38 1 -28 0 -1 1 -10 1 2 
0 4 1 1 0 -5 1 18 0 1 1 -23 1 7 0 7 
1 -10 0 -1 1 7 1 1 0 -12 1 6 0 5 1 4 
0 -13 1 19 0 -9 1646 3617 100 MP stroke
1 -8 0 8 1 -11 1 4 1 -1 0 10 1 7 0 -17 
1 -3 0 8 1 23 0 -28 1 5 0 2 1 -3 0 2 
1 -1 1 -4 0 7 1 -12 0 12 1 -8 0 10 1 1 
0 -14 1 14 0 -14 1 14 0 -15 1 9 1 24 0 -26 
1 7 0 -1 1 -10 0 59 1 -49 0 34 1 -41 0 18 
1 -20 1 22 0 -18 1 -1 0 -3 1 1 0 27 1 -26 
0 17 1 -18 0 12 1 -16 0 16 1 -4 1 -4 0 40 
1 -36 0 -12 1 17 0 9 1 9 0 -10 1 -17 0 -5 
1 2 0 4 1 7 1 -17 0 2 1 31 0 -17 1 -8 
0 -6 1 18 0 -8 1 -6 0 1 1 -2 0 13 1 -4 
1 -14 0 4 1 56 0 -45 1 7 0 -21 1 12 0 -9 
1 4 0 3 1 -5 0 5 1 -5 1 7 0 -10 1 -2 
1 1 0 -1 1 4 1591 3624 100 MP stroke
0 43 1 -33 0 -9 1 2 1 -3 0 3 1 45 0 -51 
1 4 0 19 1 -14 0 -5 1 10 0 -7 1 1 0 28 
1 -25 1 0 0 -4 1 13 0 -21 1 5 0 1 1 15 
0 -7 1 -9 0 8 1 1 0 -15 1 16 1 -16 0 20 
1 -19 0 10 1 -11 0 12 1 -8 0 2 1 26 0 -2 
1 -22 0 2 1 50 1 -15 0 -38 1 2 0 16 1 -13 
0 13 1 -14 0 5 1 9 0 -11 1 -10 0 3 1 0 
1 -4 0 10 1 -8 0 6 1 3 0 29 1 -39 0 -4 
1 12 0 -9 1 11 1 11 0 22 1 -43 0 5 1 -8 
0 23 1 -8 0 -6 1 7 0 -11 1 4 0 11 1 -8 
1 4 0 -15 1 31 0 -19 1 5 0 7 1 -8 0 -4 
1 -12 0 6 1 -2 0 -4 1 15 1 12 0 -17 1 -3 
0 18 1 -19 0 2 1538 3619 100 MP stroke
1 18 0 -9 1 -14 0 37 1 -42 0 23 1 -23 1 40 
0 -37 1 9 0 2 1 -11 1 1 0 15 1 10 0 -28 
1 2 1 0 0 -2 1 14 0 -6 1 4 0 -6 1 41 
0 -36 1 -3 0 1 1 -4 0 -2 1 38 1 -39 0 -3 
1 22 0 20 1 -41 0 -1 1 23 0 -21 1 11 0 -3 
1 -10 0 23 1 -23 1 19 0 -19 1 4 0 -4 1 9 
0 -7 1 52 0 -35 1 -13 0 -1 1 13 0 5 1 28 
1 -17 0 -26 1 44 0 -48 1 0 1 7 0 -9 1 2 
0 1 1 12 0 -14 1 47 1 -48 0 7 1 12 0 5 
1 -23 0 2 1 17 0 -19 1 9 0 48 1 -27 1 -19 
0 -4 1 -2 0 39 1 -39 0 19 1 -14 0 2 1 -8 
0 -5 1 7 0 -1 1 -8 1 13 0 -6 1 0 0 4 
1 3 0 15 1 -22 1483 3622 100 MP stroke
0 13 1 -11 0 -8 1 5 0 2 1 7 1 -10 0 30 
1 -23 0 -7 1 29 0 -1 1 11 0 11 1 -48 0 -7 
1 7 0 17 1 -24 1 28 0 -16 1 4 0 41 1 -51 
0 -5 1 3 0 3 1 -3 0 -4 1 6 0 13 1 2 
1 -14 0 2 1 -8 0 10 1 -7 0 26 1 -13 0 -1 
1 -9 0 7 1 -7 1 2 0 -4 1 2 0 13 1 -18 
0 17 1 -18 1 11 0 2 1 -10 0 -2 1 0 1 -1 
0 -1 1 4 0 8 1 42 0 -31 1 -5 0 38 1 -37 
0 6 1 6 0 -24 1 3 1 -2 0 13 1 11 0 -25 
1 12 0 -18 1 25 0 -8 1 -7 0 -9 1 22 0 -18 
1 10 1 -4 0 -11 1 19 0 -16 1 -2 0 13 1 -11 
0 -2 1 10 0 18 1 -21 0 21 1 5 1 -25 0 -10 
1 21 0 -2 1 -6 1429 3616 100 MP stroke
0 -11 1 2 0 43 1 -31 0 -12 1 14 1 -1 0 -2 
1 -8 0 -4 1 13 0 -1 1 -5 0 -8 1 18 0 -2 
1 -13 0 13 1 7 1 -25 1 4 0 4 1 29 0 -35 
1 23 0 -16 1 -1 0 5 1 12 0 -21 1 -2 1 11 
0 -11 1 10 0 6 1 -3 0 -11 1 -4 0 14 1 -7 
0 -2 1 20 0 -14 1 11 1 -13 0 9 1 -18 0 23 
1 -17 1 15 0 -17 1 4 0 25 1 -29 0 6 1 -10 
1 15 0 8 1 24 0 -40 1 14 0 24 1 -38 0 37 
1 -30 0 -14 1 1 1 9 0 7 1 12 0 13 1 -42 
0 5 1 8 0 21 1 -11 0 -8 1 -6 0 10 1 5 
1 -8 0 6 1 4 0 -6 1 -16 0 11 1 -12 0 -2 
1 8 0 2 1 15 0 -19 1 33 1 -37 0 18 1 -15 
0 4 1 -6 0 2 1375 3623 100 MP stroke
1 -5 0 2 1 2 0 13 1 -5 0 4 1 -13 1 10 
0 -5 1 37 0 -36 1 12 0 -18 1 3 0 -3 1 32 
0 -30 1 3 0 -5 1 15 1 -14 0 1 1 10 0 -7 
1 20 0 7 1 -28 0 -1 1 -7 0 26 1 -19 1 -6 
0 41 1 -35 0 -7 1 0 0 7 1 -4 0 6 1 2 
0 -6 1 -4 0 6 1 42 1 -23 0 -23 1 11 0 68 
1 -81 0 12 1 -13 0 1 1 14 0 -11 1 14 0 3 
1 55 1 -14 0 -31 1 -11 0 -15 1 7 0 -11 1 -1 
0 2 1 19 0 -11 1 -4 0 43 1 -27 1 -12 0 -7 
1 1 0 9 1 1 0 -14 1 15 0 -8 1 -7 0 9 
1 -1 0 -7 1 48 1 -47 0 9 1 -8 0 -3 1 6 
0 5 1 2 0 1 1 33 0 -23 1 -19 1 45 0 -19 
1 -29 0 -1 1 25 1321 3603 100 MP stroke
0 -16 1 5 0 -1 1 -14 0 18 1 -16 0 3 1 -4 
1 14 0 7 1 -9 0 -2 1 -10 0 -1 1 32 0 -30 
1 3 0 -1 1 -2 0 4 1 13 1 -10 0 -9 1 10 
0 5 1 -13 0 1 1 -1 0 14 1 -1 0 -14 1 10 
0 24 1 -10 1 9 0 -33 1 2 0 19 1 -10 0 13 
1 -19 0 15 1 -14 0 53 1 -25 1 -33 0 -2 1 3 
0 26 1 -2 0 -4 1 -23 0 9 1 0 0 24 1 -29 
0 26 1 -27 1 14 0 6 1 -13 0 -2 1 55 0 -34 
1 -19 0 1 1 22 0 -16 1 -6 0 -1 1 -5 1 -1 
0 3 1 2 0 16 1 -11 0 -4 1 -2 0 19 1 -24 
0 6 1 -2 0 9 1 -2 1 -5 0 -4 1 0 0 -2 
1 13 0 46 1 -56 0 8 1 -3 0 -10 1 14 0 12 
1 9 1 -6 0 11 1268 3588 100 MP stroke
1 -17 0 -22 1 0 0 50 1 -32 0 -2 1 10 0 -20 
1 -8 1 7 1 -6 0 18 1 -10 0 -1 1 32 0 -32 
1 16 0 -1 1 -21 0 20 1 -19 1 14 0 -13 1 1 
0 27 1 -26 0 13 1 -5 0 -7 1 11 0 -18 1 2 
0 8 1 2 1 0 0 15 1 26 0 -46 1 20 0 9 
1 -36 0 20 1 -15 0 3 1 -2 0 14 1 0 1 -18 
0 48 1 -24 0 -18 1 66 0 -66 1 -5 0 6 1 -1 
0 7 1 -14 0 29 1 71 1 -66 0 -34 1 11 0 -10 
1 61 0 -29 1 -9 0 -25 1 64 0 -60 1 22 1 -23 
0 38 1 -35 0 2 1 1 0 92 1 -99 1 5 0 -4 
1 10 0 11 1 -11 1 -10 0 16 1 -1 0 -13 1 5 
0 8 1 -5 0 26 1 -33 0 5 1 -10 1 33 1 -24 
0 -6 1 0 0 9 1213 3616 100 MP stroke
1 19 0 -7 1 -25 0 4 1 1 1 19 0 -14 1 10 
1 26 0 -40 1 1 0 16 1 40 0 -58 1 6 0 8 
1 7 0 -20 1 17 0 -22 1 70 1 -65 0 36 1 -41 
0 -1 1 8 0 3 1 32 0 -34 1 3 0 5 1 -11 
1 -2 0 -2 1 10 0 -2 1 -5 0 11 1 -13 0 10 
1 -12 0 24 1 -14 0 3 1 9 1 -3 1 64 0 -35 
1 -38 0 7 1 57 0 -70 1 9 0 -14 1 36 0 -17 
1 -10 1 7 0 20 1 -35 0 11 1 -11 1 18 0 -13 
1 -5 0 2 1 30 0 -26 1 -4 1 29 0 50 1 -82 
0 5 1 16 0 -11 1 23 0 -33 1 84 0 -36 1 -45 
0 -3 1 1 1 5 0 19 1 -23 0 7 1 5 0 -9 
2 47 0 42 1 -90 1 106 0 -102 1 9 0 14 1 -22 
0 34 1 -38 0 10 1157 3614 100 MP stroke
1 -8 0 14 1 -21 0 18 1 -8 1 7 0 84 1 -95 
0 19 1 -18 0 18 1 -25 0 9 1 52 0 -54 1 2 
0 -6 1 31 1 -34 0 43 1 -42 0 10 1 -10 0 -1 
1 4 0 5 1 6 1 43 0 -24 1 -34 1 27 0 -27 
1 0 0 13 1 20 0 -11 1 -11 0 27 1 -34 0 21 
1 -4 0 -10 1 -4 1 22 0 -15 1 -13 0 34 1 -24 
0 12 1 27 0 -45 1 -5 1 15 1 10 0 -21 1 2 
0 78 1 -75 0 -6 1 16 0 -14 1 3 0 11 1 45 
0 -28 1 51 1 -5 0 -71 1 -2 0 21 1 -30 0 1 
1 6 0 5 1 115 0 -124 1 6 0 60 1 -60 1 -9 
0 24 1 10 0 -6 1 -4 0 -11 1 -4 0 55 1 -47 
0 16 1 13 0 -39 1 48 1 -47 0 28 1 -29 0 31 
1 -12 0 38 1 -63 1102 3628 100 MP stroke
0 82 1 -75 0 44 1 -6 0 -43 1 8 1 19 0 -14 
1 10 0 -20 1 7 0 43 1 -9 0 -36 1 3 0 73 
1 -20 1 -11 0 -13 1 -36 0 -6 1 0 0 49 1 -34 
0 3 1 -15 0 8 1 -6 0 -5 1 38 1 40 0 -73 
1 39 0 -8 1 28 0 -7 1 -41 0 16 1 -26 0 8 
1 -15 0 50 1 -47 1 30 0 -20 1 4 0 -11 1 5 
0 -10 1 40 0 -17 1 63 0 -81 1 19 0 -1 1 3 
1 0 0 -13 1 91 0 -9 1 -52 0 -42 1 11 0 25 
1 -6 0 -14 1 -4 0 -4 1 30 1 -10 0 28 1 -10 
0 10 1 -52 0 45 1 -18 0 -23 1 25 0 -16 1 85 
1 -91 0 -11 1 3 0 19 1 -21 0 42 1 6 0 -39 
1 17 0 -16 1 22 0 -35 1 2 1 241 0 -212 1 32 
0 -22 1 -35 0 -3 1049 3626 100 MP stroke
1 61 0 -28 1 -32 0 15 1 2 0 24 1 -43 1 19 
0 -18 1 2 0 46 1 46 0 -81 1 43 0 -55 1 4 
0 27 1 -35 1 0 1 25 0 -20 1 59 0 -49 1 34 
0 -34 1 20 0 14 1 81 0 -88 1 -15 1 -24 0 37 
1 -12 0 1 1 42 0 -25 1 -43 0 34 1 -35 0 60 
1 -43 0 5 1 113 1 -127 0 -10 1 7 0 -7 1 58 
0 -3 1 -21 0 235 1 -168 0 94 1 -70 0 -71 1 207 
1 -225 0 -12 1 22 0 -36 1 -8 0 164 1 -159 0 -3 
1 27 0 1 1 7 0 -4 1 -35 1 42 0 -21 1 -8 
0 110 1 -56 0 6 1 -70 0 8 1 59 0 -31 1 -32 
0 52 1 939 1 -804 0 -188 1 -6 0 11 1 36 0 -37 
1 -8 0 8 1 27 0 -19 1 63 1 -52 0 4 1 -19 
0 133 1 -56 0 -26 995 3564 100 MP stroke
1 -42 0 -8 1 63 0 -65 1 76 0 -76 1 -2 1 22 
0 8 1 -41 0 15 1 65 0 -27 1 187 0 173 1 43 
0 -147 1 -61 0 -165 1 -71 1 190 0 -76 1 -88 0 256 
1 -30 0 -234 1 44 0 92 1 -111 0 70 1 -120 0 23 
1 -18 1 59 0 78 1 -141 0 24 1 -21 0 -1 1 143 
0 -90 1 -43 0 101 1 -88 0 10 1 127 1 1917 0 -1851 
1 -170 0 142 1 -206 0 29 1 30 0 -27 1 17 0 18 
1 -32 1 -25 0 41 1 -25 0 302 1 334 0 -394 1 -252 
0 -2 1 17 0 82 1 -89 0 39 1 13 1 48 0 -114 
1 -9 0 164 1 71 0 -173 1 302 0 1459 1 -1793 0 -30 
1 185 0 -143 1 -33 1 219 0 1931 1 -845 0 -1146 1 -133 
0 141 1 -177 0 134 1 -110 0 9 1 48 0 -61 1 1 
1 28 0 40 1 -39 941 3579 100 MP stroke
0 80 1 -94 0 25 1 -15 0 56 1 322 0 -212 1 485 
0 -150 1 -428 1 -115 0 56 1 40 0 96 1 -101 0 -42 
1 23 0 -48 1 21 0 178 1 -182 1 119 0 -117 1 -19 
0 -22 1 191 0 -171 1 104 0 19 1 -40 0 -41 1 144 
0 -198 1 160 1 -165 0 40 1 -20 0 82 1 774 0 -581 
1 -105 0 -155 1 321 0 176 1 -167 0 -361 1 1659 1 -1645 
0 79 1 23 0 -127 1 127 0 -55 1 -57 0 -1 1 119 
0 -96 1 42 0 20 1 -76 1 -12 0 146 1 267 0 542 
1 -594 0 -343 1 -24 0 113 1 -102 0 32 1 123 0 -103 
1 -1 1 731 0 -552 1 -230 0 38 1 80 0 -65 1 1 
0 -30 1 8 0 46 1 -63 1 -26 0 -2 1 12 0 19 
1 85 0 -111 1 15 0 363 1 -311 0 103 1 -44 0 -108 
1 71 1 -20 0 1269 888 2281 100 MP stroke
1 -1009 0 -220 1 -113 0 48 1 -49 0 59 1 -59 0 298 
1 -175 0 7 1 -110 1 2 0 -13 1 140 0 -125 1 93 
0 78 1 -152 0 -12 1 90 0 -114 1 256 0 -212 1 -40 
1 2 0 -9 1 146 0 -107 1 1359 0 -1392 1 59 0 36 
1 -30 0 -55 1 63 0 -29 1 -37 1 -6 0 78 1 -21 
0 -29 1 -33 0 25 1 -35 0 155 1 -102 0 -13 1 -39 
1 118 0 5 1 -48 0 -64 1 18 0 125 1 -142 0 26 
1 159 0 -109 1 -82 0 329 1 -321 1 -8 0 12 1 44 
0 -48 1 -15 0 37 1 68 0 -39 1 23 0 -30 1 49 
0 71 1 -143 1 29 0 -56 1 55 0 22 1 -12 0 -37 
1 8 0 -27 1 108 0 -119 1 9 0 231 1 -181 1 -52 
0 20 1 154 0 -155 1 38 0 39 1 67 0 -55 1 -119 
0 83 1 -52 0 -27 835 3621 100 MP stroke
1 24 1 -21 0 27 1 0 0 -18 1 48 0 -37 1 -21 
0 32 1 3 0 5 1 -43 1 -7 0 85 1 -85 0 183 
1 -117 0 -36 1 94 0 23 1 31 0 -177 1 39 0 -4 
1 16 1 223 0 -272 1 96 0 -25 1 10 0 -75 1 187 
0 -187 1 21 0 65 1 -79 0 49 1 29 1 -58 0 48 
1 -36 0 40 1 -74 0 -10 1 30 0 81 1 -71 0 259 
1 -197 0 -95 1 9 1 79 0 -79 1 106 0 -50 1 -33 
0 -30 1 218 0 -231 1 18 0 -3 1 34 0 -24 1 -11 
1 -10 0 123 1 30 0 -37 1 -2 0 -52 1 -44 0 106 
1 -111 0 135 1 -97 1 -18 0 86 1 -24 0 -51 1 77 
0 -106 1 64 0 -7 1 -60 0 70 1 17 0 27 1 -122 
1 9 0 164 1 -117 0 14 1 -62 0 396 1 -399 0 7 
1 11 0 27 1 8 781 3563 100 MP stroke
0 70 1 45 1 -133 0 -1 1 20 0 17 1 -48 0 41 
1 44 0 -106 1 16 0 97 1 -35 0 -27 1 146 1 -166 
0 -38 1 75 0 -69 1 58 0 89 1 -22 0 -94 1 15 
1 -58 1 226 0 -169 1 5 0 -26 1 -12 0 66 1 27 
0 -69 1 88 0 -50 1 18 0 -103 1 207 1 -196 0 30 
1 323 0 -251 1 -86 0 78 1 -68 0 23 1 2 0 47 
1 -64 0 95 1 -119 1 1 0 57 1 -58 0 194 1 -108 
0 189 1 -65 0 134 1 -296 0 18 1 31 0 -86 1 80 
1 -98 0 -9 1 11 0 27 1 -12 0 -25 1 239 0 -44 
1 -176 0 151 1 -120 0 101 1 -92 1 -29 0 37 1 -64 
0 33 1 40 0 -42 1 34 0 63 1 -41 0 -18 1 22 
1 -72 0 28 1 -53 0 6 1 155 0 -162 1 13 0 26 
1 0 0 -20 1 395 727 3210 100 MP stroke
0 -323 1 7 1 -95 0 92 1 103 0 -22 1 -181 1 27 
0 95 1 -88 0 -21 1 254 0 -187 1 201 1 -164 0 106 
1 -189 0 114 1 -119 0 -17 1 -9 0 108 1 -17 0 94 
1 -133 0 -35 1 19 1 -32 0 128 1 -48 0 -29 1 138 
0 -139 1 -2 0 157 1 -53 0 115 1 -253 0 73 1 58 
1 -58 0 191 1 -247 0 -20 1 94 0 -62 1 109 0 188 
1 -106 0 -236 1 10 1 247 0 -202 1 -35 0 66 1 222 
0 -35 1 -20 0 -236 1 252 0 -92 1 -120 0 410 1 -405 
1 41 0 42 0 -105 691 3584 68 MP stroke
gr

c8
0 sg
%%IncludeResource: font Helvetica
/Helvetica /ISOLatin1Encoding 120 FMSR

5391 1511 mt 
(KIC 6035199) s
2981 3918 mt 
(Frequency \(micro Hertz\)) s
 374 2789 mt  -90 rotate
(Oscillation power) s
90 rotate
4 w
DO
SO
6 w
 691 3630 mt 6566 3630 L
 691 1037 mt 6566 1037 L
 691 3630 mt  691 1037 L
6566 3630 mt 6566 1037 L
 691 3630 mt 6566 3630 L
 691 3630 mt  691 1037 L
1174 3630 mt 1174 3571 L
1174 1037 mt 1174 1095 L
1074 3775 mt 
(500) s
1866 3630 mt 1866 3571 L
1866 1037 mt 1866 1095 L
1733 3775 mt 
(1000) s
2557 3630 mt 2557 3571 L
2557 1037 mt 2557 1095 L
2424 3775 mt 
(1500) s
3248 3630 mt 3248 3571 L
3248 1037 mt 3248 1095 L
3115 3775 mt 
(2000) s
3939 3630 mt 3939 3571 L
3939 1037 mt 3939 1095 L
3806 3775 mt 
(2500) s
4630 3630 mt 4630 3571 L
4630 1037 mt 4630 1095 L
4497 3775 mt 
(3000) s
5321 3630 mt 5321 3571 L
5321 1037 mt 5321 1095 L
5188 3775 mt 
(3500) s
6013 3630 mt 6013 3571 L
6013 1037 mt 6013 1095 L
5880 3775 mt 
(4000) s
 691 3630 mt  749 3630 L
6566 3630 mt 6507 3630 L
 590 3674 mt 
(0) s
 691 3338 mt  749 3338 L
6566 3338 mt 6507 3338 L
 456 3382 mt 
(100) s
 691 3046 mt  749 3046 L
6566 3046 mt 6507 3046 L
 456 3090 mt 
(200) s
 691 2755 mt  749 2755 L
6566 2755 mt 6507 2755 L
 456 2799 mt 
(300) s
 691 2463 mt  749 2463 L
6566 2463 mt 6507 2463 L
 456 2507 mt 
(400) s
 691 2172 mt  749 2172 L
6566 2172 mt 6507 2172 L
 456 2216 mt 
(500) s
 691 1880 mt  749 1880 L
6566 1880 mt 6507 1880 L
 456 1924 mt 
(600) s
 691 1588 mt  749 1588 L
6566 1588 mt 6507 1588 L
 456 1632 mt 
(700) s
 691 1297 mt  749 1297 L
6566 1297 mt 6507 1297 L
 456 1341 mt 
(800) s
 691 3630 mt 6566 3630 L
 691 1037 mt 6566 1037 L
 691 3630 mt  691 1037 L
6566 3630 mt 6566 1037 L

end %%Color Dict

eplot
%%EndObject

epage
end

showpage

%%Trailer
%%EOF
