102878430
102907534
102985735
102989773
103004083
103041203
110655321
110655905
110655936
110656336
110656659
110657136
110657459
110657528
110657727
110658180
110658678
110658911
110658998
110659305
110660354
110661387
110661430
110662387
110662444
110662963
110663190
110663578
110663970
110664034
110664102
110664407
110664687
110665113
110665835
110666271
110666733
110667090
110667321
110667731
110668287
110668690
110669464
110670455
110671589
110672256
110672452
110672805
110674168
110676643
110676787
110677427
110677492
110677821
110677954
110678749
110679004
110679775
110680884
110681720
110685200
110685920
110686438
110687093
110687813
110688060
110688335
110689133
110689458
110740601
110741575
110742698
110743013
110743281
110744006
110744174
110744262
110744993
110745049
110745232
110745358
110745415
110745902
110746597
110746661
110746837
110747316
110748130
110749627
110749735
110749752
110750545
110751546
110751659
110752783
110755686
110758065
110758141
110759169
110759747
110760557
110761532
110761557
110761933
110762041
110762802
110762904
110763235
110763434
110764163
110764218
110764860
110765440
110765692
110767476
110768996
110770047
110770171
110770443
110771279
110772748
110773014
110774018
110774446
110825459
110825488
110825915
110826062
110826457
110826827
110827535
110827827
110828388
110828605
110829061
110829140
110829291
110829567
110829824
110830018
110830049
110830665
110830740
110830835
110832212
110832270
110832329
110832929
110833002
110833278
110833632
110834370
110835143
110835279
110835493
110835712
110835818
110836765
110837289
110838003
110838497
110838932
110839445
110839517
110840468
110841217
110843635
110844764
110847547
110850047
110850589
110850974
110851050
110851077
110851112
110851990
110851999
110853002
110853422
110853526
110854096
110854429
110855104
110855648
110857352
110858607
110861533
300001120
300001254
300001469
300001540
300001674
300001805
300001929
300001933
300002343
300002353
300002410
300002539
300002572
300002799
300002913
300003032
300003076
300003246
300003262
300003264
300003295
300003372
300003436
300003496
300003630
300003693
300003760
300003848
300003870
300003912
300003935
300003954
300004269
