# ID COROT      GESS      APOGEE    AAOmega
601937439         0         0         1
601937480         0         0         1
601942335         0         0         1
601942336         0         0         1
601947085         0         0         1
601947125         0         0         1
602581755         0         0         1
602581759         0         0         1
602582003         0         0         1
603138833         0         0         1
603184218         0         0         1
603193730         0         0         1
603193743         0         0         1
603193775         0         0         1
603200782         0         0         1
603200855         0         0         1
603807120         0         0         1
603891268         0         0         1
603893287         0         0         1
603893290         0         0         1
603893359         0         0         1
603893368         0         0         1
603900598         0         0         1
603900600         0         0         1
603900632         0         0         1
603900665         0         0         1
603900675         0         0         1
603900683         0         0         1
603900751         0         0         1
603900814         0         0         1
603906076         0         0         1
604174151         0         0         1
604174237         0         0         1
604174249         0         0         1
604174431         0         0         1
604174494         0         0         1
604174521         0         0         1
604174708         0         0         1
604176060         0         0         1
604176115         0         0         1
604176317         0         0         1
604176438         0         0         1
604178286         0         0         1
604178318         0         0         1
604178399         0         0         1
604178490         0         0         1
604178589         0         0         1
604178786         0         0         1
604178852         0         0         1
604179003         0         0         1
604179013         0         0         1
604179052         0         0         1
604180511         0         0         1
604180802         0         0         1
604180827         0         0         1
604180963         0         0         1
604180975         0         0         1
604180999         0         0         1
604181012         0         0         1
604181017         0         0         1
604181077         0         0         1
604181262         0         0         1
604181324         0         0         1
604181509         0         0         1
604181561         0         0         1
604181638         0         0         1
604183345         0         0         1
604183437         0         0         1
604183449         0         0         1
604183512         0         0         1
604183694         0         0         1
604183817         0         0         1
604183852         0         0         1
604183995         0         0         1
604184039         0         0         1
604184109         0         0         1
604184124         0         0         1
604184213         0         0         1
604184277         0         0         1
604186157         0         0         1
604186282         0         0         1
604186360         0         0         1
604186474         0         0         1
604186609         0         0         1
604186971         0         0         1
604188904         0         0         1
604188920         0         0         1
604189406         0         0         1
604189455         0         0         1
604191336         0         0         1
604191539         0         0         1
604191599         0         0         1
604191743         0         0         1
604191767         0         0         1
604191842         0         0         1
604191851         0         0         1
604191926         0         0         1
604192099         0         0         1
604192105         0         0         1
604192216         0         0         1
604192375         0         0         1
604194126         0         0         1
604194169         0         0         1
604194309         0         0         1
604194354         0         0         1
604194427         0         0         1
604194463         0         0         1
604194469         0         0         1
604194491         0         0         1
604194615         0         0         1
604194684         0         0         1
604194786         0         0         1
604197079         0         0         1
604197199         0         0         1
604197272         0         0         1
604197479         0         0         1
604197632         0         0         1
604199394         0         0         1
604199444         0         0         1
604199585         0         0         1
604199749         0         0         1
604199947         0         0         1
604199960         0         0         1
604200097         0         0         1
604200124         0         0         1
604200378         0         0         1
604200462         0         0         1
604202252         0         0         1
604202553         0         0         1
604202565         0         0         1
604202665         0         0         1
604202949         0         0         1
604205521         0         0         1
604208545         0         0         1
604208603         0         0         1
604237376         0         0         1
604237379         0         0         1
604237380         0         0         1
604237408         0         0         1
604986772         0         0         1
604986814         0         0         1
604987291         0         0         1
604987355         0         0         1
604987366         0         0         1
604987685         0         0         1
604987693         0         0         1
604987713         0         0         1
604987736         0         0         1
604987739         0         0         1
604988069         0         0         1
604988071         0         0         1
604988085         0         0         1
604988100         0         0         1
604988111         0         0         1
604988165         0         0         1
604988610         0         0         1
604988619         0         0         1
604988874         0         0         1
604988991         0         0         1
604989297         0         0         1
604989369         0         0         1
604989451         0         0         1
604989462         0         0         1
604989815         0         0         1
604989852         0         0         1
604989874         0         0         1
604990228         0         0         1
604990245         0         0         1
604990253         0         0         1
604990258         0         0         1
604990320         0         0         1
604990687         0         0         1
604990706         0         0         1
604990723         0         0         1
604990724         0         0         1
604990735         0         0         1
604990828         0         0         1
604990868         0         0         1
604991179         0         0         1
604991203         0         0         1
604991240         0         0         1
604991638         0         0         1
604991678         0         0         1
604991993         0         0         1
604992022         0         0         1
605017506         0         0         1
605017509         0         0         1
605017510         0         0         1
605017527         0         0         1
605017543         0         0         1
605017562         0         0         1
605017664         0         0         1
605017684         0         0         1
605087803         0         0         1
605087815         0         0         1
605087838         0         0         1
605088534         0         0         1
605088538         0         0         1
605088599         0         0         1
605088613         0         0         1
605088681         0         0         1
605088787         0         0         1
605088789         0         0         1
605089276         0         0         1
605089308         0         0         1
605089322         0         0         1
605089448         0         0         1
605089504         0         0         1
605090116         0         0         1
605090133         0         0         1
605090256         0         0         1
605090850         0         0         1
605090891         0         0         1
605090918         0         0         1
605090951         0         0         1
605091023         0         0         1
605091576         0         0         1
605091590         0         0         1
605091757         0         0         1
605091796         0         0         1
605092350         0         0         1
605092411         0         0         1
605092500         0         0         1
605092539         0         0         1
605093190         0         0         1
605093276         0         0         1
605093473         0         0         1
605093485         0         0         1
605094057         0         0         1
605094079         0         0         1
605094850         0         0         1
605094867         0         0         1
605094892         0         0         1
605094923         0         0         1
605094980         0         0         1
605095604         0         0         1
605095618         0         0         1
605095793         0         0         1
605095812         0         0         1
605096319         0         0         1
605096340         0         0         1
605096912         0         0         1
605097015         0         0         1
605097018         0         0         1
605142955         0         0         1
605143200         0         0         1
605143204         0         0         1
605143205         0         0         1
605143208         0         0         1
605143425         0         0         1
605143435         0         0         1
605143440         0         0         1
605143443         0         0         1
605143486         0         0         1
605143500         0         0         1
605143654         0         0         1
605143704         0         0         1
605143837         0         0         1
605143839         0         0         1
605143842         0         0         1
605143845         0         0         1
605143867         0         0         1
605143871         0         0         1
605143878         0         0         1
605144052         0         0         1
605144055         0         0         1
605144056         0         0         1
605144081         0         0         1
605144092         0         0         1
605144099         0         0         1
605144111         0         0         1
605144119         0         0         1
605144224         0         0         1
605144229         0         0         1
605144231         0         0         1
605144249         0         0         1
605144261         0         0         1
605144262         0         0         1
605144415         0         0         1
605144443         0         0         1
605144609         0         0         1
605144610         0         0         1
605144613         0         0         1
605144618         0         0         1
605144619         0         0         1
605144623         0         0         1
605144632         0         0         1
605144661         0         0         1
605144668         0         0         1
605144672         0         0         1
605144695         0         0         1
605144840         0         0         1
605144847         0         0         1
605144853         0         0         1
605144873         0         0         1
605144876         0         0         1
605144877         0         0         1
605144885         0         0         1
605144904         0         0         1
605144922         0         0         1
605145039         0         0         1
605145075         0         0         1
605145096         0         0         1
605145110         0         0         1
605145252         0         0         1
605145253         0         0         1
605145256         0         0         1
605145265         0         0         1
605145274         0         0         1
605145276         0         0         1
605145277         0         0         1
605145283         0         0         1
605145291         0         0         1
605145300         0         0         1
605145304         0         0         1
605145305         0         0         1
605145427         0         0         1
605145432         0         0         1
605145465         0         0         1
605145473         0         0         1
605145596         0         0         1
605145616         0         0         1
605303089         0         0         1
605303156         0         0         1
605303220         0         0         1
605303226         0         0         1
605303310         0         0         1
605303314         0         0         1
605303758         0         0         1
605303806         0         0         1
605303838         0         0         1
605303864         0         0         1
605303875         0         0         1
605303895         0         0         1
605303988         0         0         1
605304009         0         0         1
605304012         0         0         1
605304446         0         0         1
605304528         0         0         1
605304548         0         0         1
605304649         0         0         1
605305125         0         0         1
605305176         0         0         1
605305216         0         0         1
605305265         0         0         1
605305280         0         0         1
605305793         0         0         1
605305837         0         0         1
605305925         0         0         1
605305936         0         0         1
605306402         0         0         1
605306478         0         0         1
605306512         0         0         1
605306527         0         0         1
605306545         0         0         1
605306547         0         0         1
605306607         0         0         1
605307096         0         0         1
605307247         0         0         1
605307809         0         0         1
605307821         0         0         1
605307877         0         0         1
605307885         0         0         1
605307915         0         0         1
605307931         0         0         1
605308424         0         0         1
605308428         0         0         1
605308443         0         0         1
605308447         0         0         1
605308457         0         0         1
605308585         0         0         1
605308613         0         0         1
605308627         0         0         1
605309054         0         0         1
605309121         0         0         1
605309159         0         0         1
605309224         0         0         1
605309236         0         0         1
605309243         0         0         1
605309729         0         0         1
605309776         0         0         1
605309779         0         0         1
605309806         0         0         1
605310146         0         0         1
605310183         0         0         1
605310230         0         0         1
605310253         0         0         1
617692424         0         0         1
617692511         0         0         1
617692592         0         0         1
617721332         0         0         1
617721434         0         0         1
617721528         0         0         1
617721694         0         0         1
617747220         0         0         1
617747302         0         0         1
617747459         0         0         1
617747641         0         0         1
617747699         0         0         1
617775065         0         0         1
617887296         0         0         1
617975231         0         0         1
618472887         0         0         1
618472907         0         0         1
618472908         0         0         1
618473483         0         0         1
618477011         0         0         1
618477190         0         0         1
739722507         0         0         1
739726190         0         0         1
739727006         0         0         1
739727126         0         0         1
739727136         0         0         1
739728120         0         0         1
739729660         0         0         1
740099733         0         0         1
740101145         0         0         1
740102273         0         0         1
740103298         0         0         1
740103646         0         0         1
740106865         0         0         1
740107618         0         0         1
740473434         0         0         1
740475001         0         0         1
740476218         0         0         1
740480381         0         0         1
740480526         0         0         1
740480774         0         0         1
740481457         0         0         1
740482208         0         0         1
740482972         0         0         1
740483034         0         0         1
740483094         0         0         1
740483120         0         0         1
740849477         0         0         1
740851029         0         0         1
740851042         0         0         1
740851647         0         0         1
740852368         0         0         1
740852422         0         0         1
740853284         0         0         1
740856170         0         0         1
740857482         0         0         1
741220835         0         0         1
741223128         0         0         1
741226232         0         0         1
741228959         0         0         1
741590632         0         0         1
741596894         0         0         1
