601937439
601937480
601942335
601942336
601947085
601947125
602581755
602581759
602582003
603138833
603184218
603193730
603193743
603193775
603200782
603200855
603807120
603891268
603893287
603893290
603893359
603893368
603900598
603900600
603900632
603900665
603900675
603900683
603900751
603900814
603906076
604174151
604174237
604174249
604174431
604174494
604174521
604174708
604176060
604176115
604176317
604176438
604178286
604178318
604178399
604178490
604178589
604178786
604178852
604179003
604179013
604179052
604180511
604180802
604180827
604180963
604180975
604180999
604181012
604181017
604181077
604181262
604181324
604181509
604181561
604181638
604183345
604183437
604183449
604183512
604183694
604183817
604183852
604183995
604184039
604184109
604184124
604184213
604184277
604186157
604186282
604186360
604186474
604186609
604186971
604188904
604188920
604189406
604189455
604191336
604191539
604191599
604191743
604191767
604191842
604191851
604191926
604192099
604192105
604192216
604192375
604194126
604194169
604194309
604194354
604194427
604194463
604194469
604194491
604194615
604194684
604194786
604197079
604197199
604197272
604197479
604197632
604199394
604199444
604199585
604199749
604199947
604199960
604200097
604200124
604200378
604200462
604202252
604202553
604202565
604202665
604202949
604205521
604208545
604208603
604237376
604237379
604237380
604237408
604986772
604986814
604987291
604987355
604987366
604987685
604987693
604987713
604987736
604987739
604988069
604988071
604988085
604988100
604988111
604988165
604988610
604988619
604988874
604988991
604989297
604989369
604989451
604989462
604989815
604989852
604989874
604990228
604990245
604990253
604990258
604990320
604990687
604990706
604990723
604990724
604990735
604990828
604990868
604991179
604991203
604991240
604991638
604991678
604991993
604992022
605017506
605017509
605017510
605017527
605017543
605017562
605017664
605017684
605087803
605087815
605087838
605088534
605088538
605088599
605088613
605088681
605088787
605088789
605089276
605089308
605089322
605089448
605089504
605090116
605090133
605090256
605090850
605090891
605090918
605090951
605091023
605091576
605091590
605091757
605091796
605092350
605092411
605092500
605092539
605093190
605093276
605093473
605093485
605094057
605094079
605094850
605094867
605094892
605094923
605094980
605095604
605095618
605095793
605095812
605096319
605096340
605096912
605097015
605097018
605142955
605143200
605143204
605143205
605143208
605143425
605143435
605143440
605143443
605143486
605143500
605143654
605143704
605143837
605143839
605143842
605143845
605143867
605143871
605143878
605144052
605144055
605144056
605144081
605144092
605144099
605144111
605144119
605144224
605144229
605144231
605144249
605144261
605144262
605144415
605144443
605144609
605144610
605144613
605144618
605144619
605144623
605144632
605144661
605144668
605144672
605144695
605144840
605144847
605144853
605144873
605144876
605144877
605144885
605144904
605144922
605145039
605145075
605145096
605145110
605145252
605145253
605145256
605145265
605145274
605145276
605145277
605145283
605145291
605145300
605145304
605145305
605145427
605145432
605145465
605145473
605145596
605145616
605303089
605303156
605303220
605303226
605303310
605303314
605303758
605303806
605303838
605303864
605303875
605303895
605303988
605304009
605304012
605304446
605304528
605304548
605304649
605305125
605305176
605305216
605305265
605305280
605305793
605305837
605305925
605305936
605306402
605306478
605306512
605306527
605306545
605306547
605306607
605307096
605307247
605307809
605307821
605307877
605307885
605307915
605307931
605308424
605308428
605308443
605308447
605308457
605308585
605308613
605308627
605309054
605309121
605309159
605309224
605309236
605309243
605309729
605309776
605309779
605309806
605310146
605310183
605310230
605310253
617692424
617692511
617692592
617721332
617721434
617721528
617721694
617747220
617747302
617747459
617747641
617747699
617775065
617887296
617975231
618472887
618472907
618472908
618473483
618477011
618477190
739722507
739726190
739727006
739727126
739727136
739728120
739729660
740099733
740101145
740102273
740103298
740103646
740106865
740107618
740473434
740475001
740476218
740480381
740480526
740480774
740481457
740482208
740482972
740483034
740483094
740483120
740849477
740851029
740851042
740851647
740852368
740852422
740853284
740856170
740857482
741220835
741223128
741226232
741228959
741590632
741596894
