601946947
601946956
601957648
601957655
601957671
601957679
601957723
601962927
601962957
601962965
601962981
601962983
601963033
601968210
601968221
601968234
601968264
601968266
601968278
601968305
601968341
601968343
601968348
601973236
601978494
601978511
601978532
601978618
601978626
601978696
601983617
601983655
601983778
601988661
601988673
601988712
601988736
601988742
601988773
601988843
601993960
601994002
601994008
601994029
601994059
601994110
601994200
601994212
601999093
601999107
601999164
602004107
602004108
602004132
602004221
602004328
602009055
602009079
602009098
602009115
602009116
602009169
602009170
602009208
602013843
602013850
602013970
602013982
602014082
602019142
602019149
602019161
602019175
602019195
602023955
602023977
602023980
602029196
602029198
602583266
602583515
602583777
602584025
602584026
602584030
602584516
602585273
602585278
602585759
602586012
603207811
603215212
603215261
603215295
603215297
603215340
603222868
603223024
603230598
603230618
603230642
603230644
603230716
603230737
603230771
603230779
603238136
603238224
603238362
603238445
603238488
603238519
603238522
603245664
603245701
603245727
603245739
603245760
603245810
603245848
603245883
603245884
603245892
603253094
603253186
603253200
603253348
603260632
603260648
603260826
603260835
603268159
603268222
603268286
603268344
603268345
603268504
603268541
603268551
603268553
603275928
603275954
603276005
603276045
603276094
603276098
603276117
603276233
603283398
603283460
603283479
603283502
603283519
603283548
603283558
603283604
603283699
603291026
603291096
603291162
603291180
603291200
603291212
603291256
603291364
603291381
603291411
603298769
603298774
603298809
603306287
603306458
603306482
603306495
603313754
603313794
603321062
617225708
617225843
617226017
617253437
617253558
617253620
617253652
617253679
617253704
617253743
617253970
617281846
617281943
617282043
617282206
617282305
617282310
617282333
617282375
617282467
617282606
617310078
617310254
617310262
617310350
617310502
617310794
617310856
617338339
617338358
617338404
617338643
617338664
617338762
617338829
617338834
617338983
617339082
617339243
617339377
617339402
617339465
617339532
617339542
617339611
617367317
617367417
617367474
617367533
617367639
617367645
617367737
617367780
617367895
617367989
617368072
617368136
617368174
617368263
617368452
617368618
617368696
617368777
617396341
617396477
617396531
617396657
617396674
617396788
617396891
617396987
617397007
617397403
617397432
617397459
617397599
617397635
617397755
617425197
617425303
617425491
617425533
617425633
617425635
617425662
617426102
617426196
617426243
617426345
617426390
617426393
617426412
617426453
617426478
617426512
617426525
617426561
617454707
617454835
617454899
617454951
617455079
617455096
617455150
617455246
617455254
617455317
617455367
617455405
617455407
617455774
617455854
617456065
617456087
617456115
617456150
617484292
617484378
617484434
617484481
617484509
617484512
617484830
617484873
617485040
617485136
617485166
617485240
617485243
617485334
617485364
617485507
617485546
617485559
617485717
617485811
617513811
617513897
617514151
617514213
617514320
617514493
617514526
617514542
617514612
617514714
617514828
617515083
617515103
617515280
617543293
617543299
617543305
617543408
617543795
617543829
617543836
617543930
617543943
617544079
617544424
617544548
617544617
617573100
617573285
617573333
617573493
617573518
617573528
617573530
617573579
617573725
617573746
617573902
617573937
617574037
617574100
617574232
617603083
617603100
617603318
617603557
617603693
617603869
617603906
617603979
617632923
617633134
617633141
617633436
617633481
617663261
617663274
617663418
617663486
617663664
617693507
618469811
618470316
618470336
618470339
618470343
618470613
618470615
618470769
618470771
618470930
618470931
618471142
618471337
618471338
618471341
618471537
618471809
618472015
618472016
618472162
618472168
618472170
618472305
618472307
618472308
618472466
618472468
618472663
741587472
741587594
741970422
741970799
741973003
741973815
741974103
741974570
742360153
742362813
742363107
742364214
742366382
742368503
742369719
742749292
742750091
742750225
742750795
742750855
742752404
742752606
742753330
742753841
742753924
742754580
742755214
742756922
742757220
743135795
743137569
743138079
743138356
743138616
743139333
743139697
743139966
743140119
743144672
743145949
743518867
743519131
743520476
743521374
743521443
743521985
743523751
743523958
743524695
743524712
743524872
743525312
743526731
743527013
743888984
743889276
743890300
743891202
743891228
743892639
744237168
