%!PS-Adobe-2.0 EPSF-1.2
%%Creator: MATLAB, The MathWorks, Inc. Version 7.14.0.739 (R2012a). Operating System: Linux 3.13.0-53-generic #88-Ubuntu SMP Wed May 13 18:10:29 UTC 2015 x86_64.
%%Title: ./6__PSD_006949816.pow.eps
%%CreationDate: 05/23/2015  14:03:26
%%DocumentNeededFonts: Helvetica
%%DocumentProcessColors: Cyan Magenta Yellow Black
%%Extensions: CMYK
%%Pages: 1
%%BoundingBox:    43   281   577   546
%%EndComments

%%BeginProlog
% MathWorks dictionary
/MathWorks 160 dict begin
% definition operators
/bdef {bind def} bind def
/ldef {load def} bind def
/xdef {exch def} bdef
/xstore {exch store} bdef
% operator abbreviations
/c  /clip ldef
/cc /concat ldef
/cp /closepath ldef
/gr /grestore ldef
/gs /gsave ldef
/mt /moveto ldef
/np /newpath ldef
/cm /currentmatrix ldef
/sm /setmatrix ldef
/rm /rmoveto ldef
/rl /rlineto ldef
/s {show newpath} bdef
/sc {setcmykcolor} bdef
/sr /setrgbcolor ldef
/sg /setgray ldef
/w /setlinewidth ldef
/j /setlinejoin ldef
/cap /setlinecap ldef
/rc {rectclip} bdef
/rf {rectfill} bdef
% page state control
/pgsv () def
/bpage {/pgsv save def} bdef
/epage {pgsv restore} bdef
/bplot /gsave ldef
/eplot {stroke grestore} bdef
% orientation switch
/portraitMode 0 def /landscapeMode 1 def /rotateMode 2 def
% coordinate system mappings
/dpi2point 0 def
% font control
/FontSize 0 def
/FMS {/FontSize xstore findfont [FontSize 0 0 FontSize neg 0 0]
  makefont setfont} bdef
/reencode {exch dup where {pop load} {pop StandardEncoding} ifelse
  exch dup 3 1 roll findfont dup length dict begin
  { 1 index /FID ne {def}{pop pop} ifelse } forall
  /Encoding exch def currentdict end definefont pop} bdef
/isroman {findfont /CharStrings get /Agrave known} bdef
/FMSR {3 1 roll 1 index dup isroman {reencode} {pop pop} ifelse
  exch FMS} bdef
/csm {1 dpi2point div -1 dpi2point div scale neg translate
 dup landscapeMode eq {pop -90 rotate}
  {rotateMode eq {90 rotate} if} ifelse} bdef
% line types: solid, dotted, dashed, dotdash
/SO { [] 0 setdash } bdef
/DO { [.5 dpi2point mul 4 dpi2point mul] 0 setdash } bdef
/DA { [6 dpi2point mul] 0 setdash } bdef
/DD { [.5 dpi2point mul 4 dpi2point mul 6 dpi2point mul 4
  dpi2point mul] 0 setdash } bdef
% macros for lines and objects
/L {lineto stroke} bdef
/MP {3 1 roll moveto 1 sub {rlineto} repeat} bdef
/AP {{rlineto} repeat} bdef
/PDlw -1 def
/W {/PDlw currentlinewidth def setlinewidth} def
/PP {closepath eofill} bdef
/DP {closepath stroke} bdef
/MR {4 -2 roll moveto dup  0 exch rlineto exch 0 rlineto
  neg 0 exch rlineto closepath} bdef
/FR {MR stroke} bdef
/PR {MR fill} bdef
/L1i {{currentfile picstr readhexstring pop} image} bdef
/tMatrix matrix def
/MakeOval {newpath tMatrix currentmatrix pop translate scale
0 0 1 0 360 arc tMatrix setmatrix} bdef
/FO {MakeOval stroke} bdef
/PO {MakeOval fill} bdef
/PD {currentlinewidth 2 div 0 360 arc fill
   PDlw -1 eq not {PDlw w /PDlw -1 def} if} def
/FA {newpath tMatrix currentmatrix pop translate scale
  0 0 1 5 -2 roll arc tMatrix setmatrix stroke} bdef
/PA {newpath tMatrix currentmatrix pop	translate 0 0 moveto scale
  0 0 1 5 -2 roll arc closepath tMatrix setmatrix fill} bdef
/FAn {newpath tMatrix currentmatrix pop translate scale
  0 0 1 5 -2 roll arcn tMatrix setmatrix stroke} bdef
/PAn {newpath tMatrix currentmatrix pop translate 0 0 moveto scale
  0 0 1 5 -2 roll arcn closepath tMatrix setmatrix fill} bdef
/vradius 0 def /hradius 0 def /lry 0 def
/lrx 0 def /uly 0 def /ulx 0 def /rad 0 def
/MRR {/vradius xdef /hradius xdef /lry xdef /lrx xdef /uly xdef
  /ulx xdef newpath tMatrix currentmatrix pop ulx hradius add uly
  vradius add translate hradius vradius scale 0 0 1 180 270 arc 
  tMatrix setmatrix lrx hradius sub uly vradius add translate
  hradius vradius scale 0 0 1 270 360 arc tMatrix setmatrix
  lrx hradius sub lry vradius sub translate hradius vradius scale
  0 0 1 0 90 arc tMatrix setmatrix ulx hradius add lry vradius sub
  translate hradius vradius scale 0 0 1 90 180 arc tMatrix setmatrix
  closepath} bdef
/FRR {MRR stroke } bdef
/PRR {MRR fill } bdef
/MlrRR {/lry xdef /lrx xdef /uly xdef /ulx xdef /rad lry uly sub 2 div def
  newpath tMatrix currentmatrix pop ulx rad add uly rad add translate
  rad rad scale 0 0 1 90 270 arc tMatrix setmatrix lrx rad sub lry rad
  sub translate rad rad scale 0 0 1 270 90 arc tMatrix setmatrix
  closepath} bdef
/FlrRR {MlrRR stroke } bdef
/PlrRR {MlrRR fill } bdef
/MtbRR {/lry xdef /lrx xdef /uly xdef /ulx xdef /rad lrx ulx sub 2 div def
  newpath tMatrix currentmatrix pop ulx rad add uly rad add translate
  rad rad scale 0 0 1 180 360 arc tMatrix setmatrix lrx rad sub lry rad
  sub translate rad rad scale 0 0 1 0 180 arc tMatrix setmatrix
  closepath} bdef
/FtbRR {MtbRR stroke } bdef
/PtbRR {MtbRR fill } bdef
/stri 6 array def /dtri 6 array def
/smat 6 array def /dmat 6 array def
/tmat1 6 array def /tmat2 6 array def /dif 3 array def
/asub {/ind2 exch def /ind1 exch def dup dup
  ind1 get exch ind2 get sub exch } bdef
/tri_to_matrix {
  2 0 asub 3 1 asub 4 0 asub 5 1 asub
  dup 0 get exch 1 get 7 -1 roll astore } bdef
/compute_transform {
  dmat dtri tri_to_matrix tmat1 invertmatrix 
  smat stri tri_to_matrix tmat2 concatmatrix } bdef
/ds {stri astore pop} bdef
/dt {dtri astore pop} bdef
/db {2 copy /cols xdef /rows xdef mul dup 3 mul string
  currentfile exch readhexstring pop
  dup 0 3 index getinterval /rbmap xdef
  dup 2 index dup getinterval /gbmap xdef
  1 index dup 2 mul exch getinterval /bbmap xdef pop pop}bdef
/it {gs np dtri aload pop moveto lineto lineto cp c
  cols rows 8 compute_transform 
  rbmap gbmap bbmap true 3 colorimage gr}bdef
/il {newpath moveto lineto stroke}bdef
currentdict end def
%%EndProlog

%%BeginSetup
MathWorks begin

0 cap

end
%%EndSetup

%%Page: 1 1
%%BeginPageSetup
%%PageBoundingBox:    43   281   577   546
MathWorks begin
bpage
%%EndPageSetup

%%BeginObject: obj1
bplot

/dpi2point 12 def
portraitMode 0216 7344 csm

  305   787  6410  3183 MR c np
27 dict begin %Colortable dictionary
/c0 { 0.000000 0.000000 0.000000 sr} bdef
/c1 { 1.000000 1.000000 1.000000 sr} bdef
/c2 { 0.900000 0.000000 0.000000 sr} bdef
/c3 { 0.000000 0.820000 0.000000 sr} bdef
/c4 { 0.000000 0.000000 0.800000 sr} bdef
/c5 { 0.910000 0.820000 0.320000 sr} bdef
/c6 { 1.000000 0.260000 0.820000 sr} bdef
/c7 { 0.000000 0.820000 0.820000 sr} bdef
c0
1 j
1 sg
   0    0 6913 5186 PR
6 w
0 2593 5875 0 0 -2593 691 3630 4 MP
PP
-5875 0 0 2593 5875 0 0 -2593 691 3630 5 MP stroke
gs 691 1037 5876 2594 MR c np
/c8 { 0.818182 0.000000 0.181818 sr} bdef
c8
1 -2 0 2 1 -2 1 -1 1 2 1 -3 0 1 1 5 
1 -4 1 -1 0 10 1 -8 1 1 1 0 1 -3 0 -1 
1 3 1 -3 1 0 0 8 1 -8 1 0 1 0 0 8 
1 -8 1 8 1 3 1 -8 0 16 1 -14 1 18 1 -16 
0 -5 1 -1 1 0 1 5 1 2 0 5 1 18 1 -31 
1 5 0 5 1 -4 1 -4 1 -2 0 10 1 -1 1 -1 
1 1 1 -9 1 3 1 -3 1 4 0 -4 1 0 1 0 
1 11 1 -9 0 -2 1 3 1 -3 1 4 0 3 1 -3 
1 -1 1 0 1 -1 1 2 1 0 1 1 0 8 1 -13 
1 5 1 -5 0 2 1 2 1 -3 1 15 1 -16 0 4 
1 -2 1 6 1 -7 0 15 1 -14 1 2 1 -1 0 -1 
1 -1 1 -1 1 5 1 -1 0 -1 1 -2 1 3 1 -4 
0 1 1 4 1 -4 6489 3628 100 MP stroke
1 4 1 0 -1 0 2 6 1 -6 1 -5 1 7 1 -5 
1 -2 0 4 1 2 1 0 1 -4 1 0 0 2 1 -1 
1 -2 1 0 1 -1 1 7 1 -5 1 -1 0 1 1 -2 
1 3 1 -3 0 3 1 -3 1 2 1 0 -1 0 2 -2 
1 2 1 2 1 -1 1 4 1 -7 1 0 0 4 1 -4 
1 3 1 1 1 7 0 -8 1 -1 1 -2 1 0 -1 0 
2 3 1 -1 1 -1 1 -1 1 2 1 -2 1 1 0 6 
1 5 1 -7 1 -5 0 7 1 -7 1 5 1 -4 1 1 
1 0 1 6 1 -6 1 0 1 3 1 -2 0 14 1 -15 
1 -1 1 1 1 2 0 -4 1 2 1 -2 1 1 0 1 
1 -1 1 3 1 0 1 3 0 -7 1 2 1 -1 1 -1 
0 3 1 -2 1 1 1 -2 1 9 0 -9 1 1 1 -1 
1 3 0 -2 1 4 6408 3624 100 MP stroke
1 -5 1 1 1 9 1 -10 1 1 1 0 0 3 1 -4 
1 5 1 -5 1 2 1 -2 1 13 1 1 0 -10 1 2 
1 0 1 -5 0 4 1 1 1 -3 1 -1 0 -2 1 3 
1 -2 1 4 1 4 0 -4 1 -5 1 0 1 9 0 -6 
1 4 1 -4 1 -3 1 0 0 5 1 1 1 1 1 -6 
1 5 1 -2 1 -3 0 1 1 -1 1 1 1 0 1 2 
0 -4 1 2 1 -1 1 -1 0 3 1 -2 1 2 1 -2 
1 -1 1 0 1 4 1 -4 0 5 1 -1 1 -3 1 -1 
0 11 1 -9 1 -2 1 7 1 11 0 -18 1 3 1 -2 
1 0 -1 0 2 2 1 4 1 -5 1 -2 0 5 1 4 
1 -3 1 -6 0 2 1 -2 1 3 1 -2 0 8 1 -9 
1 0 1 9 1 -8 0 2 1 -2 1 3 1 2 0 -6 
1 3 1 -2 1 2 6328 3626 100 MP stroke
1 2 0 -1 1 -2 1 0 1 -2 0 2 1 0 1 -1 
1 3 0 -4 1 3 1 -3 1 0 1 0 0 3 1 2 
1 -5 1 1 0 8 1 -8 1 -1 1 4 1 4 0 -4 
1 2 1 -5 1 0 1 -1 1 3 1 5 0 -1 1 -7 
1 0 1 2 1 -1 0 2 1 0 1 0 1 3 0 -3 
1 3 1 4 1 4 1 -8 0 2 1 2 1 -9 1 -1 
0 2 1 3 1 0 1 -1 0 1 1 3 1 2 1 -2 
1 -7 0 9 1 -7 1 6 1 8 0 -10 1 -6 1 12 
1 3 1 1 0 -2 1 1 1 -12 1 -2 0 12 1 -9 
1 -1 1 11 0 -15 1 8 1 -2 1 8 1 -8 0 9 
1 -13 1 1 1 8 0 -9 1 14 1 -3 1 -12 1 10 
0 -11 1 0 1 3 1 15 0 -15 1 11 1 -7 1 -5 
1 -1 0 -1 1 4 6251 3625 100 MP stroke
1 -1 1 1 0 2 1 8 1 -5 1 2 0 -7 1 -4 
1 2 1 -2 1 13 0 -11 1 7 1 -8 1 11 0 -11 
1 8 1 -5 1 3 1 -3 0 -2 1 -2 1 1 1 0 
-1 0 2 13 1 -12 1 1 0 1 1 -1 1 -3 1 1 
1 2 0 -2 1 5 1 5 1 17 0 -27 1 0 1 4 
1 2 1 -6 0 26 1 -16 1 7 1 -10 0 11 1 -5 
1 -13 1 21 0 -15 1 1 1 -1 1 -2 1 -4 1 -1 
1 2 1 19 0 -16 1 -2 1 1 1 10 1 -7 0 -7 
1 10 1 -8 1 -2 0 28 1 -24 1 1 1 0 0 -5 
1 1 1 4 1 8 1 -12 1 11 1 -11 1 2 0 -3 
1 13 1 -1 1 -10 1 9 0 -8 1 -3 1 10 1 -10 
0 5 1 -1 1 4 1 28 0 -36 1 2 1 12 1 -10 
1 0 0 -3 1 7 6173 3621 100 MP stroke
1 8 1 -12 0 2 1 -5 1 5 1 13 1 -19 1 1 
1 2 1 -3 1 0 1 3 1 -3 0 3 1 -2 1 4 
1 2 1 4 0 -5 1 3 1 -5 1 1 0 -2 1 5 
1 -4 1 -4 1 6 0 -6 1 4 1 2 1 6 0 -7 
1 -5 1 2 1 2 0 5 1 1 1 -9 1 -1 1 0 
0 18 1 -11 1 0 1 -5 0 -2 1 3 1 -2 1 2 
1 6 0 11 1 -13 1 -7 1 1 0 -1 1 3 1 0 
1 4 0 -5 1 3 1 -3 1 18 1 -20 0 10 1 -9 
1 2 1 2 1 -3 1 24 1 -26 1 5 0 -3 1 7 
1 1 1 -7 0 14 1 -16 1 0 1 17 0 -16 1 15 
1 -14 1 3 1 1 0 3 1 -6 1 -1 1 0 0 -3 
1 0 1 0 1 11 1 -10 0 4 1 -2 1 17 1 -11 
0 -6 1 6 1 1 6094 3619 100 MP stroke
1 -8 1 -2 0 3 1 1 1 -2 1 0 -1 0 2 0 
1 0 1 -1 1 -1 1 5 1 0 1 -4 0 2 1 8 
1 -10 1 3 1 -3 1 -1 1 4 1 -3 0 -1 1 12 
1 -1 1 -1 0 -4 1 14 1 -19 1 17 0 -16 1 -1 
1 5 1 0 1 0 -1 0 2 1 1 -5 1 -2 0 25 
1 -22 1 2 1 0 1 19 0 -24 1 9 1 -4 1 -4 
0 8 1 -7 1 1 1 -2 0 -1 1 18 1 -14 1 2 
1 3 0 -9 1 7 1 8 1 6 0 9 1 -23 1 -6 
1 7 1 -5 0 1 1 49 1 -47 1 -1 0 4 1 -8 
1 1 1 0 0 6 1 2 1 -7 1 20 1 8 0 -13 
1 -13 1 17 1 -3 0 -19 1 13 1 -7 1 4 1 0 
0 -10 1 8 1 -1 1 10 1 -17 1 0 1 2 0 8 
1 -10 1 1 1 -1 6015 3629 100 MP stroke
1 4 0 -1 1 3 1 6 1 -11 0 4 1 -4 1 28 
1 -26 1 8 0 -8 1 2 1 3 1 -8 0 2 1 0 
1 3 1 12 0 -13 1 -1 1 6 1 -1 1 15 0 -21 
1 2 1 5 1 -4 0 -2 1 0 1 4 1 -7 1 16 
0 -8 1 -6 1 10 1 -6 0 -3 1 3 1 -6 1 0 
1 1 1 0 1 2 1 -3 0 2 1 -2 1 1 1 0 
0 11 1 -9 1 1 1 -2 1 -2 0 9 1 -6 1 1 
1 0 0 -3 1 10 1 -11 1 2 0 4 1 -3 1 -1 
1 -1 1 1 0 5 1 -2 1 -3 1 -2 1 10 1 8 
1 -7 1 -10 1 0 1 1 1 -1 0 5 1 -6 1 3 
1 -3 0 3 1 -1 1 5 1 -7 1 2 0 8 1 -6 
1 0 1 -2 0 10 1 -6 1 -5 1 14 1 -12 0 -3 
1 5 1 2 1 4 5936 3618 100 MP stroke
0 -2 1 -3 1 -5 1 -1 1 0 1 3 1 7 1 -10 
0 24 1 -24 1 3 1 -3 1 1 1 2 1 -2 1 -1 
1 1 1 13 1 -14 0 4 1 -2 1 2 1 3 1 2 
0 -9 1 8 1 -5 1 1 0 -3 1 7 1 -6 1 10 
0 -12 1 3 1 6 1 -5 1 -1 0 -3 1 8 1 0 
1 -8 0 4 1 5 1 -9 1 5 1 -5 0 9 1 -5 
1 -1 1 6 0 9 1 -11 1 -2 1 15 0 -17 1 3 
1 -3 1 6 1 -6 0 6 1 -6 1 -2 1 4 0 26 
1 -22 1 -9 1 13 1 -7 0 -5 1 1 1 7 1 3 
0 -12 1 0 1 13 1 -11 0 8 1 -5 1 -5 1 11 
1 -9 1 -2 1 7 1 -3 0 3 1 -5 1 -2 1 1 
1 6 0 -5 1 -1 1 -1 1 6 0 -6 1 0 1 0 
1 3 0 2 1 1 5857 3623 100 MP stroke
1 4 1 -2 1 -6 0 5 1 -1 1 -1 1 -3 0 5 
1 -6 1 5 1 -3 1 -1 0 7 1 -9 1 1 1 -1 
0 3 1 10 1 8 1 -19 1 3 1 -3 1 -2 1 6 
0 -3 1 20 1 -22 1 4 0 -4 1 1 1 1 1 13 
1 -1 0 -13 1 -1 1 2 1 -3 0 9 1 -8 1 9 
1 13 0 -20 1 0 1 5 1 3 1 -4 0 -7 1 3 
1 0 1 -1 0 11 1 -11 1 0 1 2 1 -2 0 1 
1 3 1 18 1 -17 0 7 1 -6 1 -5 1 40 0 -12 
1 -20 1 -8 1 24 1 -27 0 19 1 -12 1 39 1 -16 
0 2 1 -25 1 -6 1 69 1 -37 0 26 1 -34 1 10 
1 12 0 -25 1 48 1 -49 1 11 0 4 1 31 1 -35 
1 6 1 -5 0 -29 1 -3 1 18 1 -5 0 -5 1 57 
1 -48 1 16 1 -32 5779 3627 100 MP stroke
0 -1 1 25 1 4 1 -21 0 11 1 -5 1 1 1 -12 
0 -3 1 10 1 -7 1 18 1 -21 0 39 1 -19 1 -10 
1 20 0 -23 1 -8 1 15 1 -7 1 3 0 8 1 -18 
1 1 1 8 0 -10 1 7 1 -2 1 -2 1 11 0 -10 
1 -2 1 13 1 -10 0 -2 1 0 1 5 1 -8 0 25 
1 -21 1 -4 1 3 1 3 0 -3 1 10 1 9 1 -18 
0 -1 1 12 1 10 1 -22 1 8 0 -5 1 2 1 22 
1 -20 0 5 1 -6 1 77 1 -6 0 -26 1 -18 1 -22 
1 -12 1 1 0 21 1 46 1 -61 1 61 0 -3 1 39 
1 -94 1 -9 1 25 0 -19 1 -7 1 9 1 11 0 27 
1 -45 1 9 1 -12 0 32 1 -15 1 18 1 -35 1 12 
0 -7 1 28 1 -19 1 -3 0 7 1 -19 1 0 1 37 
1 -32 0 11 1 -9 5703 3622 100 MP stroke
1 -4 1 -1 0 18 1 -17 1 18 1 -19 0 10 1 26 
1 -35 1 1 1 3 0 17 1 -23 1 8 1 -6 0 11 
1 -13 1 -1 1 18 1 -14 0 10 1 9 1 -19 1 22 
0 -2 1 -17 1 -6 1 5 0 -4 1 17 1 -5 1 11 
1 -24 0 6 1 7 1 -9 1 -2 0 -3 1 0 1 13 
1 -12 1 10 0 -11 1 2 1 7 1 -4 0 -4 1 6 
1 -7 1 8 0 5 1 -13 1 2 1 11 1 -12 0 2 
1 4 1 -3 1 7 0 -6 1 2 1 -5 1 1 1 -1 
0 -1 1 10 1 0 1 2 0 1 1 -10 1 11 1 -15 
0 6 1 1 1 17 1 -16 1 -8 0 10 1 -7 1 4 
1 -3 0 10 1 -11 1 -2 1 5 1 -2 0 10 1 -4 
1 0 1 -2 0 -8 1 2 1 4 1 4 0 -5 1 -5 
1 1 1 4 1 10 5626 3614 100 MP stroke
0 -14 1 6 1 9 1 -12 0 2 1 -2 1 -4 1 6 
1 10 0 -15 1 0 1 1 1 0 0 8 1 32 1 -12 
1 13 0 -28 1 -13 1 -2 1 8 1 15 0 -2 1 2 
1 -17 1 -2 0 18 1 -2 1 -17 1 -3 1 5 0 25 
1 -26 1 -3 1 1 0 1 1 3 1 -3 1 -3 1 21 
0 -7 1 1 1 -15 1 13 0 -8 1 -4 1 0 1 21 
0 -20 1 -2 1 18 1 -12 1 -1 0 1 1 13 1 -15 
1 20 0 4 1 10 1 -25 1 -3 1 5 0 -3 1 -2 
1 62 1 -29 0 10 1 -51 1 14 1 0 0 -16 1 2 
1 1 1 3 1 -1 0 -2 1 1 1 15 1 -16 0 4 
1 10 1 -15 1 9 1 49 0 -39 1 -20 1 23 1 47 
0 -45 1 139 1 -136 1 15 0 393 1 -317 1 -119 1 104 
1 38 0 -59 1 -50 5550 3595 100 MP stroke
1 -29 1 10 0 -3 1 -6 1 5 1 46 1 -49 1 3 
1 -5 1 14 0 -10 1 -8 1 5 1 1 0 -5 1 0 
1 1 1 1 1 0 -1 0 2 -2 1 -1 1 3 0 -3 
1 -2 1 4 1 23 1 -3 0 1 1 -21 1 27 1 -25 
0 17 1 -23 1 13 1 -12 0 28 1 -20 1 -6 1 8 
1 -2 0 -5 1 -3 1 6 1 4 0 -9 1 4 1 -5 
1 0 1 3 0 -2 1 -1 1 -1 1 11 0 -1 1 -4 
1 4 1 -9 0 6 1 -1 1 -5 1 1 1 6 0 -4 
1 -2 1 -2 1 11 0 -3 1 -2 1 9 1 -9 1 9 
0 73 1 61 1 -134 1 -11 0 6 1 -6 1 -1 1 4 
0 -4 1 5 1 -8 1 3 1 0 0 3 1 -3 1 5 
1 -3 0 -4 1 8 1 -5 1 1 1 -5 0 3 1 0 
1 2 1 -5 1 1 5472 3628 100 MP stroke
1 13 1 -10 0 -1 1 -2 1 12 1 -11 1 2 1 -2 
1 0 1 0 0 4 1 -6 1 5 1 1 1 1 0 3 
1 1 1 2 1 62 0 -68 1 1 1 -2 1 -3 0 1 
1 -2 1 21 1 -18 1 -5 0 2 1 10 1 1 1 -12 
0 4 1 -4 1 2 1 1 1 -3 0 9 1 -9 1 1 
1 -1 0 -1 1 5 1 -5 1 8 0 -7 1 6 1 -1 
1 -4 1 3 0 -2 1 0 1 7 1 -5 0 -5 1 0 
1 5 1 -3 1 0 1 -1 1 40 1 -30 0 6 1 -10 
1 -5 1 -2 1 0 0 4 1 -1 1 1 1 5 0 -9 
1 0 1 21 1 -20 0 4 1 13 1 19 1 -5 1 30 
0 -55 1 -7 1 6 1 -6 0 22 1 27 1 -41 1 35 
1 -22 0 -20 1 30 1 -31 1 17 0 -11 1 22 1 -27 
1 4 0 -3 1 29 5394 3598 100 MP stroke
1 -26 1 -2 1 2 1 -4 1 0 1 26 0 115 1 -128 
1 -12 1 -2 1 8 0 -2 1 -4 1 21 1 -18 0 -2 
1 -1 1 14 1 -6 0 -5 1 2 1 -7 1 4 1 -3 
0 -1 1 32 1 -13 1 -19 1 0 1 8 1 -6 1 6 
0 -5 1 -2 1 6 1 -3 0 -4 1 24 1 -9 1 -1 
0 -14 1 9 1 -2 1 -7 1 7 0 -6 1 10 1 -3 
1 -8 0 17 1 -11 1 4 1 3 1 -4 0 1 1 3 
1 -10 1 4 0 -4 1 5 1 0 1 3 0 -4 1 -6 
1 0 1 2 1 -3 1 1 1 2 1 13 0 -5 1 -8 
1 8 1 0 1 14 0 -8 1 17 1 -19 1 8 0 -2 
1 -18 1 3 1 -4 0 11 1 -3 1 -1 1 84 1 -62 
0 14 1 -43 1 -2 1 3 0 33 1 3 1 84 1 48 
1 -126 0 67 1 158 5315 3359 100 MP stroke
1 -269 1 12 0 37 1 0 1 125 1 -56 0 105 1 -136 
1 -75 1 188 1 -157 0 -39 1 101 1 -83 1 58 0 -27 
1 -28 1 -1 1 -25 1 0 0 23 1 7 1 -12 1 17 
0 -19 1 9 1 16 1 -29 0 -1 1 7 1 -15 1 14 
1 -11 0 -3 1 10 1 -10 1 7 0 5 1 37 1 -52 
1 6 1 3 0 -6 1 0 1 4 1 12 0 -3 1 -14 
1 2 1 25 0 -19 1 2 1 -8 1 15 1 -11 0 14 
1 -18 1 5 1 48 0 -50 1 -4 1 20 1 -21 1 3 
0 -4 1 18 1 2 1 -14 0 70 1 -3 1 2 1 -20 
1 6 0 -53 1 0 1 48 1 -53 0 97 1 62 1 -119 
1 156 0 13 1 -181 1 88 1 -23 1 -72 0 5 1 7 
1 40 1 35 0 -93 1 16 1 -5 1 -4 1 -15 0 -8 
1 49 1 -33 1 54 5238 3556 100 MP stroke
0 -63 1 32 1 -21 1 -21 1 5 1 8 1 -13 1 7 
0 -4 1 14 1 4 1 -14 0 18 1 -20 1 7 1 0 
1 -8 0 15 1 -8 1 -2 1 -3 0 -2 1 11 1 19 
1 40 0 -65 1 9 1 -18 1 6 1 -3 0 7 1 -1 
1 10 1 -11 0 -2 1 -4 1 -1 1 19 1 -19 0 4 
1 -1 1 1 1 -3 0 16 1 -16 1 7 1 -6 0 2 
1 -4 1 4 1 22 1 -27 0 1 1 11 1 2 1 -4 
0 -2 1 -1 1 43 1 -5 1 -39 0 7 1 5 1 -6 
1 -11 0 72 1 -71 1 10 1 -6 0 2 1 6 1 -11 
1 8 1 -1 0 -10 1 2 1 2 1 9 0 -9 1 9 
1 9 1 -20 1 4 0 -1 1 2 1 -7 1 5 0 3 
1 -3 1 1 1 0 0 -3 1 -3 1 1 1 25 1 -11 
0 -9 1 -1 1 28 5161 3596 100 MP stroke
1 28 0 -60 1 2 1 -2 1 48 1 -45 0 22 1 74 
1 -99 1 7 0 -4 1 4 1 -6 1 2 0 13 1 -8 
1 -7 1 8 1 -6 0 1 1 -3 1 6 1 -2 0 -4 
1 -1 1 27 1 -22 1 0 0 -4 1 8 1 10 1 -13 
0 -3 1 0 1 18 1 -21 0 2 1 69 1 90 1 -160 
1 1 0 107 1 16 1 -36 1 -70 0 26 1 488 1 -479 
1 -45 1 23 0 -5 1 -17 1 -8 1 30 0 3 1 -21 
1 4 1 -11 0 2 1 -6 1 10 1 -1 1 9 0 -16 
1 70 1 -37 1 -39 0 41 1 -4 1 -6 1 -18 1 154 
0 407 1 -492 1 -15 1 -63 0 261 1 -235 1 404 1 -221 
0 142 1 -205 1 -120 1 41 1 -22 0 4 1 -49 1 -4 
1 4 0 8 1 12 1 -12 1 -12 1 8 0 46 1 1 
1 -44 1 149 0 -48 5085 3517 100 MP stroke
1 -97 1 150 1 -149 1 91 0 -98 1 125 1 -31 1 2057 
0 -1892 1 1 1 -263 1 40 0 -28 1 -13 1 8 1 13 
1 12 0 -25 1 -6 1 4 1 2 0 -8 1 -3 1 15 
1 -17 1 0 1 13 1 -13 1 11 0 16 1 12 1 -36 
1 28 0 -4 1 93 1 -43 1 -73 1 17 0 -21 1 234 
1 -53 1 -146 0 -9 1 -20 1 16 1 -9 1 -5 0 23 
1 -18 1 22 1 -12 0 -22 1 6 1 5 1 -10 0 9 
1 -9 1 5 1 -1 1 -1 0 3 1 13 1 -18 1 7 
0 2 1 97 1 -95 1 16 1 6 0 -29 1 -1 1 19 
1 -25 0 1 1 2 1 2 1 27 0 -22 1 2 1 -7 
1 -3 1 1 0 19 1 -22 1 8 1 -8 0 1 1 8 
1 3 1 -12 1 6 0 5 1 -10 1 21 1 -17 0 -4 
1 2 1 0 1 2 5007 3624 100 MP stroke
0 -3 1 15 1 -9 1 -1 1 -7 1 11 1 9 1 -17 
0 -3 1 9 1 6 1 -9 1 8 0 -12 1 -1 1 12 
1 -4 0 7 1 -11 1 6 1 10 0 -20 1 5 1 -4 
1 3 1 -4 0 8 1 -3 1 3 1 -7 0 1 1 -2 
1 11 1 -2 1 5 0 -7 1 -6 1 1 1 8 0 32 
1 -37 1 -2 1 -4 0 4 1 -4 1 4 1 -2 1 -2 
0 8 1 2 1 7 1 7 0 -19 1 117 1 -115 1 -7 
1 1 1 3 1 6 1 9 0 -2 1 -3 1 -7 1 -6 
0 1 1 8 1 -5 1 2 1 -2 0 6 1 21 1 -30 
1 9 1 1 1 54 1 -62 1 5 0 -2 1 -3 1 1 
1 1 0 -2 1 0 1 8 1 -1 0 -3 1 6 1 0 
1 -14 1 2 0 25 1 -22 1 203 1 -205 0 27 1 49 
1 -3 1 -69 1 38 4928 3584 100 MP stroke
0 -32 1 14 1 -8 1 -2 1 3 1 -14 1 -2 1 10 
0 -3 1 -5 1 2 1 0 -1 0 2 -2 1 -6 1 27 
0 -18 1 0 1 0 1 -8 1 4 0 -5 1 2 1 -1 
1 2 0 -2 1 4 1 12 1 -17 1 6 0 -5 1 23 
1 -24 1 1 0 22 1 -1 1 -20 1 18 0 34 1 -49 
1 12 1 -17 1 0 0 6 1 -4 1 1 1 22 0 -15 
1 -8 1 17 1 -14 1 -3 0 6 1 -1 1 -5 1 2 
0 3 1 1 1 -5 1 11 0 -2 1 -4 1 -6 1 4 
1 4 0 -4 1 1 1 8 1 -2 0 -12 1 20 1 -11 
1 25 1 -23 0 10 1 -1 1 -15 1 33 0 -12 1 -17 
1 30 1 -16 0 6 1 56 1 -62 1 40 1 -39 0 -16 
1 87 1 -89 1 11 0 18 1 -11 1 -1 1 9 1 -6 
0 81 1 -73 1 154 4851 3440 100 MP stroke
1 405 0 521 1 -397 1 -352 1 292 0 293 1 -808 1 -102 
1 236 1 -206 0 -29 1 -1 1 -23 1 -9 0 22 1 13 
1 -26 1 23 1 111 0 -145 1 10 1 5 1 44 0 20 
1 -36 1 18 1 -24 0 -33 1 9 1 37 1 -47 1 -10 
0 3 1 1 1 -2 1 14 0 13 1 -1 1 17 1 0 
1 -39 0 -2 1 0 1 -3 1 15 0 -5 1 1 1 -11 
1 6 0 33 1 -36 1 13 1 2 1 32 0 -34 1 -6 
1 11 1 -12 0 8 1 29 1 -10 1 -31 1 6 0 -7 
1 33 1 -11 1 -24 0 17 1 2 1 11 1 -28 0 46 
1 -47 1 3 1 7 1 3 0 -17 1 3 1 255 1 -243 
0 82 1 445 1 689 1 -1085 1 -140 0 369 1 -222 1 -122 
1 307 0 -33 1 -267 1 397 1 -422 0 75 1 -38 1 -5 
1 13 1 -52 0 2 4775 3621 100 MP stroke
1 4 1 25 1 -24 0 13 1 -20 1 25 1 26 1 -51 
0 -2 1 75 1 -76 1 31 0 -16 1 -7 1 8 1 -5 
1 18 0 -23 1 15 1 -5 1 -8 0 -11 1 7 1 19 
1 26 0 -5 1 -45 1 21 1 -4 1 -14 0 6 1 -8 
1 5 1 11 0 -18 1 0 1 23 1 -23 1 6 0 32 
1 -24 1 15 1 -29 0 21 1 -6 1 42 1 -52 0 5 
1 -8 1 -1 1 2 1 8 0 -8 1 4 1 -6 1 15 
0 -13 1 12 1 -13 1 2 1 11 0 35 1 -49 1 19 
1 -21 0 7 1 11 1 -17 1 39 0 -36 1 8 1 0 
1 2 1 1 0 -5 1 -6 1 -1 1 0 0 24 1 -27 
1 0 1 3 1 9 0 -6 1 -1 1 3 1 -3 0 -4 
1 5 1 3 1 -9 0 3 1 265 1 -255 1 10 1 -16 
0 -5 1 12 1 -7 4698 3622 100 MP stroke
1 -5 0 1 1 5 1 2 1 -5 1 2 0 -2 1 25 
1 -21 1 1 0 -5 1 0 1 37 1 -40 0 -2 1 47 
1 -39 1 18 1 -25 1 12 1 6 1 -18 0 4 1 21 
1 324 1 -330 1 3 0 -21 1 16 1 8 1 -22 0 13 
1 35 1 -43 1 5 0 95 1 -86 1 63 1 -85 1 6 
0 -5 1 60 1 -61 1 8 0 22 1 -24 1 83 1 -62 
1 -9 0 6 1 -13 1 23 1 -4 0 -31 1 14 1 151 
1 -111 0 -54 1 24 1 -20 1 -3 1 4 0 -4 1 21 
1 -14 1 231 0 -69 1 -169 1 4 1 15 1 -18 0 -2 
1 56 1 119 1 42 0 -100 1 -49 1 -56 1 63 0 56 
1 -124 1 82 1 71 1 -46 0 -64 1 -48 1 25 1 9 
0 -2 1 -33 1 101 1 -28 1 -24 0 -29 1 11 1 -27 
1 -5 0 45 1 17 4621 3567 100 MP stroke
1 60 1 3 0 -64 1 108 1 -51 1 1820 1 -1789 0 -124 
1 68 1 -69 1 -10 0 6 1 -12 1 57 1 -56 1 2 
0 7 1 29 1 -41 1 27 0 -17 1 11 1 -27 1 8 
0 111 1 -70 1 2 1 -37 1 1 0 31 1 -41 1 38 
1 377 0 -358 1 -51 1 -7 1 53 1 -51 0 8 1 -12 
1 26 1 -28 0 13 1 8 1 17 1 -36 1 3 0 -2 
1 6 1 5 1 -2 0 -5 1 23 1 12 1 -38 0 157 
1 -142 1 44 1 -52 1 -11 0 21 1 212 1 -233 1 18 
0 -13 1 0 1 1 1 30 1 -26 0 -6 1 5 1 8 
1 -17 1 7 1 -1 1 19 0 -6 1 -15 1 -4 1 8 
1 0 0 -4 1 -1 1 -1 1 9 0 17 1 1 1 -29 
1 7 1 3 0 -10 1 27 1 -19 1 -1 0 -7 1 10 
1 -5 1 72 0 -45 4544 3597 100 MP stroke
1 -28 1 -3 1 8 1 -6 0 -3 1 1 1 6 1 -6 
0 12 1 1 1 -13 1 9 1 -7 1 -3 1 11 1 32 
0 -35 1 15 1 -14 1 -5 0 5 1 -7 1 4 1 -5 
1 2 0 -2 1 42 1 -43 1 0 0 3 1 -1 1 3 
1 1 1 0 0 -3 1 0 1 -1 1 -2 0 26 1 -24 
1 17 1 -11 0 -7 1 1 1 3 1 -5 1 14 0 -7 
1 2 1 23 1 -31 1 -1 1 12 1 -6 1 2 0 -3 
1 4 1 -4 1 0 -1 0 2 9 1 -5 1 2 0 -10 
1 7 1 -4 1 4 1 -4 1 3 1 6 1 -11 0 1 
1 6 1 -7 1 -2 1 5 0 4 1 9 1 -15 1 1 
0 -4 1 6 1 -6 1 9 0 -2 1 7 1 9 1 -20 
1 4 0 9 1 12 1 -19 1 -6 0 49 1 -51 1 7 
1 60 1 -63 0 5 4465 3619 100 MP stroke
1 54 1 -47 1 85 0 -78 1 -10 1 -9 1 6 0 -7 
1 -2 1 0 1 80 1 -50 0 -29 1 -3 1 6 1 -3 
0 -2 1 1 1 -1 1 -1 1 2 0 -2 1 0 1 6 
1 3 0 13 1 -1 1 -18 1 -3 0 37 1 -18 1 -4 
1 -13 1 3 0 20 1 -18 1 -2 1 -5 0 8 1 -2 
1 11 1 5 1 -17 0 -1 1 -4 1 5 1 -2 0 -2 
1 35 1 -24 1 -5 1 0 0 -3 1 -1 1 -3 1 1 
0 13 1 -12 1 3 1 1 0 5 1 23 1 -8 1 -24 
1 2 0 -4 1 4 1 -3 1 5 0 -5 1 3 1 42 
1 -19 1 -17 0 3 1 -12 1 14 1 -6 0 17 1 -19 
1 6 1 3 0 1 1 -2 1 -14 1 1 1 16 0 15 
1 -1 1 -4 1 62 0 -85 1 -5 1 67 1 -63 1 40 
0 15 1 -34 1 50 4388 3554 100 MP stroke
1 -54 0 7 1 116 1 -124 1 216 0 -76 1 -36 1 -37 
1 272 1 -359 0 63 1 151 1 -28 1 -163 0 18 1 -22 
1 0 1 36 1 -39 0 111 1 -119 1 -6 1 7 0 26 
1 -30 1 -3 1 19 0 -20 1 37 1 -32 1 -1 1 4 
0 12 1 -13 1 60 1 -54 0 -9 1 24 1 -29 1 9 
1 -5 0 12 1 -13 1 4 1 15 1 -7 1 -13 1 1 
1 37 1 -35 1 -3 1 1 0 1 1 3 1 -2 1 -2 
0 30 1 -33 1 2 1 9 1 65 0 -58 1 -2 1 -2 
1 2 0 -16 1 10 1 2 1 -4 0 -8 1 13 1 -12 
1 35 1 -11 0 9 1 31 1 -50 1 7 0 30 1 -48 
1 34 1 -18 1 -18 0 56 1 48 1 -97 1 142 0 -138 
1 161 1 -110 1 -47 0 22 1 96 1 -135 1 21 1 32 
0 54 1 -81 1 -22 4310 3625 100 MP stroke
1 31 0 -26 1 -8 1 47 1 -41 1 26 0 -17 1 18 
1 -27 1 29 0 -18 1 26 1 -36 1 6 1 -11 1 36 
1 -36 1 -1 0 -1 1 6 1 18 1 48 0 -62 1 -1 
1 15 1 18 1 -40 0 5 1 -6 1 0 1 -2 0 11 
1 34 1 -41 1 -1 1 -1 1 -1 1 1 1 6 0 -8 
1 1 1 1 1 0 0 5 1 12 1 -13 1 4 1 -5 
0 10 1 -11 1 14 1 -18 0 5 1 -1 1 1 1 -5 
1 0 1 27 1 -27 1 4 0 -2 1 -1 1 29 1 -30 
0 7 1 3 1 12 1 -6 1 -15 0 10 1 -6 1 5 
1 36 0 -41 1 -1 1 5 1 21 1 -26 0 16 1 -5 
1 10 1 -25 0 1 1 10 1 -7 1 0 0 -4 1 3 
1 7 1 9 1 -7 0 13 1 -9 1 -5 1 -11 1 12 
1 -6 1 0 1 42 4230 3581 100 MP stroke
0 -25 1 -10 1 -2 1 5 0 -6 1 -6 1 0 1 4 
0 9 1 -7 1 -8 1 19 1 -1 0 -5 1 3 1 -16 
1 29 0 -20 1 8 1 -13 1 3 1 0 0 -4 1 -5 
1 11 1 5 0 21 1 28 1 -65 1 7 0 -3 1 -3 
1 10 1 13 1 -15 0 -2 1 45 1 -40 1 -11 1 9 
1 -6 1 45 1 -22 0 81 1 -97 1 4 1 -13 0 -2 
1 4 1 11 1 -9 0 66 1 92 1 -147 1 -10 1 -4 
0 40 1 -37 1 23 1 -15 0 21 1 4 1 -34 1 -4 
1 11 0 24 1 -11 1 81 1 -61 0 2 1 -41 1 -1 
1 1 0 12 1 -17 1 57 1 -41 1 20 0 -1 1 -15 
1 6 1 -1 0 11 1 5 1 -20 1 -18 1 7 0 39 
1 7 1 13 1 -70 0 18 1 0 1 -2 1 -6 0 10 
1 -7 1 -7 1 13 4153 3610 100 MP stroke
1 72 0 -75 1 83 1 20 1 -107 0 -3 1 28 1 18 
1 22 1 -62 0 13 1 -28 1 5 1 18 0 -12 1 57 
1 -49 1 103 0 22 1 -128 1 -11 1 19 1 -14 0 16 
1 -16 1 -8 1 27 0 6 1 -33 1 38 1 51 1 -84 
0 -5 1 -1 1 40 1 -25 0 -15 1 5 1 31 1 -34 
0 23 1 -14 1 -10 1 0 1 8 0 -6 1 6 1 2 
1 -10 0 2 1 -3 1 20 1 -18 1 0 0 27 1 -6 
1 -23 1 9 0 13 1 -11 1 -8 1 14 0 -7 1 -8 
1 16 1 -19 1 19 0 -19 1 7 1 -7 1 10 0 10 
1 7 1 -18 1 -8 1 12 0 -12 1 11 1 34 1 -35 
0 20 1 -28 1 1 1 0 1 2 0 5 1 8 1 -13 
1 -5 0 3 1 31 1 30 1 -63 1 6 1 3 1 -11 
1 0 0 9 1 8 4076 3612 100 MP stroke
1 -16 1 6 0 -7 1 3 1 -3 1 12 1 27 0 -23 
1 10 1 -20 1 -2 0 17 1 -19 1 17 1 -16 1 38 
1 -13 1 -16 1 -11 0 16 1 -1 1 -15 1 0 1 3 
1 5 1 6 1 -15 1 24 1 -16 1 -8 0 14 1 0 
1 -13 1 21 0 -12 1 1 1 -4 1 20 1 -23 0 8 
1 -8 1 -1 1 5 0 -2 1 10 1 -11 1 0 1 5 
0 -2 1 28 1 -29 1 -4 0 30 1 -32 1 3 1 -1 
0 1 1 4 1 -8 1 4 1 -3 0 5 1 14 1 -13 
1 -7 0 8 1 16 1 -24 1 26 1 -14 0 1 1 5 
1 -16 1 -1 0 18 1 -8 1 -11 1 3 0 -1 1 -1 
1 14 1 10 1 -23 0 6 1 -4 1 11 1 -9 0 -2 
1 1 1 -4 1 32 1 -25 0 -6 1 14 1 -9 1 15 
0 17 1 -35 1 -1 3997 3626 100 MP stroke
1 -1 0 27 1 -26 1 27 1 -16 1 -1 0 1 1 -10 
1 -3 1 -1 0 4 1 -2 1 5 1 -7 1 10 0 25 
1 -21 1 9 1 0 0 -21 1 5 1 -3 1 -2 0 28 
1 -28 1 14 1 -11 1 -3 0 7 1 1 1 -8 1 0 
0 -2 1 9 1 14 1 -16 1 30 0 -37 1 29 1 -19 
1 -7 0 -2 1 -1 1 29 1 -23 0 -5 1 4 1 0 
1 -5 1 25 0 -14 1 -9 1 7 1 -6 0 -1 1 15 
1 -15 1 17 1 -4 0 -15 1 2 1 5 1 -4 0 3 
1 -6 1 9 1 32 0 -23 1 -15 1 16 1 -18 1 0 
0 55 1 -51 1 -3 1 3 0 5 1 23 1 -33 1 5 
1 2 0 27 1 6 1 -39 1 20 0 13 1 -18 1 20 
1 -13 1 5 0 69 1 -51 1 20 1 273 0 -210 1 -128 
1 78 1 -2 0 -10 3921 3562 100 MP stroke
1 -28 1 -23 1 30 1 -18 0 -25 1 8 1 50 1 -52 
0 40 1 -39 1 -5 1 20 1 -23 0 24 1 -23 1 9 
1 10 0 -19 1 5 1 -4 1 -4 0 21 1 -18 1 8 
1 -2 1 6 0 3 1 -9 1 16 1 -25 0 4 1 2 
1 5 1 1 1 -3 0 -9 1 6 1 28 1 -26 0 -4 
1 57 1 -58 1 -2 0 3 1 8 1 7 1 -5 1 -4 
0 -9 1 26 1 -26 1 -1 0 21 1 -20 1 8 1 -8 
1 5 0 -6 1 19 1 -5 1 -6 0 12 1 -17 1 8 
1 -10 1 2 1 16 1 -7 1 3 0 -8 1 17 1 -1 
1 -14 0 -1 1 23 1 -4 1 6 1 33 0 12 1 -47 
1 13 1 52 0 -94 1 62 1 -41 1 30 0 75 1 -124 
1 5 1 -1 1 17 0 -16 1 30 1 -16 1 -23 0 6 
1 -3 1 -2 1 -1 3843 3629 100 MP stroke
1 0 -1 0 2 9 1 10 1 -18 0 3 1 -4 1 0 
1 2 1 0 1 3 1 -3 1 37 0 -17 1 -6 1 -12 
1 9 0 -12 1 0 1 16 1 -12 1 -4 1 49 1 -41 
1 4 0 -4 1 16 1 -17 1 -4 0 5 1 -6 1 -1 
1 -1 1 42 0 -40 1 2 1 3 1 -1 0 8 1 2 
1 5 1 0 1 -18 0 12 1 -13 1 11 1 -9 0 -4 
1 10 1 38 1 -48 0 18 1 -11 1 14 1 -10 1 7 
0 31 1 -47 1 0 1 -2 0 12 1 2 1 2 1 8 
1 -4 0 -19 1 5 1 -2 1 5 0 -10 1 9 1 -6 
1 -1 0 5 1 -3 1 18 1 -20 1 9 0 -11 1 19 
1 29 1 -16 0 -25 1 0 1 -2 1 3 1 3 0 -8 
1 10 1 -1 1 1 0 -12 1 1 1 6 1 -6 0 11 
1 13 1 -5 1 -14 3765 3622 100 MP stroke
1 -6 0 1 1 -1 1 -1 1 6 0 3 1 5 1 -14 
1 0 1 1 0 15 1 -8 1 -1 1 -5 0 3 1 22 
1 -21 1 38 1 -41 0 9 1 -3 1 -9 1 8 0 4 
1 -9 1 22 1 -19 0 -5 1 3 1 19 1 -1 1 113 
0 -134 1 16 1 -9 1 -2 0 -2 1 -3 1 0 1 -1 
1 11 0 -6 1 15 1 -10 1 -8 0 3 1 10 1 0 
1 -15 0 15 1 -2 1 -3 1 39 1 -17 0 -16 1 -1 
1 51 1 -30 0 -32 1 16 1 -11 1 4 1 51 0 -28 
1 -36 1 24 1 -4 0 -1 1 134 1 -107 1 33 0 -56 
1 -13 1 -1 1 4 1 13 0 16 1 -38 1 11 1 -11 
0 3 1 56 1 -17 1 -34 1 20 0 -18 1 26 1 7 
1 -26 0 -7 1 13 1 -12 1 -1 0 16 1 -17 1 -4 
1 11 1 -19 0 16 3689 3612 100 MP stroke
1 -16 1 27 1 -18 0 -3 1 3 1 3 1 -3 1 33 
0 -32 1 -6 1 41 1 -33 0 73 1 -83 1 2 1 5 
0 -1 1 64 1 -69 1 0 1 5 0 3 1 5 1 -14 
1 10 0 -4 1 -9 1 38 1 -33 1 30 0 -34 1 7 
1 -2 1 -1 0 3 1 8 1 72 1 -85 0 14 1 -13 
1 2 1 -3 1 -2 0 3 1 3 1 -3 1 -2 0 21 
1 -2 1 21 1 -35 1 1 1 7 1 -13 1 12 0 -6 
1 -7 1 10 1 -9 0 1 1 -3 1 23 1 -23 1 29 
0 -27 1 26 1 -26 1 6 0 12 1 -1 1 -16 1 5 
1 77 0 -80 1 -3 1 23 1 -24 0 19 1 -19 1 2 
1 6 0 -5 1 16 1 -15 1 5 1 2 0 -4 1 -4 
1 -2 1 9 0 -11 1 15 1 -13 1 11 1 -3 0 -4 
1 4 1 -7 1 25 3611 3601 100 MP stroke
0 -16 1 7 1 -10 1 -3 0 -2 1 13 1 -7 1 -3 
1 3 0 -6 1 0 1 4 1 -1 0 14 1 -6 1 -14 
1 12 1 28 0 -30 1 -11 1 2 1 -2 0 13 1 20 
1 -23 1 5 1 -7 0 -8 1 9 1 -4 1 0 0 42 
1 -44 1 17 1 -19 0 10 1 0 1 -11 1 24 1 -8 
0 -6 1 -6 1 20 1 -5 0 -17 1 8 1 -8 1 4 
1 13 0 -9 1 0 1 6 1 -15 0 -1 1 14 1 -1 
1 26 0 -14 1 -16 1 11 1 1 1 6 0 -13 1 38 
1 -38 1 -6 0 29 1 -32 1 7 1 3 1 8 0 -19 
1 29 1 -33 1 8 0 16 1 -22 1 13 1 -3 0 -8 
1 6 1 3 1 -1 1 7 0 -19 1 4 1 19 1 -10 
0 -4 1 0 1 -5 1 1 1 -3 0 -2 1 9 1 -6 
1 16 0 -17 1 31 3535 3596 100 MP stroke
1 2 1 -28 0 3 1 31 1 -34 1 2 1 10 0 -14 
1 0 1 11 1 -14 1 -2 1 0 1 6 1 -2 0 19 
1 -13 1 -8 1 -1 0 9 1 9 1 24 1 -28 0 -6 
1 -4 1 -3 1 22 1 -23 0 4 1 -5 1 5 1 1 
0 9 1 4 1 -18 1 10 1 -2 0 -9 1 2 1 3 
1 1 0 -3 1 57 1 -45 1 -14 1 -1 1 11 1 -7 
1 26 0 -29 1 10 1 35 1 -22 0 -20 1 14 1 -11 
1 24 1 -20 0 39 1 -50 1 1 1 0 0 21 1 -16 
1 4 1 4 0 -11 1 -3 1 18 1 3 1 13 0 -20 
1 -4 1 13 1 -12 0 1 1 -9 1 6 1 27 1 -20 
0 -4 1 3 1 -13 1 1 0 -3 1 24 1 -16 1 -4 
0 14 1 -9 1 2 1 -8 1 -3 0 16 1 -15 1 1 
1 6 0 -1 1 3 3457 3619 100 MP stroke
1 0 1 13 1 -15 0 -8 1 3 1 0 1 7 0 -10 
1 35 1 -34 1 2 0 27 1 -25 1 9 1 -14 1 15 
0 -15 1 18 1 17 1 -27 0 -3 1 37 1 -40 1 10 
1 -5 0 -6 1 2 1 6 1 7 0 -1 1 -6 1 3 
1 -12 1 21 0 3 1 -15 1 -9 1 15 0 -12 1 23 
1 -20 1 -5 0 5 1 7 1 -13 1 2 1 11 0 -10 
1 10 1 0 1 -7 0 17 1 1 1 54 1 -73 1 20 
0 19 1 12 1 -42 1 1 0 -9 1 9 1 -8 1 38 
0 31 1 -18 1 -43 1 1 1 -7 0 -8 1 4 1 0 
1 27 0 -27 1 -1 1 -3 1 21 1 -22 0 18 1 2 
1 -17 1 -2 0 6 1 12 1 -7 1 -3 0 -8 1 8 
1 -3 1 76 1 -63 0 -18 1 2 1 5 1 1 0 3 
1 27 1 -33 1 0 3380 3623 100 MP stroke
1 1 0 8 1 -7 1 -7 1 6 0 17 1 -24 1 5 
1 3 0 -5 1 0 1 24 1 -26 1 12 0 -8 1 0 
1 6 1 -2 0 -8 1 16 1 -17 1 1 1 0 0 30 
1 -11 1 43 1 -45 0 -18 1 0 1 19 1 12 0 -13 
1 -12 1 7 1 36 1 -45 0 -4 1 12 1 7 1 -17 
0 2 1 -4 1 6 1 2 1 -2 0 11 1 -7 1 2 
1 -11 0 3 1 75 1 -67 1 0 0 18 1 11 1 -24 
1 -3 1 -13 0 5 1 19 1 -20 1 33 0 -27 1 6 
1 -16 1 14 1 -9 0 6 1 -2 1 2 1 -6 0 7 
1 -10 1 6 1 -9 0 20 1 -6 1 -11 1 0 1 13 
0 -14 1 1 1 5 1 -4 0 10 1 -13 1 8 1 -4 
1 -2 0 7 1 -4 1 -4 1 8 0 -10 1 9 1 -1 
1 4 0 -8 1 19 3304 3606 100 MP stroke
1 -19 1 -1 1 6 0 4 1 8 1 -12 1 -9 1 10 
1 20 1 -25 1 2 0 16 1 -22 1 10 1 -4 0 4 
1 8 1 -14 1 -3 0 29 1 -26 1 29 1 -24 1 2 
0 1 1 -5 1 -5 1 -3 0 53 1 -48 1 -3 1 4 
1 8 0 6 1 -9 1 5 1 -14 0 13 1 -8 1 25 
1 -5 0 -26 1 22 1 -2 1 8 1 -25 0 15 1 -16 
1 -3 1 0 0 32 1 -22 1 6 1 34 1 -24 0 -22 
1 7 1 8 1 9 0 42 1 -12 1 18 1 -76 1 2 
0 44 1 -41 1 11 1 19 0 -14 1 4 1 -2 1 -18 
0 18 1 24 1 -31 1 -6 1 -4 0 34 1 -39 1 4 
1 9 0 -7 1 111 1 -101 1 -11 1 -5 0 31 1 24 
1 -42 1 -10 0 -3 1 18 1 -10 1 15 0 -21 1 22 
1 -19 1 -5 1 9 3226 3619 100 MP stroke
0 5 1 -11 1 11 1 10 0 15 1 -27 1 5 1 38 
1 -40 0 -15 1 23 1 -16 1 2 0 -10 1 1 1 -1 
1 24 0 -22 1 29 1 -26 1 24 1 -12 0 -15 1 18 
1 -10 1 -4 0 -3 1 -3 1 16 1 7 1 -19 0 29 
1 -9 1 -17 1 3 0 -5 1 -1 1 9 1 -12 0 17 
1 -18 1 4 1 20 1 -20 0 10 1 0 1 40 1 -29 
0 -25 1 5 1 78 1 -62 1 -16 0 35 1 -15 1 -20 
1 -3 0 12 1 -10 1 2 1 26 0 -26 1 -2 1 -3 
1 7 1 30 0 -21 1 -15 1 8 1 8 0 -9 1 -6 
1 8 1 -11 1 23 0 -10 1 -13 1 2 1 10 0 -12 
1 4 1 -2 1 35 0 -25 1 7 1 -19 1 2 1 5 
0 5 1 10 1 -6 1 -12 0 13 1 -15 1 20 1 -15 
1 45 0 -45 1 14 3150 3608 100 MP stroke
1 -14 1 35 0 -37 1 16 1 -16 1 -3 0 9 1 3 
1 22 1 -11 1 -16 0 -4 1 2 1 8 1 0 0 -8 
1 6 1 -12 1 77 1 -78 0 3 1 3 1 1 1 9 
0 -10 1 -1 1 20 1 -25 0 7 1 14 1 -16 1 5 
1 1 0 41 1 -50 1 7 1 -7 1 10 1 -7 1 11 
1 -6 0 1 1 13 1 22 1 -38 0 -6 1 78 1 -74 
1 -1 1 6 1 4 1 28 1 -22 0 -14 1 3 1 -5 
1 9 0 -4 1 19 1 -24 1 15 1 -20 0 10 1 4 
1 3 1 -2 0 9 1 -21 1 35 1 -32 1 -5 0 5 
1 4 1 -7 1 0 0 4 1 -4 1 9 1 20 0 -17 
1 -7 1 -5 1 3 1 -5 0 17 1 19 1 -34 1 20 
0 -16 1 44 1 -42 1 18 1 -22 0 8 1 -13 1 0 
1 31 0 -17 1 37 3072 3578 100 MP stroke
1 -30 1 -16 0 37 1 -35 1 5 1 -6 1 37 0 -39 
1 -4 1 62 1 -62 0 4 1 6 1 0 1 -6 1 -1 
0 16 1 -17 1 36 1 16 0 -44 1 4 1 -4 1 -1 
0 7 1 4 1 -8 1 -1 1 3 0 16 1 0 1 -22 
1 -8 0 7 1 3 1 2 1 -5 1 -2 0 1 1 -1 
1 -3 1 9 0 10 1 2 1 -23 1 17 0 -14 1 46 
1 -43 1 7 1 -9 0 14 1 -10 1 14 1 5 0 -24 
1 55 1 -3 1 -52 1 13 0 -7 1 53 1 -42 1 24 
0 -26 1 23 1 -24 1 -12 0 31 1 -28 1 23 1 -30 
1 12 0 -11 1 -1 1 24 1 -4 0 -1 1 -6 1 -6 
1 -7 1 15 0 2 1 -16 1 35 1 12 0 -38 1 -9 
1 -2 1 4 0 12 1 2 1 2 1 -19 1 8 0 -8 
1 13 1 -8 1 -2 2995 3625 100 MP stroke
0 14 1 -5 1 -13 1 4 1 5 0 -2 1 4 1 0 
1 2 0 -3 1 54 1 -62 1 1 0 18 1 32 1 -53 
1 0 1 45 0 -39 1 -3 1 77 1 -76 0 3 1 35 
1 -22 1 -1 1 -18 0 13 1 -3 1 6 1 -17 0 5 
1 5 1 2 1 -10 0 4 1 28 1 -31 1 18 1 -9 
0 -2 1 12 1 -8 1 -8 0 2 1 1 1 -7 1 5 
1 -6 0 1 1 1 1 14 1 9 0 -23 1 6 1 -3 
1 1 1 7 1 4 1 -5 1 -10 0 37 1 -35 1 9 
1 -12 0 18 1 -17 1 96 1 -96 1 30 0 -33 1 17 
1 -7 1 -7 0 -2 1 17 1 -16 1 14 0 -15 1 15 
1 -14 1 33 1 -33 0 1 1 16 1 -15 1 26 0 -29 
1 4 1 5 1 3 1 -5 0 31 1 -32 1 26 1 -27 
0 48 1 -16 1 -38 2918 3629 100 MP stroke
1 3 1 33 0 -25 1 -11 1 44 1 -32 0 -3 1 -9 
1 3 1 2 0 19 1 -14 1 -2 1 6 1 25 0 -5 
1 -31 1 -3 1 30 0 -18 1 -2 1 7 1 5 1 -15 
0 -2 1 6 1 29 1 -34 0 22 1 -26 1 -2 1 34 
0 -23 1 16 1 -21 1 11 1 -12 1 18 1 22 1 -22 
0 -17 1 23 1 10 1 -22 1 11 0 -28 1 28 1 -24 
1 -4 0 41 1 -23 1 -17 1 7 0 -5 1 9 1 -11 
1 45 1 -37 0 8 1 -14 1 20 1 -2 0 13 1 5 
1 -11 1 -16 1 111 0 -109 1 9 1 15 1 -27 0 29 
1 -33 1 5 1 48 0 -22 1 4 1 -11 1 -24 1 8 
0 16 1 -22 1 27 1 -31 0 31 1 -32 1 -3 1 39 
1 -37 0 6 1 21 1 -9 1 41 0 -38 1 -19 1 17 
1 2 0 -11 1 -2 2841 3618 100 MP stroke
1 -7 1 25 1 7 0 -30 1 33 1 -39 1 31 0 -28 
1 24 1 -21 1 16 1 -20 0 3 1 0 1 -4 1 -1 
0 47 1 -44 1 6 1 -3 0 1 1 1 1 24 1 -26 
1 18 0 -16 1 12 1 -17 1 7 0 22 1 72 1 -103 
1 7 1 0 0 2 1 -4 1 -4 1 5 0 -7 1 26 
1 9 1 -16 0 -6 1 -11 1 26 1 -23 1 17 0 4 
1 -8 1 -10 1 2 0 -9 1 3 1 13 1 3 1 1 
0 -17 1 13 1 30 1 -11 0 -35 1 -1 1 0 1 13 
0 -4 1 4 1 -2 1 19 1 -19 0 -8 1 6 1 -8 
1 20 0 -19 1 17 1 -10 1 9 1 -5 0 -10 1 12 
1 -2 1 19 0 -32 1 72 1 -56 1 -10 0 13 1 4 
1 5 1 18 1 -1 0 -34 1 7 1 20 1 -13 0 -25 
1 7 1 26 1 -17 2764 3613 100 MP stroke
1 75 0 -77 1 20 1 -32 1 2 0 40 1 -27 1 -17 
1 5 1 22 0 -13 1 0 1 -7 1 18 0 2 1 -19 
1 -6 1 55 0 -24 1 -32 1 5 1 -3 1 16 0 -10 
1 4 1 -8 1 28 0 -32 1 37 1 53 1 -89 1 45 
0 34 1 -70 1 35 1 -40 0 -5 1 20 1 -21 1 0 
0 17 1 -10 1 4 1 -1 1 -4 0 7 1 1 1 -13 
1 3 0 10 1 -9 1 20 1 -19 1 0 0 12 1 8 
1 -11 1 34 0 -13 1 -32 1 20 1 -22 0 -1 1 13 
1 -13 1 21 1 -14 0 13 1 9 1 -27 1 1 0 38 
1 -30 1 -7 1 6 1 63 0 -73 1 11 1 -5 1 7 
0 13 1 7 1 -15 1 -14 0 3 1 -6 1 45 1 -40 
1 -5 0 67 1 -59 1 -6 1 17 0 -12 1 21 1 -28 
1 34 1 4 0 -39 2688 3628 100 MP stroke
1 7 1 1 1 48 0 -36 1 -20 1 14 1 -12 0 23 
1 -23 1 43 1 -42 1 15 0 -13 1 -5 1 2 1 -1 
0 5 1 25 1 3 1 -26 1 -8 0 12 1 23 1 -25 
1 -7 0 19 1 -23 1 80 1 -79 0 37 1 19 1 -49 
1 -1 1 3 0 23 1 -26 1 -4 1 -1 0 4 1 4 
1 -10 1 17 1 -13 0 -3 1 7 1 8 1 -16 0 74 
1 -71 1 59 1 -58 0 1 1 26 1 -6 1 -17 1 -5 
0 2 1 22 1 -27 1 6 0 17 1 -10 1 -11 1 50 
1 -45 0 30 1 -30 1 49 1 -52 0 25 1 32 1 -42 
1 -15 0 -3 1 22 1 14 1 23 1 -40 0 -5 1 3 
1 3 1 -17 0 22 1 -4 1 -13 1 5 1 -4 0 -4 
1 -1 1 8 1 27 0 -38 1 18 1 -1 1 7 0 5 
1 -7 1 4 1 1 2611 3600 100 MP stroke
1 6 0 -30 1 28 1 1 1 -16 0 -8 1 18 1 34 
1 -26 1 30 0 -29 1 -37 1 20 1 -16 0 -1 1 13 
1 -16 1 30 1 -12 0 -5 1 -7 1 3 1 -1 0 22 
1 -1 1 -27 1 28 0 -30 1 4 1 46 1 -40 1 28 
0 -36 1 10 1 12 1 -22 0 7 1 50 1 -37 1 -10 
1 43 0 65 1 -119 1 19 1 -14 0 -1 1 -1 1 13 
1 -4 0 -3 1 -3 1 13 1 36 1 -51 0 2 1 5 
1 -2 1 -3 0 26 1 -12 1 2 1 -14 1 -8 0 9 
1 7 1 -3 1 -14 0 17 1 1 1 23 1 -39 0 31 
1 -24 1 2 1 7 1 -3 0 -7 1 1 1 -6 1 47 
0 -46 1 12 1 -11 1 5 1 23 0 16 1 -45 1 16 
1 1 0 -10 1 -10 1 12 1 -10 0 12 1 9 1 3 
1 3 1 -28 0 74 2535 3553 100 MP stroke
1 -41 1 -14 1 -21 0 8 1 9 1 -1 1 15 1 -17 
0 -14 1 7 1 2 1 14 0 -21 1 1 1 0 1 13 
0 -14 1 12 1 7 1 10 1 -20 0 -2 1 -4 1 -5 
1 23 0 -21 1 68 1 32 1 -92 1 4 0 -6 1 -5 
1 15 1 -5 0 -12 1 1 1 12 1 -10 0 7 1 -8 
1 13 1 10 1 -11 0 -13 1 34 1 -26 1 -7 0 -3 
1 1 1 2 1 4 1 -4 0 2 1 1 1 54 1 -43 
0 133 1 -15 1 -113 1 47 0 -48 1 -15 1 3 1 22 
1 30 0 -33 1 -4 1 -11 1 -8 0 19 1 -2 1 -17 
1 19 1 -12 0 28 1 -26 1 -10 1 13 0 -9 1 -1 
1 -1 1 20 0 -6 1 1 1 -13 1 26 1 -26 0 -6 
1 1 1 1 1 16 0 -2 1 7 1 -21 1 33 1 -6 
0 46 1 -66 1 2 2458 3616 100 MP stroke
1 14 0 -9 1 -13 1 10 1 -2 0 -7 1 -2 1 60 
1 -56 1 132 0 -131 1 0 1 8 1 -5 0 7 1 -19 
1 9 1 -3 1 12 0 30 1 -20 1 -7 1 1 0 -15 
1 21 1 23 1 -35 0 -14 1 2 1 2 1 -5 1 56 
0 -52 1 -3 1 31 1 -22 0 -11 1 30 1 -26 1 2 
1 23 0 -26 1 4 1 15 1 -11 0 7 1 -8 1 30 
1 8 1 -12 0 -24 1 11 1 -15 1 12 0 7 1 -27 
1 23 1 -14 0 42 1 -41 1 18 1 -27 1 -1 0 7 
1 29 1 -22 1 -14 0 28 1 -22 1 2 1 49 1 -17 
0 -26 1 3 1 -2 1 -5 0 -1 1 -9 1 19 1 9 
0 -23 1 166 1 -159 1 18 1 -19 0 8 1 -19 1 5 
1 53 0 -54 1 16 1 -13 1 4 1 8 0 29 1 -9 
1 -23 1 27 0 -18 2382 3604 100 MP stroke
1 22 1 -38 1 15 0 34 1 -55 1 40 1 -30 1 2 
0 -9 1 13 1 4 1 21 0 -36 1 24 1 -9 1 -7 
1 70 0 -71 1 -3 1 54 1 -40 0 -16 1 -5 1 5 
1 4 0 1 1 13 1 39 1 -39 1 6 0 -31 1 2 
1 10 1 68 0 -79 1 109 1 -96 1 -15 1 25 0 -25 
1 82 1 -78 1 64 0 -68 1 66 1 7 1 -70 0 63 
1 -65 1 19 1 -19 1 2 0 -5 1 26 1 -23 1 0 
0 39 1 -25 1 14 1 -29 1 12 0 16 1 -11 1 -6 
1 41 0 -18 1 -3 1 -10 1 -3 0 4 1 8 1 -12 
1 -8 1 30 0 -38 1 37 1 -30 1 -4 0 4 1 14 
1 -21 1 -1 1 30 0 29 1 -46 1 14 1 5 0 -29 
1 3 1 -8 1 14 0 -14 1 17 1 75 1 -46 1 -21 
0 -20 1 3 1 -1 2305 3621 100 MP stroke
1 9 0 35 1 -48 1 14 1 -11 1 9 0 -10 1 -6 
1 20 1 8 0 -21 1 54 1 28 1 -88 0 34 1 -27 
1 130 1 -102 1 -33 0 4 1 9 1 95 1 -91 0 -15 
1 -2 1 0 1 11 1 -13 0 41 1 4 1 -30 1 0 
0 8 1 -7 1 -13 1 103 0 -92 1 10 1 32 1 -8 
1 -39 0 -7 1 4 1 -6 1 22 0 -11 1 13 1 -13 
1 51 1 -56 0 29 1 7 1 -19 1 20 0 -12 1 -24 
1 4 1 -11 1 4 0 6 1 -8 1 1 1 29 0 13 
1 -18 1 -10 1 28 0 124 1 -159 1 9 1 -14 1 17 
0 -9 1 3 1 -12 1 -1 0 -1 1 14 1 4 1 -13 
1 -5 0 20 1 -18 1 -5 1 59 0 -58 1 25 1 -3 
1 25 0 -41 1 42 1 -33 1 4 1 42 0 -16 1 -25 
1 -21 1 26 0 -7 2229 3610 100 MP stroke
1 22 1 -34 1 18 1 -24 0 34 1 -21 1 27 1 4 
0 -31 1 35 1 -40 1 9 0 -8 1 -5 1 -1 1 66 
1 -49 0 -1 1 -19 1 105 1 -78 0 -11 1 -13 1 9 
1 -13 1 54 0 -48 1 11 1 2 1 55 0 -69 1 11 
1 113 1 -84 0 11 1 -48 1 -7 1 34 1 -25 0 -1 
1 -2 1 2 1 0 0 95 1 -92 1 5 1 34 1 -34 
0 23 1 -35 1 -3 1 19 0 -15 1 37 1 -36 1 12 
0 67 1 -38 1 -34 1 7 1 15 0 -29 1 -3 1 8 
1 -2 0 10 1 -19 1 8 1 48 1 -14 0 -39 1 57 
1 -59 1 1 0 1 1 29 1 -30 1 30 0 12 1 -32 
1 -12 1 28 1 -3 0 -15 1 8 1 -18 1 16 0 -5 
1 -4 1 -2 1 -1 1 5 0 62 1 -72 1 4 1 -4 
0 9 1 124 1 -121 2152 3617 100 MP stroke
1 19 0 -10 1 43 1 -19 1 4 1 -32 0 5 1 -2 
1 23 1 -28 0 -1 1 -4 1 16 1 -3 1 -21 0 8 
1 -3 1 21 1 12 0 -38 1 3 1 7 1 66 0 -75 
1 12 1 35 1 -38 1 -6 0 11 1 -10 1 17 1 -3 
0 -6 1 2 1 -9 1 22 1 -19 0 38 1 -19 1 -30 
1 38 0 -32 1 3 1 6 1 -7 0 -4 1 2 1 44 
1 -49 1 16 0 79 1 -57 1 -27 1 27 0 -3 1 -20 
1 2 1 -9 1 49 0 -58 1 65 1 -64 1 11 0 6 
1 -13 1 16 1 39 1 -54 0 15 1 52 1 -34 1 5 
0 -42 1 7 1 -1 1 8 0 114 1 -104 1 -25 1 26 
1 -15 0 31 1 -43 1 7 1 8 0 -13 1 30 1 -28 
1 11 1 3 0 22 1 -33 1 -2 1 49 0 -39 1 -4 
1 12 1 -17 0 -1 2076 3624 100 MP stroke
1 81 1 -51 1 29 1 -62 0 1 1 36 1 -38 1 47 
0 -31 1 -7 1 -8 1 32 1 -20 0 -3 1 1 1 -7 
1 8 0 -8 1 19 1 -11 1 -13 0 56 1 -54 1 3 
1 11 1 13 0 -1 1 -16 1 -11 1 54 0 -55 1 23 
1 10 1 -25 1 17 0 53 1 -66 1 15 1 18 0 -35 
1 -1 1 41 1 -48 0 38 1 3 1 -1 1 38 1 -78 
0 24 1 -20 1 0 1 -4 0 22 1 23 1 -43 1 22 
1 -10 0 130 1 -117 1 -22 1 -2 1 10 1 24 1 -33 
0 19 1 15 1 24 1 -9 1 1 0 -17 1 -16 1 -3 
1 -9 0 -2 1 22 1 -22 1 -6 1 25 0 34 1 28 
1 -67 1 57 0 -55 1 7 1 -18 1 -14 0 12 1 -12 
1 54 1 -12 1 -29 0 -2 1 -5 1 -6 1 113 0 -110 
1 9 1 -8 1 15 1998 3610 100 MP stroke
1 -8 0 35 1 43 1 -62 1 -2 0 -10 1 -2 1 11 
1 -3 0 -10 1 50 1 -56 1 28 1 22 0 5 1 -52 
1 11 1 0 0 10 1 -16 1 -12 1 0 1 90 0 -78 
1 6 1 -18 1 6 0 10 1 5 1 7 1 19 0 -1 
1 7 1 -41 1 34 1 -27 0 -16 1 15 1 -7 1 -2 
0 60 1 -61 1 51 1 -57 1 38 0 -23 1 -12 1 21 
1 -10 0 -4 1 24 1 -16 1 -2 1 -8 1 4 1 -14 
1 18 0 15 1 -34 1 30 1 -23 0 163 1 -128 1 -34 
1 -7 1 34 0 -30 1 11 1 -5 1 -10 0 67 1 -60 
1 29 1 31 0 -10 1 -54 1 5 1 -9 1 25 0 -23 
1 -2 1 19 1 40 0 -54 1 6 1 55 1 -65 1 34 
0 25 1 1 1 -13 1 -29 0 52 1 -66 1 3 1 5 
1 -9 0 57 1 -61 1921 3629 100 MP stroke
1 32 1 -17 0 101 1 -80 1 16 1 -4 0 -25 1 -19 
1 -1 1 14 1 -4 0 -13 1 7 1 14 1 -7 0 39 
1 -17 1 -20 1 -15 1 53 0 -50 1 19 1 6 1 10 
0 -24 1 -10 1 -4 1 28 0 -10 1 7 1 24 1 -1 
1 21 0 -66 1 12 1 -14 1 25 0 63 1 -63 1 -16 
1 0 1 17 0 -28 1 22 1 23 1 -15 1 35 1 -61 
1 25 0 -8 1 -8 1 15 1 92 1 -116 0 43 1 -39 
1 28 1 9 0 -24 1 -5 1 1 1 4 1 -20 0 31 
1 -26 1 -4 1 18 0 47 1 2 1 -51 1 -12 0 -6 
1 57 1 -33 1 75 1 -99 0 30 1 -30 1 12 1 25 
0 3 1 70 1 -78 1 1 1 -32 0 1 1 3 1 14 
1 -2 0 -1 1 19 1 25 1 -48 0 54 1 -61 1 13 
1 0 1 -17 0 3 1844 3625 100 MP stroke
1 57 1 -35 1 -10 0 -1 1 30 1 -14 1 -30 1 93 
0 -89 1 74 1 -62 1 -16 0 4 1 41 1 18 1 28 
0 -68 1 -17 1 16 1 -16 1 28 0 28 1 -44 1 -2 
1 196 0 -207 1 17 1 -21 1 19 1 -11 0 8 1 12 
1 -19 1 -11 0 9 1 -1 1 12 1 -12 0 85 1 -74 
1 -11 1 -7 1 -1 0 9 1 31 1 -32 1 112 0 -101 
1 -3 1 53 1 -63 1 44 0 -38 1 -12 1 73 1 -59 
0 -5 1 6 1 5 1 15 0 2 1 -30 1 -6 1 36 
1 -13 0 71 1 -83 1 92 1 -46 0 -29 1 103 1 -126 
1 95 1 71 0 -108 1 -56 1 40 1 -9 0 6 1 -8 
1 54 1 -76 0 58 1 -55 1 -17 1 59 1 -18 0 21 
1 -36 1 26 1 -47 0 24 1 -18 1 125 1 -84 1 -2 
0 -49 1 5 1 33 1767 3589 100 MP stroke
1 -20 0 -6 1 -12 1 32 1 -22 1 14 0 -16 1 0 
1 30 1 46 0 17 1 -64 1 -18 1 -17 0 103 1 -81 
1 8 1 -18 1 7 0 97 1 -95 1 -21 1 1 0 100 
1 -98 1 69 1 -45 1 -30 0 1 1 26 1 3 1 6 
0 -25 1 -3 1 51 1 -41 0 18 1 28 1 -39 1 -8 
1 23 1 -36 1 15 1 -18 0 38 1 -32 1 10 1 14 
1 19 0 -45 1 18 1 33 1 -57 0 7 1 -6 1 20 
1 -12 0 79 1 -64 1 32 1 -53 1 1 0 5 1 16 
1 74 1 -98 0 29 1 -19 1 -4 1 -7 1 0 0 119 
1 3 1 -92 1 92 0 -93 1 -5 1 -21 1 15 0 -8 
1 36 1 -9 1 -10 1 -24 0 26 1 89 1 -108 1 70 
0 -73 1 -5 1 60 1 -49 1 -9 0 49 1 -35 1 -2 
1 20 0 -25 1 48 1690 3570 100 MP stroke
1 81 1 -81 0 -51 1 113 1 -6 1 -107 1 20 0 -15 
1 30 1 -39 1 14 0 16 1 -21 1 -4 1 10 1 44 
0 -56 1 5 1 -11 1 38 0 -13 1 23 1 -6 1 -41 
0 23 1 -11 1 20 1 9 1 -40 0 3 1 12 1 -1 
1 36 0 -41 1 31 1 68 1 -104 1 -1 0 23 1 117 
1 -108 1 111 0 -86 1 4 1 -64 1 33 0 5 1 -20 
1 63 1 -42 1 -21 0 133 1 -148 1 88 1 -91 0 8 
1 5 1 7 1 9 1 68 0 -83 1 3 1 48 1 -39 
0 -29 1 17 1 7 1 25 0 -41 1 5 1 -6 1 6 
1 13 0 89 1 -97 1 0 1 14 0 -18 1 -12 1 48 
1 38 1 -81 0 3 1 -2 1 69 1 -57 0 6 1 26 
1 34 1 -13 0 -61 1 2 1 34 1 -7 1 -18 0 39 
1 -13 1 -41 1 43 1613 3578 100 MP stroke
0 -17 1 -27 1 0 1 16 1 25 0 -23 1 25 1 -14 
1 -20 0 29 1 4 1 9 1 -53 0 6 1 79 1 102 
1 -178 1 -7 0 13 1 6 1 63 1 -46 0 -38 1 55 
1 -56 1 -3 1 24 0 76 1 -42 1 113 1 -159 0 16 
1 5 1 19 1 -22 1 33 0 -25 1 4 1 47 1 55 
0 -87 1 52 1 -94 1 -3 0 67 1 -16 1 1 1 -2 
1 -41 0 -10 1 6 1 -10 1 11 0 -16 1 27 1 -11 
1 0 1 -7 0 -12 1 38 1 -16 1 50 0 -71 1 16 
1 -17 1 113 0 -110 1 4 1 59 1 -39 1 1 0 -21 
1 -3 1 42 1 20 0 -34 1 7 1 48 1 -85 1 63 
0 -64 1 135 1 -89 1 -45 0 9 1 12 1 -5 1 -13 
0 14 1 18 1 -6 1 -17 1 4 0 100 1 -99 1 27 
1 -38 0 54 1 -58 1537 3625 100 MP stroke
1 -1 1 16 1 74 0 -73 1 -18 1 111 1 -26 0 -44 
1 58 1 -57 1 -15 0 27 1 -9 1 -8 1 -30 1 61 
0 -55 1 45 1 -38 1 43 0 -8 1 15 1 -62 1 168 
1 -130 0 -31 1 6 1 6 1 -25 0 156 1 -140 1 13 
1 -11 0 38 1 -41 1 89 1 -39 1 -36 0 14 1 -7 
1 -38 1 64 0 -32 1 -11 1 33 1 2 1 -2 0 5 
1 -33 1 -22 1 72 0 -9 1 -24 1 18 1 -11 0 14 
1 -9 1 -36 1 -5 1 30 0 -40 1 58 1 56 1 -46 
0 -47 1 74 1 -52 1 160 1 -151 0 -1 1 -25 1 -5 
1 -22 0 15 1 51 1 -55 1 -16 0 14 1 74 1 1 
1 -23 1 -14 0 99 1 -118 1 -23 1 1 0 27 1 98 
1 -135 1 58 1 -18 0 -19 1 -16 1 -4 1 69 0 -51 
1 140 1 -126 1 5 1460 3590 100 MP stroke
0 16 1 -26 1 26 1 -50 1 9 0 -9 1 0 1 124 
1 -85 0 5 1 -15 1 -11 1 -23 1 42 0 -40 1 -1 
1 85 1 56 0 -110 1 -2 1 127 1 -149 0 113 1 -98 
1 -23 1 156 1 -147 0 49 1 -47 1 -8 1 38 1 34 
1 27 1 -94 1 11 0 45 1 -35 1 21 1 -35 0 31 
1 -39 1 -5 1 38 1 -38 0 35 1 -36 1 19 1 -12 
0 170 1 -11 1 -105 1 60 0 -80 1 24 1 162 1 -228 
1 1 0 9 1 23 1 -26 1 54 0 -47 1 45 1 41 
1 -81 1 1 0 29 1 18 1 -57 1 32 0 37 1 -61 
1 3 1 187 0 -148 1 -52 1 55 1 34 1 -25 0 -58 
1 -6 1 15 1 146 0 -43 1 -106 1 69 1 -60 1 16 
0 35 1 -41 1 -6 1 67 0 -90 1 50 1 -43 1 16 
0 -32 1 107 1 -9 1383 3530 100 MP stroke
1 -89 1 45 0 -28 1 41 1 -55 1 34 0 -6 1 -29 
1 105 1 -16 1 55 0 -90 1 -66 1 39 1 -29 0 21 
1 115 1 -139 1 8 0 138 1 -144 1 103 1 -34 1 -40 
0 -37 1 3 1 35 1 -10 0 16 1 110 1 -141 1 58 
1 123 0 -144 1 -32 1 57 1 -40 0 101 1 30 1 -112 
1 -34 0 4 1 -18 1 -6 1 145 1 -81 0 -52 1 7 
1 44 1 104 0 45 1 -185 1 16 1 -29 1 -9 0 -1 
1 6 1 121 1 -117 0 62 1 -29 1 7 1 153 0 -169 
1 -2 1 80 1 15 1 -131 0 33 1 -29 1 19 1 -5 
0 64 1 24 1 52 1 -63 1 -45 0 -43 1 90 1 -53 
1 0 0 -35 1 63 1 118 1 -115 0 -72 1 86 1 -67 
1 -19 1 4 0 95 1 -22 1 134 1 -192 0 9 1 89 
1 -120 1 89 1 -85 1306 3624 100 MP stroke
0 54 1 -25 1 106 1 -42 0 -65 1 60 1 -58 1 -15 
0 -10 1 42 1 -3 1 -18 1 216 0 -155 1 -73 1 9 
1 23 0 -6 1 34 1 -62 1 -3 1 -13 0 134 1 -102 
1 227 1 -207 0 35 1 -62 1 17 1 10 0 -14 1 -30 
1 111 1 -114 1 35 0 7 1 51 1 41 1 45 0 -181 
1 4 1 -8 1 42 1 -12 0 233 1 -248 1 170 1 -183 
0 66 1 -38 1 17 1 55 1 18 0 -97 1 -5 1 84 
1 -99 0 43 1 56 1 -53 1 -44 0 33 1 74 1 -106 
1 13 1 323 0 -319 1 42 1 20 1 -68 0 62 1 -61 
1 112 1 -57 1 25 0 -55 1 96 1 -13 1 -42 0 6 
1 -87 1 5 1 7 0 5 1 11 1 80 1 -13 1 -72 
0 -25 1 7 1 18 1 -6 0 25 1 76 1 -82 1 -8 
1 -4 0 76 1 -64 1230 3590 100 MP stroke
1 5 1 196 0 -228 1 15 1 -25 1 51 0 83 1 -99 
1 -23 1 9 1 -9 0 134 1 21 1 15 1 -147 0 1 
1 -6 1 -30 1 9 1 -10 0 125 1 -87 1 -27 1 155 
0 -126 1 -32 1 -6 1 82 0 -33 1 -18 1 -3 1 -19 
1 11 0 69 1 46 1 49 1 -181 0 24 1 -29 1 53 
1 14 1 -24 0 -42 1 45 1 -8 1 122 0 -14 1 -46 
1 -87 1 122 0 -80 1 24 1 -66 1 -10 1 21 0 189 
1 -175 1 160 1 -129 0 28 1 -20 1 -73 1 73 1 -18 
0 50 1 217 1 -297 1 128 0 -126 1 63 1 -2 1 -93 
0 97 1 -27 1 94 1 -159 1 44 0 28 1 -74 1 48 
1 -51 0 93 1 -42 1 10 1 -55 1 28 0 -31 1 37 
1 -11 1 46 0 -36 1 20 1 -35 1 27 0 -23 1 20 
1 -42 1 34 1 -15 1153 3604 100 MP stroke
0 -16 1 35 1 -28 1 -10 0 10 1 3 1 248 1 -206 
1 66 0 -88 1 -29 1 37 1 314 0 -284 1 -48 1 100 
1 -79 0 -33 1 -1 1 17 1 98 1 -119 0 40 1 -37 
1 -7 1 45 0 67 1 -96 1 23 1 89 1 15 0 -111 
1 -17 1 14 1 6 0 55 1 -89 1 1 1 18 0 21 
1 158 1 -142 1 -63 1 52 0 17 1 -32 1 28 1 -53 
0 60 1 70 1 -68 1 32 1 -99 0 -7 1 103 1 -50 
1 -19 0 -5 1 -2 1 153 1 -159 0 82 1 -82 1 -1 
1 291 1 74 0 -339 1 -8 1 -35 1 125 0 -49 1 3 
1 -65 1 1 1 54 0 -46 1 45 1 -70 1 126 0 -77 
1 -23 1 138 1 -123 1 113 0 -130 1 -7 1 -6 1 47 
0 65 1 -126 1 100 1 -40 0 -40 1 48 1 -48 1 41 
1 43 0 10 1 -6 1077 3521 100 MP stroke
1 -74 1 -16 0 -8 1 73 1 -30 1 191 1 103 0 -304 
1 -4 1 -25 1 31 0 -39 1 27 1 -29 1 7 0 -2 
1 63 1 -70 1 114 1 -70 0 19 1 -36 1 -27 1 -1 
0 80 1 10 1 -32 1 40 1 135 0 -67 1 -159 1 40 
1 -2 0 37 1 -80 1 6 1 14 0 66 1 190 1 -120 
1 -38 1 7 0 -97 1 -12 1 108 1 -119 0 250 1 -134 
1 30 1 -133 1 237 0 -256 1 144 1 -145 1 0 0 2 
1 0 1 77 1 58 0 -5 1 -94 1 5 1 7 1 39 
0 65 1 -111 1 8 1 41 0 -20 1 -25 1 -37 1 -7 
1 49 0 -50 1 154 1 -60 1 -66 0 154 1 -148 1 23 
1 -42 0 -2 1 5 1 224 1 -33 1 -198 0 -13 1 94 
1 -3 1 82 0 -173 1 23 1 176 1 -35 1 -21 0 -39 
1 30 1 -74 1 -55 1000 3623 100 MP stroke
0 41 1 -15 1 -32 1 18 0 75 1 87 1 -165 1 61 
1 -68 0 82 1 -26 1 -4 1 -3 0 -36 1 29 1 -8 
1 -39 1 76 0 -41 1 52 1 -88 1 33 0 20 1 -52 
1 95 1 -52 0 -24 1 97 1 -74 1 131 1 -158 0 8 
1 61 1 -5 1 209 0 -227 1 65 1 -120 1 353 1 -346 
0 214 1 -200 1 32 1 119 0 189 1 -291 1 -63 1 0 
0 33 1 31 1 99 1 0 1 -106 0 -48 1 6 1 -29 
1 51 0 -31 1 122 1 -66 1 162 1 -233 0 6 1 16 
1 -20 1 73 0 -2 1 -16 1 -49 1 -2 0 29 1 8 
1 25 1 -67 1 173 0 -99 1 29 1 -93 1 59 0 -35 
1 -22 1 110 1 -31 1 -43 0 9 1 48 1 -84 1 -23 
0 35 1 -24 1 2 1 -19 1 16 0 29 1 50 1 -41 
1 -7 0 79 1 -102 924 3605 100 MP stroke
1 50 1 20 0 -64 1 -25 1 -3 1 18 1 25 0 -14 
1 68 1 0 1 -94 0 85 1 -60 1 -29 1 16 1 494 
0 -424 1 29 1 -88 1 53 0 -5 1 -41 1 25 1 15 
0 73 1 -63 1 -57 1 161 1 -172 0 170 1 -96 1 5 
1 1 0 -92 1 60 1 -62 1 56 1 -40 0 179 1 -184 
1 -4 1 31 0 -8 1 -15 1 52 1 -20 0 64 1 -10 
1 -101 1 43 1 280 0 -262 1 8 1 -12 1 -28 0 27 
1 -52 1 12 1 13 1 -24 0 192 1 -44 1 -47 1 -107 
0 132 1 -112 1 -15 1 39 0 -41 1 176 1 -171 1 30 
1 61 0 96 1 -161 1 -21 1 -12 0 117 1 -35 1 44 
1 -68 1 -38 1 347 1 -285 1 16 0 -46 1 12 1 16 
1 -39 0 -31 1 48 1 -60 1 50 1 62 0 6 1 -68 
1 296 1 -273 0 -26 847 3581 100 MP stroke
1 72 1 350 1 -368 1 261 0 -275 1 -62 1 99 1 -71 
0 -16 1 77 1 -93 1 7 0 198 1 -191 1 -34 1 41 
1 13 0 41 1 32 1 -120 1 26 0 -19 1 126 1 -98 
1 75 1 -39 0 -41 1 48 1 -38 1 -9 0 -13 1 -23 
1 14 1 105 0 -106 1 54 1 15 1 -7 1 -38 0 -39 
1 147 1 -94 1 6 0 -27 1 -24 1 32 1 -5 1 -33 
0 265 1 -249 1 161 1 -52 0 29 1 -19 1 -72 1 3 
0 -51 1 -8 1 85 1 -14 1 -42 0 182 1 339 1 -552 
1 89 0 -94 1 18 1 -18 1 108 1 -111 0 242 1 -52 
1 -155 1 -21 0 -5 1 27 1 66 1 -14 0 -9 1 106 
1 -185 1 63 1 -16 0 -13 1 86 1 -110 1 29 0 100 
1 -78 1 21 1 -3 1 63 0 -67 1 -7 1 -8 1 96 
0 -106 1 34 1 -46 770 3590 100 MP stroke
1 -1 1 42 0 58 1 81 1 -208 1 293 0 -205 1 -62 
1 6 1 -41 0 -2 1 126 1 -125 1 290 1 -282 0 143 
1 -148 1 70 1 -26 0 101 1 -67 1 110 1 -187 1 77 
0 -69 1 107 1 1 1 201 0 -297 1 0 1 40 1 0 
0 47 1 9 1 5 1 -43 1 -51 0 67 1 38 1 -46 
1 -89 0 25 1 11 1 15 1 127 1 -115 0 34 1 -56 
1 148 1 -119 0 43 1 84 1 -196 1 36 0 17 1 37 
1 -48 1 177 1 -170 0 -40 1 14 1 -2 1 81 0 -16 
1 54 1 -141 1 13 1 98 0 -100 1 23 1 -24 1 23 
0 144 1 -50 1 -81 1 -22 0 62 1 101 1 -108 1 33 
1 14 0 -119 1 69 1 -57 1 117 0 -126 1 3 1 59 
1 -5 1 91 0 133 1 -273 1 1 1 -3 0 6 1 157 
1 -112 1 -41 0 247 694 3354 100 MP stroke
1 -62 1 -200 1 0 0 21 691 3595 5 MP stroke
gr

c8
0 sg
%%IncludeResource: font Helvetica
/Helvetica /ISOLatin1Encoding 120 FMSR

5391 1511 mt 
(KIC 6949816) s
2981 3918 mt 
(Frequency \(micro Hertz\)) s
 441 2789 mt  -90 rotate
(Oscillation power) s
90 rotate
4 w
DO
SO
6 w
 691 3630 mt 6566 3630 L
 691 1037 mt 6566 1037 L
 691 3630 mt  691 1037 L
6566 3630 mt 6566 1037 L
 691 3630 mt 6566 3630 L
 691 3630 mt  691 1037 L
 691 3630 mt  691 3571 L
 691 1037 mt  691 1095 L
 625 3775 mt 
(10) s
1278 3630 mt 1278 3571 L
1278 1037 mt 1278 1095 L
1212 3775 mt 
(20) s
1866 3630 mt 1866 3571 L
1866 1037 mt 1866 1095 L
1800 3775 mt 
(30) s
2453 3630 mt 2453 3571 L
2453 1037 mt 2453 1095 L
2387 3775 mt 
(40) s
3041 3630 mt 3041 3571 L
3041 1037 mt 3041 1095 L
2975 3775 mt 
(50) s
3628 3630 mt 3628 3571 L
3628 1037 mt 3628 1095 L
3562 3775 mt 
(60) s
4216 3630 mt 4216 3571 L
4216 1037 mt 4216 1095 L
4150 3775 mt 
(70) s
4803 3630 mt 4803 3571 L
4803 1037 mt 4803 1095 L
4737 3775 mt 
(80) s
5391 3630 mt 5391 3571 L
5391 1037 mt 5391 1095 L
5325 3775 mt 
(90) s
5978 3630 mt 5978 3571 L
5978 1037 mt 5978 1095 L
5878 3775 mt 
(100) s
6566 3630 mt 6566 3571 L
6566 1037 mt 6566 1095 L
6466 3775 mt 
(110) s
 691 3630 mt  749 3630 L
6566 3630 mt 6507 3630 L
 590 3674 mt 
(0) s
 691 3192 mt  749 3192 L
6566 3192 mt 6507 3192 L
 590 3236 mt 
(2) s
 691 2754 mt  749 2754 L
6566 2754 mt 6507 2754 L
 590 2798 mt 
(4) s
 691 2316 mt  749 2316 L
6566 2316 mt 6507 2316 L
 590 2360 mt 
(6) s
 691 1879 mt  749 1879 L
6566 1879 mt 6507 1879 L
 590 1923 mt 
(8) s
 691 1441 mt  749 1441 L
6566 1441 mt 6507 1441 L
 523 1485 mt 
(10) s
 691  983 mt 
(x 10) s
%%IncludeResource: font Helvetica
/Helvetica /ISOLatin1Encoding 80 FMSR

 917  909 mt 
(4) s
 691 3630 mt 6566 3630 L
 691 1037 mt 6566 1037 L
 691 3630 mt  691 1037 L
6566 3630 mt 6566 1037 L

end %%Color Dict

eplot
%%EndObject

epage
end

showpage

%%Trailer
%%EOF
