%!PS-Adobe-2.0 EPSF-1.2
%%Creator: MATLAB, The MathWorks, Inc. Version 7.14.0.739 (R2012a). Operating System: Linux 3.13.0-53-generic #88-Ubuntu SMP Wed May 13 18:10:29 UTC 2015 x86_64.
%%Title: ./9__PSD_007522297.pow.eps
%%CreationDate: 05/23/2015  14:03:26
%%DocumentNeededFonts: Helvetica
%%DocumentProcessColors: Cyan Magenta Yellow Black
%%Extensions: CMYK
%%Pages: 1
%%BoundingBox:    40   281   577   546
%%EndComments

%%BeginProlog
% MathWorks dictionary
/MathWorks 160 dict begin
% definition operators
/bdef {bind def} bind def
/ldef {load def} bind def
/xdef {exch def} bdef
/xstore {exch store} bdef
% operator abbreviations
/c  /clip ldef
/cc /concat ldef
/cp /closepath ldef
/gr /grestore ldef
/gs /gsave ldef
/mt /moveto ldef
/np /newpath ldef
/cm /currentmatrix ldef
/sm /setmatrix ldef
/rm /rmoveto ldef
/rl /rlineto ldef
/s {show newpath} bdef
/sc {setcmykcolor} bdef
/sr /setrgbcolor ldef
/sg /setgray ldef
/w /setlinewidth ldef
/j /setlinejoin ldef
/cap /setlinecap ldef
/rc {rectclip} bdef
/rf {rectfill} bdef
% page state control
/pgsv () def
/bpage {/pgsv save def} bdef
/epage {pgsv restore} bdef
/bplot /gsave ldef
/eplot {stroke grestore} bdef
% orientation switch
/portraitMode 0 def /landscapeMode 1 def /rotateMode 2 def
% coordinate system mappings
/dpi2point 0 def
% font control
/FontSize 0 def
/FMS {/FontSize xstore findfont [FontSize 0 0 FontSize neg 0 0]
  makefont setfont} bdef
/reencode {exch dup where {pop load} {pop StandardEncoding} ifelse
  exch dup 3 1 roll findfont dup length dict begin
  { 1 index /FID ne {def}{pop pop} ifelse } forall
  /Encoding exch def currentdict end definefont pop} bdef
/isroman {findfont /CharStrings get /Agrave known} bdef
/FMSR {3 1 roll 1 index dup isroman {reencode} {pop pop} ifelse
  exch FMS} bdef
/csm {1 dpi2point div -1 dpi2point div scale neg translate
 dup landscapeMode eq {pop -90 rotate}
  {rotateMode eq {90 rotate} if} ifelse} bdef
% line types: solid, dotted, dashed, dotdash
/SO { [] 0 setdash } bdef
/DO { [.5 dpi2point mul 4 dpi2point mul] 0 setdash } bdef
/DA { [6 dpi2point mul] 0 setdash } bdef
/DD { [.5 dpi2point mul 4 dpi2point mul 6 dpi2point mul 4
  dpi2point mul] 0 setdash } bdef
% macros for lines and objects
/L {lineto stroke} bdef
/MP {3 1 roll moveto 1 sub {rlineto} repeat} bdef
/AP {{rlineto} repeat} bdef
/PDlw -1 def
/W {/PDlw currentlinewidth def setlinewidth} def
/PP {closepath eofill} bdef
/DP {closepath stroke} bdef
/MR {4 -2 roll moveto dup  0 exch rlineto exch 0 rlineto
  neg 0 exch rlineto closepath} bdef
/FR {MR stroke} bdef
/PR {MR fill} bdef
/L1i {{currentfile picstr readhexstring pop} image} bdef
/tMatrix matrix def
/MakeOval {newpath tMatrix currentmatrix pop translate scale
0 0 1 0 360 arc tMatrix setmatrix} bdef
/FO {MakeOval stroke} bdef
/PO {MakeOval fill} bdef
/PD {currentlinewidth 2 div 0 360 arc fill
   PDlw -1 eq not {PDlw w /PDlw -1 def} if} def
/FA {newpath tMatrix currentmatrix pop translate scale
  0 0 1 5 -2 roll arc tMatrix setmatrix stroke} bdef
/PA {newpath tMatrix currentmatrix pop	translate 0 0 moveto scale
  0 0 1 5 -2 roll arc closepath tMatrix setmatrix fill} bdef
/FAn {newpath tMatrix currentmatrix pop translate scale
  0 0 1 5 -2 roll arcn tMatrix setmatrix stroke} bdef
/PAn {newpath tMatrix currentmatrix pop translate 0 0 moveto scale
  0 0 1 5 -2 roll arcn closepath tMatrix setmatrix fill} bdef
/vradius 0 def /hradius 0 def /lry 0 def
/lrx 0 def /uly 0 def /ulx 0 def /rad 0 def
/MRR {/vradius xdef /hradius xdef /lry xdef /lrx xdef /uly xdef
  /ulx xdef newpath tMatrix currentmatrix pop ulx hradius add uly
  vradius add translate hradius vradius scale 0 0 1 180 270 arc 
  tMatrix setmatrix lrx hradius sub uly vradius add translate
  hradius vradius scale 0 0 1 270 360 arc tMatrix setmatrix
  lrx hradius sub lry vradius sub translate hradius vradius scale
  0 0 1 0 90 arc tMatrix setmatrix ulx hradius add lry vradius sub
  translate hradius vradius scale 0 0 1 90 180 arc tMatrix setmatrix
  closepath} bdef
/FRR {MRR stroke } bdef
/PRR {MRR fill } bdef
/MlrRR {/lry xdef /lrx xdef /uly xdef /ulx xdef /rad lry uly sub 2 div def
  newpath tMatrix currentmatrix pop ulx rad add uly rad add translate
  rad rad scale 0 0 1 90 270 arc tMatrix setmatrix lrx rad sub lry rad
  sub translate rad rad scale 0 0 1 270 90 arc tMatrix setmatrix
  closepath} bdef
/FlrRR {MlrRR stroke } bdef
/PlrRR {MlrRR fill } bdef
/MtbRR {/lry xdef /lrx xdef /uly xdef /ulx xdef /rad lrx ulx sub 2 div def
  newpath tMatrix currentmatrix pop ulx rad add uly rad add translate
  rad rad scale 0 0 1 180 360 arc tMatrix setmatrix lrx rad sub lry rad
  sub translate rad rad scale 0 0 1 0 180 arc tMatrix setmatrix
  closepath} bdef
/FtbRR {MtbRR stroke } bdef
/PtbRR {MtbRR fill } bdef
/stri 6 array def /dtri 6 array def
/smat 6 array def /dmat 6 array def
/tmat1 6 array def /tmat2 6 array def /dif 3 array def
/asub {/ind2 exch def /ind1 exch def dup dup
  ind1 get exch ind2 get sub exch } bdef
/tri_to_matrix {
  2 0 asub 3 1 asub 4 0 asub 5 1 asub
  dup 0 get exch 1 get 7 -1 roll astore } bdef
/compute_transform {
  dmat dtri tri_to_matrix tmat1 invertmatrix 
  smat stri tri_to_matrix tmat2 concatmatrix } bdef
/ds {stri astore pop} bdef
/dt {dtri astore pop} bdef
/db {2 copy /cols xdef /rows xdef mul dup 3 mul string
  currentfile exch readhexstring pop
  dup 0 3 index getinterval /rbmap xdef
  dup 2 index dup getinterval /gbmap xdef
  1 index dup 2 mul exch getinterval /bbmap xdef pop pop}bdef
/it {gs np dtri aload pop moveto lineto lineto cp c
  cols rows 8 compute_transform 
  rbmap gbmap bbmap true 3 colorimage gr}bdef
/il {newpath moveto lineto stroke}bdef
currentdict end def
%%EndProlog

%%BeginSetup
MathWorks begin

0 cap

end
%%EndSetup

%%Page: 1 1
%%BeginPageSetup
%%PageBoundingBox:    40   281   577   546
MathWorks begin
bpage
%%EndPageSetup

%%BeginObject: obj1
bplot

/dpi2point 12 def
portraitMode 0216 7344 csm

  272   787  6443  3183 MR c np
27 dict begin %Colortable dictionary
/c0 { 0.000000 0.000000 0.000000 sr} bdef
/c1 { 1.000000 1.000000 1.000000 sr} bdef
/c2 { 0.900000 0.000000 0.000000 sr} bdef
/c3 { 0.000000 0.820000 0.000000 sr} bdef
/c4 { 0.000000 0.000000 0.800000 sr} bdef
/c5 { 0.910000 0.820000 0.320000 sr} bdef
/c6 { 1.000000 0.260000 0.820000 sr} bdef
/c7 { 0.000000 0.820000 0.820000 sr} bdef
c0
1 j
1 sg
   0    0 6913 5186 PR
6 w
0 2593 5875 0 0 -2593 691 3630 4 MP
PP
-5875 0 0 2593 5875 0 0 -2593 691 3630 5 MP stroke
gs 691 1037 5876 2594 MR c np
/c8 { 0.887500 0.262500 0.000000 sr} bdef
c8
1 0 1 0 1 0 1 0 1 0 1 1 1 -1 1 0 
1 0 1 0 1 0 1 1 0 -1 1 1 1 -1 1 0 
1 0 1 0 1 0 1 0 1 0 1 0 1 0 1 0 
1 0 1 2 0 -2 1 0 1 0 1 0 1 0 1 0 
1 0 1 0 1 0 1 0 1 0 1 0 1 0 1 0 
1 1 1 -1 1 0 1 0 1 0 1 0 1 0 1 0 
1 0 1 1 1 0 1 -1 1 0 1 0 0 2 1 -2 
1 0 1 0 1 0 1 0 1 1 1 -1 1 0 1 0 
1 0 1 1 1 -1 1 1 1 0 1 -1 1 0 1 1 
0 1 1 -2 1 0 1 0 1 0 -1 0 2 0 1 1 
1 0 1 -1 1 0 1 0 1 3 0 -3 1 0 1 0 
1 0 1 0 1 0 1 2 0 2 1 -4 1 0 1 0 
1 0 1 0 1 1 6475 3628 100 MP stroke
1 -1 1 0 1 0 1 1 1 1 0 -2 1 1 1 1 
1 -2 1 0 1 0 1 0 1 1 1 -1 1 0 1 1 
0 -1 1 1 1 1 1 -2 0 1 1 -1 1 2 1 -1 
1 -1 1 0 1 0 1 0 1 0 1 0 1 0 1 0 
1 0 1 2 1 -1 0 -1 1 2 1 -1 1 0 1 -1 
1 0 1 1 1 1 0 -2 1 0 1 0 1 0 1 0 
1 0 1 0 1 0 1 1 1 -1 1 0 1 2 1 -1 
1 -1 1 0 1 0 1 2 1 -2 0 3 1 -2 1 -1 
1 0 1 3 1 -3 1 0 1 0 1 0 1 1 1 0 
-1 0 2 -1 1 0 1 1 0 -1 1 2 1 -2 1 0 
1 4 0 -4 1 0 1 0 1 0 1 0 1 0 1 2 
1 0 -1 0 2 -2 1 0 1 1 1 -1 1 0 1 0 
1 1 1 -1 1 0 6386 3629 100 MP stroke
1 0 1 0 1 0 1 0 -1 0 2 0 1 0 1 0 
1 0 1 0 1 0 1 0 1 0 1 0 1 2 1 -1 
1 0 1 0 1 -1 1 0 1 0 1 0 1 0 1 1 
1 -1 1 2 0 -2 1 1 1 0 1 -1 1 0 1 2 
1 -2 0 1 1 -1 1 0 1 0 1 0 1 0 1 0 
1 1 1 -1 1 0 1 0 1 0 1 0 1 3 1 -1 
0 -2 1 0 1 1 1 1 0 -2 1 1 1 -1 1 1 
1 -1 1 0 1 0 1 1 1 -1 1 0 1 1 1 -1 
1 0 1 0 1 1 1 -1 1 1 1 1 1 -2 1 1 
1 0 1 -1 0 1 1 -1 1 1 1 -1 1 0 1 0 
1 0 1 0 0 3 1 -2 1 -1 1 0 -1 0 2 0 
1 0 1 2 0 -2 1 1 1 -1 1 2 1 -2 1 0 
1 0 1 0 1 0 6296 3629 100 MP stroke
1 0 1 0 1 0 1 0 1 0 1 0 -1 0 2 2 
1 -2 1 1 1 -1 1 0 1 0 1 0 0 2 1 -2 
1 0 1 0 1 1 1 -1 1 0 1 0 0 2 1 -2 
1 0 1 0 1 0 1 1 1 0 -1 0 2 0 1 -1 
1 1 1 0 1 -1 1 0 1 0 -1 0 2 0 1 1 
1 0 1 -1 1 0 1 3 1 -3 1 0 1 0 1 0 
1 2 0 -1 1 -1 1 0 1 0 1 0 1 1 1 1 
0 -2 1 0 1 0 1 0 1 0 1 0 1 0 1 0 
1 3 1 -3 1 0 1 2 0 -2 1 1 1 -1 1 0 
-1 0 2 0 1 0 1 0 1 0 1 1 1 -1 1 1 
1 -1 1 0 1 0 1 4 1 0 1 -4 1 0 1 0 
1 0 1 0 1 0 1 0 1 0 -1 0 2 0 1 0 
1 0 1 0 1 0 6207 3629 100 MP stroke
1 0 1 0 -1 0 2 0 1 3 1 -2 1 -1 1 0 
1 1 1 0 1 -1 1 1 1 -1 1 0 1 1 1 0 
1 -1 1 0 1 1 1 0 -1 0 2 0 1 -1 1 3 
1 -3 1 0 1 1 1 -1 1 0 1 1 1 -1 1 0 
1 0 1 0 1 2 0 -2 1 1 1 0 1 -1 0 1 
1 -1 1 0 1 0 1 1 0 -1 1 1 1 -1 1 0 
1 0 1 0 1 0 1 1 1 -1 1 3 1 -2 1 -1 
1 0 1 0 1 1 1 0 1 0 1 -1 1 0 1 0 
1 0 1 1 1 -1 1 0 1 1 1 2 1 -3 1 0 
1 2 1 -2 1 0 1 0 1 2 1 0 1 -1 1 -1 
1 0 1 1 1 -1 1 1 1 -1 1 2 1 -1 1 -1 
1 0 -1 0 2 0 1 1 1 -1 1 3 1 -2 1 0 
1 1 0 -1 1 -1 6115 3629 100 MP stroke
1 1 1 -1 1 1 1 -1 1 0 1 0 1 0 1 1 
1 -1 1 0 1 0 1 0 -1 0 2 0 1 0 1 0 
1 0 0 3 1 -3 1 0 1 2 0 1 1 -3 1 0 
1 0 1 1 1 0 1 -1 1 1 0 -1 1 1 1 -1 
1 1 1 -1 1 1 1 -1 1 0 1 1 1 -1 1 5 
0 -3 1 -1 1 1 1 -2 1 2 0 -2 1 1 1 -1 
1 0 1 0 1 0 1 0 1 0 1 0 1 1 1 0 
1 -1 1 0 1 0 1 1 1 0 1 -1 1 0 0 2 
1 -2 1 2 1 -2 1 0 1 0 1 2 0 -2 1 2 
1 -2 1 2 1 -2 1 0 1 1 1 -1 1 0 1 0 
1 0 1 1 1 -1 1 0 1 2 1 -1 1 -1 1 0 
0 2 1 1 1 -1 1 -2 1 0 1 0 1 0 1 1 
0 -1 1 1 1 0 6026 3628 100 MP stroke
1 -1 1 0 1 0 1 0 1 0 1 0 1 0 1 0 
1 1 1 -1 1 2 1 -2 0 1 1 -1 1 1 1 0 
1 -1 1 0 1 0 1 0 -1 0 2 0 1 0 1 0 
1 0 1 1 1 0 -1 0 2 0 1 0 1 -1 1 0 
1 0 1 2 1 -2 1 0 1 2 1 -2 1 1 0 1 
1 -2 1 2 1 -2 1 2 1 -2 1 2 0 -2 1 1 
1 -1 1 0 1 1 1 -1 1 0 1 1 0 -1 1 3 
1 -3 1 0 1 0 1 1 1 -1 1 1 1 -1 1 1 
1 -1 1 0 1 1 1 -1 1 1 0 -1 1 1 1 0 
1 -1 0 1 1 -1 1 1 1 1 1 -2 1 0 1 0 
1 0 -1 0 2 0 1 1 1 -1 1 0 1 0 1 1 
1 0 1 -1 1 0 1 0 1 1 1 2 1 -2 1 0 
1 1 1 -2 1 0 5936 3629 100 MP stroke
1 0 1 0 1 0 1 0 1 0 1 2 1 -2 1 0 
1 0 1 0 0 2 1 -2 1 3 1 -3 1 0 1 1 
1 0 1 -1 1 1 1 1 1 -1 1 0 1 -1 1 0 
1 0 1 0 1 1 1 1 0 -1 1 -1 1 1 1 0 
1 0 -1 0 2 -1 1 0 1 1 0 -1 1 1 1 2 
1 -3 1 0 1 0 1 0 1 0 -1 0 2 0 1 0 
1 0 1 1 1 1 1 -2 1 1 1 -1 1 2 1 -2 
0 1 1 1 1 -2 1 5 1 -5 0 1 1 2 1 -3 
1 2 0 -2 1 0 1 1 1 -1 1 1 1 0 1 -1 
1 0 1 1 1 -1 1 1 1 0 1 -1 1 0 1 0 
1 2 1 -1 1 -1 0 1 1 -1 1 1 1 -1 0 4 
1 -3 1 1 1 -2 1 0 1 0 1 3 1 -3 1 2 
1 -2 1 0 1 3 5847 3626 100 MP stroke
0 -3 1 0 1 2 1 -1 1 -1 1 1 1 -1 1 0 
1 0 1 1 1 -1 0 1 1 1 1 -2 1 1 1 -1 
1 1 1 -1 1 1 1 -1 1 1 1 0 1 -1 1 0 
1 0 1 0 1 0 1 1 1 1 0 -2 1 0 1 0 
1 1 0 3 1 -4 1 0 1 2 1 -2 0 1 1 -1 
1 0 1 1 1 -1 1 1 1 -1 1 0 1 0 1 0 
1 0 1 0 1 2 1 -2 0 2 1 -1 1 -1 1 0 
1 0 1 0 1 0 1 0 1 2 1 -1 1 -1 1 0 
1 0 1 0 1 1 0 1 1 -2 1 0 1 0 -1 0 
2 0 1 2 1 -2 1 0 1 2 1 -1 1 -1 1 0 
1 0 1 3 0 -2 1 -1 1 3 1 -1 1 -2 1 1 
1 -1 1 0 0 4 1 -3 1 -1 1 0 1 1 1 -1 
1 1 1 -1 1 2 5758 3627 100 MP stroke
1 -1 1 0 1 -1 1 2 1 1 1 -3 1 0 1 1 
1 -1 0 2 1 -2 1 0 1 2 1 -2 0 2 1 -1 
1 -1 1 1 0 -1 1 3 1 -3 1 4 1 -4 0 2 
1 -2 1 0 1 0 0 2 1 -2 1 0 1 0 1 0 
1 0 1 1 1 -1 1 1 1 0 1 -1 0 1 1 1 
1 0 1 1 1 -2 1 -1 1 0 1 1 1 -1 1 0 
1 0 -1 0 2 0 1 1 1 -1 1 0 1 0 1 0 
1 0 -1 0 2 0 1 0 1 1 1 -1 1 1 1 -1 
1 1 1 0 1 1 1 -1 1 -1 1 0 1 0 1 2 
0 -2 1 2 1 -2 1 1 0 -1 1 3 1 -1 1 -1 
1 0 1 -1 1 0 1 0 1 2 1 -2 1 0 -1 0 
2 2 1 -2 1 1 1 -1 1 0 1 3 1 -3 0 3 
1 -3 1 0 1 4 5671 3625 100 MP stroke
1 -4 1 0 1 0 1 0 1 0 1 0 1 0 0 7 
1 -6 1 0 1 -1 1 1 0 2 1 -3 1 0 1 0 
1 1 1 1 1 -2 1 0 0 2 1 -2 1 0 1 1 
0 4 1 -5 1 0 1 0 1 1 1 -1 1 0 1 1 
1 -1 1 3 1 -3 0 1 1 3 1 -4 1 0 1 1 
1 -1 1 1 1 0 1 -1 1 1 1 0 1 -1 1 0 
1 0 1 0 0 2 1 -1 1 0 1 -1 1 1 1 0 
1 0 1 -1 0 2 1 -2 1 0 1 0 1 0 1 0 
1 2 0 -2 1 2 1 -2 1 4 1 -3 1 -1 1 1 
1 -1 1 0 1 1 1 -1 1 2 0 -2 1 0 1 0 
1 0 -1 0 2 3 1 -3 1 1 0 -1 1 2 1 -2 
1 1 1 -1 1 0 1 0 1 1 1 -1 1 1 1 1 
1 -2 0 1 1 -1 5584 3629 100 MP stroke
1 1 1 3 0 -2 1 -2 1 0 1 0 1 0 -1 0 
2 0 1 1 1 0 -1 0 2 -1 1 0 1 0 -1 0 
2 0 1 0 1 1 1 -1 1 1 1 0 1 -1 1 0 
1 0 1 1 1 0 1 -1 1 0 1 1 1 -1 1 0 
1 2 1 -2 1 1 1 -1 1 0 1 1 1 0 1 0 
-1 0 2 1 1 -1 1 0 1 -1 1 0 1 1 1 -1 
1 2 1 -2 1 0 0 2 1 -2 1 1 1 -1 1 0 
0 2 1 0 1 -2 1 0 0 5 1 -5 1 1 1 0 
1 -1 1 3 1 -3 1 1 1 -1 1 0 1 3 0 -3 
1 0 1 3 1 -2 1 1 0 -2 1 0 1 4 1 -4 
1 3 1 -3 1 0 1 0 0 4 1 -4 1 2 1 0 
-1 0 2 -2 1 0 1 0 -1 0 2 0 1 1 1 1 
1 -2 1 1 1 0 5498 3628 100 MP stroke
1 3 0 -4 1 1 1 -1 1 0 1 1 1 -1 1 1 
1 -1 1 0 1 0 1 1 0 -1 1 3 1 -2 1 -1 
1 0 -1 0 2 2 1 -1 1 0 1 -1 1 1 1 -1 
1 1 0 -1 1 2 1 -1 1 0 1 -1 1 0 1 2 
1 -1 1 3 1 -4 1 1 1 -1 1 0 1 0 1 0 
1 5 1 -5 1 0 0 3 1 -2 1 2 1 -2 0 2 
1 -3 1 0 1 0 1 0 1 0 1 1 1 -1 0 1 
1 3 1 -2 1 -2 1 0 1 0 1 2 1 1 0 -3 
1 0 1 4 1 -4 0 4 1 -4 1 0 1 2 0 -2 
1 2 1 -2 1 0 1 4 0 -4 1 0 1 2 1 0 
0 -2 1 6 1 -6 1 0 1 0 1 0 1 0 1 3 
0 -2 1 -1 1 0 1 0 1 1 1 0 1 0 1 0 
-1 0 2 0 1 -1 5413 3629 100 MP stroke
1 0 1 0 1 2 1 -2 1 1 1 -1 1 0 1 0 
0 2 1 -2 1 0 1 1 1 1 0 -1 1 -1 1 0 
1 1 0 1 1 -2 1 0 1 4 0 -3 1 1 1 0 
1 4 1 -6 0 3 1 1 1 -3 1 2 0 -3 1 1 
1 -1 1 0 1 0 1 1 1 -1 1 4 0 -3 1 -1 
1 0 1 2 0 -2 1 0 1 1 1 0 1 0 -1 0 
2 3 1 -3 1 -1 0 4 1 -1 1 -3 1 0 1 0 
1 0 1 0 1 1 1 -1 1 0 1 2 1 0 1 -2 
1 0 1 0 -1 0 2 0 1 0 1 1 1 -1 1 0 
1 2 1 0 1 -1 1 -1 1 0 1 0 1 0 1 1 
1 0 1 1 1 -2 1 0 1 0 1 0 1 0 0 2 
1 -1 1 1 1 -2 1 1 0 -1 1 1 1 -1 1 0 
1 3 1 -3 1 0 5327 3629 100 MP stroke
0 2 1 -2 1 0 1 0 1 2 0 -2 1 0 1 0 
1 2 0 -1 1 -1 1 3 1 -3 1 1 0 -1 1 2 
1 -2 1 2 0 -2 1 2 1 -1 1 -1 0 1 1 -1 
1 0 1 0 1 2 0 -2 1 0 1 0 1 0 1 1 
1 -1 1 0 1 0 0 4 1 -4 1 0 1 4 0 -4 
1 0 1 3 1 -3 1 1 1 -1 1 1 1 4 0 -5 
1 0 1 0 1 0 1 0 1 0 1 2 1 3 0 -4 
1 1 1 -2 1 0 1 1 1 0 1 0 -1 0 2 0 
1 -1 1 0 1 0 1 0 1 0 1 0 1 0 1 0 
1 1 1 1 0 -1 1 -1 1 0 1 0 1 6 1 0 
1 -4 1 -2 0 1 1 -1 1 0 1 0 1 0 1 1 
1 2 0 -2 1 -1 1 0 1 0 1 0 -1 0 2 0 
1 0 1 0 0 2 5245 3627 100 MP stroke
1 -2 1 5 1 -3 1 -2 1 4 1 0 1 -2 0 1 
1 -1 1 3 1 -4 0 1 1 1 1 0 1 -3 1 1 
1 -1 1 1 1 6 0 -7 1 2 1 -1 1 0 1 -1 
1 1 1 0 1 -1 1 1 1 0 1 0 1 0 1 1 
1 -2 1 1 0 1 1 -1 1 1 1 -2 1 0 1 1 
1 0 1 -1 0 1 1 1 1 -1 1 -1 1 5 1 -5 
1 1 0 3 1 -3 1 -1 1 0 1 0 -1 0 2 0 
1 2 1 0 0 3 1 -5 1 4 1 -3 1 -1 0 5 
1 -5 1 0 1 1 0 -1 1 6 1 -5 1 -1 1 0 
1 0 1 0 1 0 1 1 1 -1 1 2 0 -2 1 0 
1 1 1 -1 1 1 1 -1 1 0 1 0 0 3 1 -3 
1 2 1 0 0 -2 1 2 1 -2 1 1 1 -1 0 2 
1 0 1 -2 1 0 5160 3629 100 MP stroke
1 1 1 -1 1 1 1 -1 0 3 1 -3 1 1 1 1 
1 -1 1 -1 1 5 0 -5 1 0 1 0 1 0 1 0 
0 3 1 0 1 -3 1 1 1 0 1 0 1 2 1 -2 
0 1 1 2 1 -3 1 0 1 -1 1 2 1 0 0 -2 
1 0 1 0 1 0 1 0 1 0 1 0 1 2 0 -2 
1 0 1 2 1 -2 1 1 0 1 1 -2 1 1 1 2 
0 -3 1 1 1 4 1 -4 1 -1 1 2 1 -2 1 0 
1 0 1 1 1 -1 0 1 1 -1 1 0 1 0 1 0 
1 1 1 0 1 -1 1 1 1 -1 1 0 0 3 1 -2 
1 0 1 -1 1 0 1 1 1 -1 1 1 0 1 1 -2 
1 1 1 -1 1 6 0 -6 1 0 1 0 1 0 0 2 
1 1 1 -3 1 2 1 1 1 -2 1 0 1 -1 0 3 
1 -3 1 1 1 0 5075 3628 100 MP stroke
1 4 1 -5 1 0 1 0 0 4 1 -4 1 0 1 0 
1 0 1 0 1 3 1 -2 1 -1 1 0 1 6 0 -6 
1 3 1 -3 1 1 0 2 1 -2 1 1 1 1 1 -3 
0 3 1 -3 1 1 1 0 0 2 1 -3 1 2 1 1 
1 -1 0 -2 1 1 1 2 1 -3 0 2 1 -1 1 0 
1 4 0 -3 1 -2 1 0 1 0 1 2 0 -1 1 -1 
1 3 1 0 0 -2 1 2 1 -3 1 0 1 1 0 1 
1 -1 1 -1 1 1 1 0 1 -1 1 0 -1 0 2 0 
1 2 1 -2 1 2 0 -2 1 3 1 -1 1 -2 1 5 
1 -3 1 0 1 -2 1 1 1 0 1 -1 0 1 1 6 
1 -7 1 2 0 -1 1 -1 1 1 1 4 1 -5 0 1 
1 2 1 -1 1 0 1 -1 1 0 1 1 1 0 1 -2 
1 0 1 1 1 1 4992 3627 100 MP stroke
1 -2 1 3 0 -3 1 0 1 0 1 0 1 8 0 -6 
1 -2 1 0 1 1 1 -1 1 0 1 1 1 -1 0 1 
1 3 1 -3 1 0 -1 0 2 0 1 -1 1 0 0 2 
1 -2 1 1 1 -1 1 4 0 -2 1 -2 1 2 1 -2 
1 0 1 0 1 0 1 0 -1 0 2 0 1 4 1 -3 
0 -1 1 3 1 -3 1 0 1 6 1 -2 1 -4 1 1 
1 0 1 -1 1 0 -1 0 2 0 1 2 1 -2 1 0 
1 3 1 -3 1 1 1 0 1 -1 1 1 1 -1 1 3 
1 -2 1 1 0 -2 1 1 1 -1 1 3 1 -3 1 2 
1 1 1 -1 0 -2 1 1 1 0 1 0 -1 0 2 2 
1 1 1 -4 1 1 1 0 1 -1 1 1 0 -1 1 6 
1 -6 1 3 0 -3 1 0 1 0 1 0 1 0 0 2 
1 -2 1 1 1 -1 4908 3629 100 MP stroke
0 9 1 -9 1 1 1 3 1 -1 0 -3 1 0 1 2 
1 -2 0 1 1 2 1 -2 1 -1 1 1 1 1 1 -2 
1 2 0 -2 1 0 1 0 1 2 0 -1 1 2 1 -3 
1 1 1 -1 0 4 1 -4 1 1 1 -1 1 1 1 4 
1 -4 0 1 1 -1 1 -1 1 2 1 -2 1 0 1 0 
1 1 0 1 1 -2 1 3 1 -2 1 -1 1 1 1 0 
1 4 0 -5 1 0 1 1 1 -1 0 2 1 0 1 -1 
1 -1 1 0 0 2 1 -1 1 -1 1 1 0 1 1 -2 
1 0 1 0 1 0 1 1 1 5 1 -6 0 2 1 -1 
1 -1 1 5 0 -2 1 0 1 -3 1 3 1 -3 1 0 
1 3 1 -3 0 1 1 -1 1 0 1 0 1 0 -1 0 
2 0 1 0 1 0 0 2 1 0 1 -2 1 0 1 1 
1 1 1 -1 1 2 4826 3626 100 MP stroke
1 -3 1 1 1 -1 1 0 1 3 1 -2 1 -1 1 0 
1 3 1 -2 0 -1 1 2 1 -1 1 -1 0 2 1 -2 
1 0 1 1 1 -1 0 2 1 -2 1 1 1 -1 1 2 
1 0 1 1 1 0 0 -3 1 3 1 -3 1 0 -1 0 
2 0 1 1 1 -1 1 2 1 -2 1 3 1 -3 0 2 
1 -2 1 1 1 -1 0 2 1 5 1 -6 1 2 1 -3 
0 1 1 -1 1 0 1 0 0 2 1 -2 1 1 1 -1 
0 5 1 -5 1 3 1 -2 1 -1 1 4 1 -2 1 -2 
1 0 1 1 1 2 1 -3 1 2 1 0 1 1 0 -2 
1 1 1 0 1 0 1 -1 1 -1 1 1 1 1 0 -2 
1 3 1 -3 1 0 1 1 1 -1 1 2 1 -1 0 4 
1 -4 1 1 1 -2 0 3 1 1 1 -4 1 1 1 -1 
1 0 1 1 1 -1 4741 3629 100 MP stroke
1 2 1 -2 1 3 0 -2 1 1 1 1 1 -3 1 0 
1 0 1 2 1 -2 0 3 1 0 1 -3 1 1 1 -1 
1 1 1 -1 1 0 1 1 1 -1 1 3 0 -3 1 0 
1 0 1 0 1 0 1 0 1 0 1 1 0 1 1 5 
1 -6 1 0 1 -1 1 2 1 1 1 -1 0 -2 1 0 
1 0 1 1 0 -1 1 1 1 0 1 -1 1 3 0 4 
1 -5 1 1 1 0 0 -3 1 4 1 -2 1 -2 1 0 
-1 0 2 0 1 0 1 11 0 -10 1 2 1 -2 1 -1 
1 0 1 2 1 -2 1 1 1 -1 1 5 1 -5 1 1 
1 0 1 -1 1 4 0 -2 1 -1 1 0 1 1 1 -2 
1 2 1 7 0 -8 1 0 1 -1 1 4 1 0 0 4 
1 -5 1 -2 1 4 0 -5 1 0 1 5 1 -2 1 2 
0 -5 1 1 1 5 4657 3623 100 MP stroke
1 -5 1 1 1 -2 1 1 0 4 1 -4 1 -1 1 0 
1 4 1 0 1 -4 1 0 -1 0 2 0 1 5 1 -3 
1 -2 1 1 1 0 1 0 0 5 1 -6 1 0 1 0 
1 3 1 -2 1 -1 1 1 0 4 1 5 1 -9 1 6 
0 -4 1 -2 1 -1 1 4 1 -4 0 4 1 -3 1 0 
1 0 0 2 1 -3 1 0 1 2 0 1 1 -2 1 -1 
1 0 1 0 0 5 1 6 1 -10 1 -1 1 1 1 -1 
1 0 1 0 -1 0 2 0 1 2 1 -2 0 1 1 1 
1 0 1 -1 1 -1 1 8 1 -6 1 0 -1 0 2 -2 
1 11 1 -8 0 -3 1 0 1 2 1 0 1 -2 0 1 
1 -1 1 1 1 -1 0 1 1 2 1 -2 1 0 1 -1 
0 14 1 -13 1 1 1 -2 0 1 1 -1 1 1 1 -1 
0 3 1 2 1 -5 4576 3629 100 MP stroke
1 0 1 5 0 -4 1 -1 1 1 1 0 -1 0 2 -1 
1 0 1 1 1 0 -1 0 2 4 1 -5 1 0 1 0 
1 0 1 0 -1 0 2 3 1 -3 1 0 1 1 1 3 
1 -3 1 1 1 -1 1 -1 1 1 1 -1 1 0 1 0 
1 0 0 6 1 -2 1 -4 1 1 0 -1 1 2 1 1 
1 -1 1 1 0 -3 1 5 1 -2 1 -2 0 -1 1 1 
1 6 1 -5 1 -1 1 8 1 -5 1 -2 0 -2 1 3 
1 -2 1 3 0 -4 1 4 1 0 1 -3 1 0 0 2 
1 -3 1 2 1 2 0 -3 1 2 1 0 1 0 1 -2 
0 -1 1 2 1 -2 1 5 0 -3 1 7 1 -7 1 0 
0 -2 1 10 1 -9 1 2 1 -1 0 7 1 -7 1 -1 
1 -1 1 2 1 -2 1 1 1 1 0 1 1 -2 1 2 
1 -3 0 3 1 0 4495 3626 100 MP stroke
1 -1 1 0 -1 0 2 -2 1 6 1 -5 1 -1 1 1 
1 1 1 2 0 -4 1 0 1 1 1 1 1 1 0 -2 
1 1 1 -2 1 2 0 -2 1 6 1 1 1 -7 0 1 
1 3 1 1 1 -4 1 -1 0 2 1 -2 1 5 1 1 
0 -6 1 1 1 0 1 -1 1 5 0 -2 1 -3 1 0 
1 7 0 -6 1 3 1 -3 1 3 0 -4 1 1 1 4 
1 -5 1 3 0 -3 1 2 1 -2 1 1 0 -1 1 2 
1 -2 1 1 1 -1 0 2 1 -1 1 1 1 -1 1 -1 
1 2 1 -2 0 3 1 -3 1 1 1 4 1 -5 0 2 
1 -2 1 1 1 0 0 3 1 -3 1 -1 1 6 1 -5 
0 3 1 -2 1 -2 1 0 0 3 1 1 1 -2 1 -1 
1 0 -1 0 2 -1 1 1 1 -1 0 3 1 1 1 -4 
1 1 0 7 1 -6 4417 3627 100 MP stroke
1 -2 1 1 1 0 0 3 1 1 1 -4 1 -1 0 2 
1 -2 1 5 1 -4 1 1 0 2 1 -2 1 0 1 -2 
0 3 1 -1 1 2 1 0 0 -4 1 0 1 0 1 2 
1 -1 0 -1 1 4 1 -4 1 2 1 -2 1 0 1 2 
1 -1 1 1 1 5 1 -3 0 3 1 -6 1 0 1 -1 
0 3 1 -1 1 -1 1 3 1 -3 0 5 1 -5 1 0 
1 0 1 4 1 -5 1 0 1 0 0 4 1 0 1 -1 
1 -2 1 -1 1 0 1 2 0 -1 1 1 1 4 1 -2 
1 -4 0 1 1 1 1 -2 1 0 -1 0 2 2 1 -2 
1 6 1 -5 0 1 1 5 1 4 1 -10 0 -1 1 29 
1 -28 1 4 0 -4 1 4 1 -4 1 0 1 2 0 -2 
1 3 1 -1 1 20 0 -17 1 -3 1 1 1 -2 1 0 
0 5 1 -7 1 3 4337 3626 100 MP stroke
1 -2 0 1 1 7 1 -8 1 3 0 -3 1 0 1 -1 
1 7 1 -4 0 -3 1 2 1 -2 1 3 0 1 1 -2 
1 -2 1 0 1 0 0 2 1 -2 1 3 1 -1 0 2 
1 -2 1 2 1 -3 0 -1 1 2 1 -1 1 7 1 -5 
0 -2 1 0 1 0 1 0 -1 0 2 8 1 -9 1 2 
1 1 0 6 1 -7 1 -2 1 1 0 4 1 2 1 -7 
1 0 1 1 1 0 1 -1 1 0 0 3 1 6 1 -8 
1 0 -1 0 2 5 1 -6 1 2 1 5 1 -1 1 -6 
1 1 0 1 1 -2 1 0 1 1 0 2 1 -2 1 11 
1 -10 1 1 0 -2 1 -1 1 5 1 -5 0 6 1 -6 
1 3 1 -3 1 0 0 2 1 2 1 -2 1 -1 1 1 
1 -2 1 0 -1 0 2 6 1 -3 1 3 1 -6 1 1 
1 -1 1 6 0 -4 4258 3627 100 MP stroke
1 -1 1 2 1 -2 1 4 0 -5 1 2 1 -2 1 1 
0 1 1 1 1 3 1 -2 1 -3 1 3 1 -2 1 2 
1 0 1 -4 1 3 0 -3 1 2 1 -2 1 0 1 0 
1 0 1 0 1 0 0 4 1 -4 1 0 1 2 1 -1 
0 -1 1 3 1 -2 1 2 0 -2 1 2 1 3 1 -6 
0 4 1 2 1 -5 1 1 1 -1 0 2 1 -3 1 6 
1 -2 0 -4 1 12 1 -7 1 -2 1 2 1 -3 1 1 
1 2 0 -5 1 0 1 0 1 2 0 1 1 -2 1 3 
1 0 1 -3 1 0 1 3 1 -3 1 -1 1 2 1 0 
1 -2 0 5 1 -4 1 2 1 -3 1 3 1 1 1 -4 
0 3 1 -3 1 1 1 5 1 -5 0 -1 1 1 1 -1 
1 5 0 -3 1 0 1 -2 1 0 1 0 -1 0 2 2 
1 0 1 2 0 -3 4176 3628 100 MP stroke
1 0 1 2 1 -3 0 9 1 -7 1 -2 1 0 1 0 
0 4 1 -4 1 1 1 5 0 -6 1 0 1 5 1 -2 
1 0 0 -3 1 1 1 0 1 1 0 11 1 -10 1 3 
1 -2 0 -4 1 0 1 3 1 4 1 -7 1 0 1 2 
1 2 0 -2 1 -2 1 2 1 -2 1 6 0 -4 1 -1 
1 2 1 -1 0 -2 1 0 1 13 1 -8 0 -5 1 2 
1 0 1 -2 1 16 0 -16 1 0 1 0 1 0 0 5 
1 -5 1 1 1 0 1 1 0 -2 1 2 1 -1 1 -1 
0 3 1 0 1 -2 1 10 0 -11 1 12 1 -5 1 -4 
1 -3 1 11 1 -10 1 -1 0 3 1 -1 1 5 1 -1 
1 -1 0 -2 1 -2 1 1 1 7 0 -7 1 -2 1 0 
1 0 0 6 1 -4 1 -2 1 5 1 -2 1 -1 1 -2 
1 3 0 -2 1 0 4097 3628 100 MP stroke
1 5 1 -2 1 -3 1 -1 1 0 1 3 0 8 1 -10 
1 7 1 -8 1 3 0 -3 1 0 1 4 1 1 0 -3 
1 1 1 -2 1 4 0 -4 1 2 1 -3 1 0 1 3 
0 -2 1 0 1 2 1 -2 1 -1 1 5 1 2 1 -7 
0 3 1 7 1 -9 1 1 0 2 1 0 1 7 1 -10 
1 -1 1 4 1 -4 1 2 0 7 1 -7 1 -2 1 0 
-1 0 2 0 1 0 1 0 1 0 -1 0 2 3 1 0 
1 1 0 7 1 -8 1 -3 1 3 0 -2 1 5 1 -6 
1 0 1 0 0 5 1 -1 1 -4 1 3 0 -3 1 12 
1 -12 1 1 1 0 1 -1 1 3 1 0 0 5 1 -8 
1 6 1 9 0 -13 1 0 1 2 1 1 1 -3 0 8 
1 -10 1 2 1 4 0 -3 1 1 1 12 1 -16 1 2 
0 1 1 3 1 -4 4017 3627 100 MP stroke
1 2 0 -3 1 -1 1 9 1 -6 0 -2 1 4 1 -5 
1 9 1 -9 0 3 1 -3 1 14 1 -8 0 -1 1 -2 
1 -3 1 1 1 -1 0 1 1 -1 1 0 1 1 0 3 
1 1 1 -5 1 0 0 5 1 -5 1 5 1 -1 1 -2 
0 1 1 -3 1 4 1 0 1 -4 1 3 1 -3 1 2 
0 3 1 -5 1 7 1 -4 0 -1 1 11 1 -13 1 5 
0 -4 1 0 1 0 1 0 1 5 0 2 1 -2 1 -5 
1 0 0 4 1 0 1 -1 1 -1 1 8 0 -8 1 2 
1 -4 1 -1 0 3 1 0 1 -2 1 3 0 -3 1 4 
1 1 1 -6 1 10 0 -7 1 7 1 -10 1 0 1 2 
1 -1 1 -1 1 0 1 3 1 -1 1 -2 1 2 1 6 
1 -8 0 11 1 -9 1 -1 1 1 1 -1 0 4 1 -4 
1 1 1 6 0 -4 3938 3625 100 MP stroke
1 -3 1 -1 1 0 1 1 0 -1 1 2 1 -2 1 2 
0 -2 1 0 1 15 1 -3 1 -11 0 1 1 -2 1 2 
1 1 0 -3 1 0 1 2 1 13 0 -14 1 0 1 3 
1 6 1 -6 0 1 1 -5 1 1 1 7 0 -8 1 0 
1 1 1 0 1 2 1 -1 1 2 1 0 0 -2 1 3 
1 1 1 -2 0 -4 1 4 1 -1 1 1 1 -1 0 -3 
1 0 1 4 1 4 0 -3 1 -4 1 -1 1 2 1 1 
0 3 1 -5 1 0 1 7 0 -7 1 7 1 -8 1 14 
0 -10 1 1 1 -1 1 -4 1 0 1 4 1 5 1 -6 
1 -3 1 3 1 0 1 -3 1 8 1 -7 1 1 0 -2 
1 2 1 -2 1 4 0 5 1 -9 1 1 1 0 1 1 
1 2 1 -3 1 2 0 -3 1 10 1 -10 1 3 1 -3 
0 3 1 0 1 0 3857 3626 100 MP stroke
1 1 0 3 1 -4 1 0 1 4 0 -7 1 0 1 0 
1 4 1 -2 0 6 1 -8 1 0 1 9 0 -7 1 0 
1 2 1 6 1 -3 0 -6 1 -1 1 7 1 8 0 -15 
1 1 1 3 1 -4 0 4 1 -3 1 2 1 -2 1 1 
0 6 1 -7 1 9 1 -7 0 -1 1 -1 1 2 1 8 
1 -9 0 4 1 -6 1 0 1 10 0 -8 1 0 1 0 
1 -2 0 1 1 8 1 2 1 -4 1 -5 0 1 1 -2 
1 1 1 0 -1 0 2 -1 1 -1 1 1 1 -1 0 1 
1 -1 1 5 1 9 0 -14 1 9 1 -7 1 3 0 -2 
1 -1 1 2 1 -2 1 -2 1 2 1 1 1 -3 0 1 
1 5 1 -6 1 8 1 5 0 -12 1 10 1 -9 1 11 
0 -7 1 -4 1 -2 1 1 1 -1 1 0 1 0 1 12 
0 -8 1 1 1 0 3779 3624 100 MP stroke
1 -3 0 5 1 -6 1 2 1 -3 1 14 0 -14 1 1 
1 0 1 0 0 4 1 -5 1 4 1 0 0 -3 1 0 
1 2 1 -2 1 -1 0 6 1 -4 1 -2 1 0 0 10 
1 -10 1 0 1 10 1 -9 0 -1 1 2 1 -1 1 5 
1 -5 1 8 1 -6 1 12 0 -10 1 -4 1 4 1 -5 
0 4 1 -3 1 5 1 -1 1 -3 1 -2 1 1 1 0 
0 4 1 3 1 -7 1 2 0 -3 1 4 1 0 1 1 
1 -5 1 1 1 9 1 10 0 -19 1 3 1 -4 1 0 
0 2 1 4 1 -6 1 2 1 0 0 -2 1 0 1 0 
1 1 0 5 1 -5 1 -1 1 2 1 -1 0 -1 1 10 
1 -9 1 4 0 -5 1 6 1 -3 1 8 0 -10 1 3 
1 -1 1 -1 1 -1 0 14 1 -15 1 1 1 0 -1 0 
2 0 1 1 1 -1 3700 3628 100 MP stroke
1 -1 1 7 1 4 1 -1 0 -5 1 -4 1 -1 1 2 
0 10 1 -5 1 -6 1 -1 1 0 0 2 1 -1 1 -1 
1 6 1 -4 1 3 1 1 1 2 0 -3 1 -4 1 0 
1 1 0 1 1 -2 1 2 1 -2 0 5 1 -5 1 1 
1 -1 1 1 1 -1 1 0 1 15 0 -16 1 1 1 0 
1 1 1 -2 0 3 1 -2 1 4 1 -5 0 1 1 9 
1 -9 1 2 0 -1 1 -1 1 8 1 -9 1 0 0 5 
1 -1 1 1 1 9 0 -11 1 12 1 1 1 -12 1 9 
0 -8 1 6 1 -10 1 0 1 -1 1 4 1 -4 0 9 
1 -6 1 -2 1 1 1 0 -1 0 2 -2 1 5 1 2 
0 4 1 -6 1 -5 1 0 1 0 1 7 1 -6 1 2 
0 2 1 -4 1 -1 1 3 0 5 1 -8 1 5 1 -2 
1 -1 0 14 1 -14 3620 3627 100 MP stroke
1 5 1 2 0 2 1 -7 1 2 1 7 1 12 0 -16 
1 3 1 -8 1 -1 0 -1 1 -2 1 1 1 7 0 -5 
1 -3 1 3 1 24 1 -19 0 -7 1 9 1 -5 1 -1 
0 1 1 -4 1 3 1 0 1 -3 0 1 1 9 1 1 
1 -10 0 10 1 -2 1 -7 1 -3 1 0 0 4 1 -4 
1 5 1 4 0 -5 1 -3 1 0 1 0 0 4 1 -5 
1 7 1 -4 1 -3 0 3 1 3 1 4 1 -8 0 -2 
1 1 1 2 1 8 1 -7 0 -4 1 2 1 4 1 4 
0 11 1 -2 1 -18 1 0 -1 0 2 18 1 -8 1 -4 
1 1 0 -2 1 -2 1 -1 1 -3 1 0 1 5 1 -4 
1 0 -1 0 2 -1 1 1 1 0 -1 0 2 2 1 -2 
1 2 0 5 1 -6 1 0 1 7 1 -4 0 -5 1 6 
1 -2 1 -4 0 3 3543 3626 100 MP stroke
1 1 1 -2 1 1 1 -1 0 2 1 -4 1 13 1 -6 
0 -5 1 8 1 -5 1 7 1 -11 1 -1 1 4 1 -4 
0 1 1 -1 1 0 1 8 0 -4 1 -1 1 -3 1 0 
1 3 0 2 1 -2 1 -3 1 2 0 -2 1 9 1 -4 
1 3 0 2 1 2 1 -9 1 6 1 -7 0 1 1 -3 
1 2 1 0 0 5 1 -2 1 -5 1 1 1 -1 0 23 
1 -23 1 9 1 -7 0 5 1 -6 1 -1 1 7 0 -7 
1 7 1 -4 1 -3 1 6 0 -5 1 10 1 -9 1 2 
0 -3 1 5 1 -2 1 28 1 -32 0 11 1 -11 1 4 
1 -4 0 17 1 -14 1 7 1 -10 0 2 1 0 1 -2 
1 2 1 5 0 4 1 -4 1 -5 1 -2 0 2 1 11 
1 -6 1 -5 1 -1 0 7 1 -4 1 -4 1 13 0 -8 
1 -1 1 3 1 -3 3465 3625 100 MP stroke
0 -3 1 1 1 -2 1 4 1 14 0 -8 1 0 1 -6 
1 -2 0 -2 1 7 1 -7 1 3 1 1 0 -2 1 -1 
1 1 1 -2 0 1 1 17 1 -13 1 0 -1 0 2 5 
1 -9 1 0 1 6 1 5 1 -6 1 1 0 -7 1 8 
1 0 1 -3 1 -2 0 7 1 -6 1 1 1 -5 0 7 
1 -3 1 -4 1 2 0 1 1 27 1 -13 1 -10 1 5 
0 -8 1 -1 1 -2 1 1 0 -1 1 3 1 -1 1 -3 
1 4 0 18 1 -19 1 7 1 -9 1 5 1 1 1 4 
1 -11 0 2 1 -1 1 4 1 -2 0 -3 1 2 1 4 
1 -2 0 -4 1 5 1 -4 1 6 1 -1 0 -3 1 3 
1 -6 1 0 1 0 1 2 1 0 1 1 0 -1 1 11 
1 -13 1 11 0 -10 1 2 1 -2 1 1 0 12 1 -14 
1 2 1 0 1 5 3386 3622 100 MP stroke
0 10 1 -15 1 9 1 -10 0 -1 1 13 1 -11 1 -1 
1 3 0 -3 1 12 1 -12 1 10 0 -9 1 5 1 -6 
1 -1 0 3 1 3 1 0 1 -2 1 -3 0 1 1 24 
1 -24 1 -1 0 -1 1 7 1 -7 1 1 1 10 0 -9 
1 2 1 -3 1 4 0 -4 1 -1 1 1 1 1 0 2 
1 1 1 -4 1 6 1 -7 0 19 1 -16 1 3 1 1 
0 -2 1 -5 1 4 1 5 1 -6 1 -1 1 10 1 -7 
0 -3 1 4 1 -2 1 7 0 -4 1 -7 1 1 1 4 
1 -3 0 2 1 -4 1 4 1 -2 0 11 1 -13 1 3 
1 17 1 -4 0 -13 1 4 1 -5 1 4 0 9 1 -14 
1 5 1 -6 0 11 1 2 1 -13 1 1 1 4 0 3 
1 -7 1 12 1 -12 1 9 1 -6 1 9 1 -13 0 3 
1 1 1 -4 1 10 3308 3619 100 MP stroke
0 -3 1 -5 1 -1 1 0 0 6 1 -5 1 0 1 6 
1 -8 0 2 1 -2 1 2 1 16 0 -18 1 1 1 5 
1 0 1 2 0 -6 1 2 1 0 1 -3 0 5 1 6 
1 -10 1 15 0 -5 1 -10 1 1 1 27 1 -26 0 5 
1 -7 1 7 1 -9 0 17 1 -7 1 -6 1 -2 1 11 
0 -12 1 3 1 6 1 -5 0 1 1 -4 1 2 1 -2 
0 2 1 9 1 -13 1 0 1 5 0 3 1 -2 1 -5 
1 2 1 1 1 -4 1 11 1 -4 0 -1 1 -4 1 1 
1 1 0 -4 1 3 1 9 1 -11 1 -1 0 8 1 -8 
1 6 1 -3 0 3 1 -4 1 -1 1 4 0 -2 1 1 
1 1 1 4 1 5 0 -5 1 19 1 -26 1 7 0 -5 
1 -4 1 7 1 0 1 -5 0 8 1 -10 1 9 1 -7 
0 3 1 -1 1 0 3231 3625 100 MP stroke
1 -2 0 11 1 -8 1 -4 1 13 1 -8 0 -6 1 2 
1 5 1 -7 1 3 1 -3 1 11 1 -11 1 1 1 -1 
1 0 1 7 1 14 1 -15 0 17 1 -15 1 6 1 -7 
1 -3 1 0 1 -4 1 2 0 -1 1 -1 1 0 1 7 
1 -7 1 16 1 -12 1 0 1 -1 1 6 1 -8 1 1 
1 2 1 14 1 -16 0 12 1 -9 1 0 1 0 -1 0 
2 -3 1 8 1 -5 1 -4 0 -1 1 4 1 0 1 1 
0 -5 1 9 1 -7 1 1 0 -2 1 8 1 -5 1 -4 
1 0 0 6 1 -4 1 -1 1 3 0 13 1 -15 1 -2 
1 9 1 -9 0 5 1 3 1 -2 1 7 0 -8 1 3 
1 -8 1 5 0 -4 1 2 1 2 1 -5 1 1 0 13 
1 -9 1 -2 1 -1 0 8 1 -9 1 13 1 -14 1 1 
0 2 1 -3 1 4 3149 3625 100 MP stroke
1 -4 1 21 1 4 1 -24 0 3 1 4 1 -7 1 3 
1 15 0 -9 1 -4 1 3 1 6 0 -14 1 0 1 -1 
1 3 1 2 0 -5 1 1 1 36 1 -36 0 7 1 -2 
1 -6 1 13 0 -4 1 -8 1 4 1 -5 1 3 0 18 
1 -19 1 16 1 -18 0 13 1 -13 1 8 1 -6 1 9 
0 -9 1 7 1 -3 1 -1 0 13 1 -17 1 11 1 5 
0 -6 1 -11 1 6 1 3 1 -3 0 2 1 5 1 -13 
1 0 1 2 1 3 1 -2 1 40 0 -38 1 -5 1 4 
1 5 0 -5 1 -3 1 0 1 20 1 -4 1 -15 1 0 
1 0 0 3 1 -1 1 -4 1 7 0 12 1 -17 1 3 
1 -2 1 -3 0 14 1 2 1 -15 1 4 0 6 1 -2 
1 -1 1 -5 1 -3 0 3 1 6 1 -4 1 5 0 -3 
1 1 1 -5 1 2 3070 3624 100 MP stroke
0 -5 1 11 1 -11 1 3 1 -3 0 16 1 -8 1 -7 
1 9 0 -10 1 6 1 -3 1 2 1 -5 0 5 1 -2 
1 0 1 0 0 9 1 -10 1 3 1 3 0 -1 1 -2 
1 -3 1 -2 1 6 1 5 1 -11 1 1 0 -1 1 1 
1 -1 1 15 1 -14 0 7 1 -3 1 1 1 -6 0 2 
1 0 1 11 1 -12 1 1 1 1 1 -1 1 -2 0 3 
1 -2 1 26 1 -6 0 -19 1 -2 1 4 1 -4 1 1 
0 7 1 -2 1 -6 1 7 0 2 1 19 1 -15 1 0 
0 -7 1 21 1 -19 1 -5 1 8 0 -1 1 -8 1 -2 
1 5 0 -3 1 44 1 -46 1 9 1 -4 0 2 1 5 
1 -2 1 -7 0 8 1 8 1 -16 1 5 0 -6 1 4 
1 2 1 36 1 -44 0 15 1 -6 1 -8 1 -1 0 2 
1 23 1 -15 1 10 2992 3609 100 MP stroke
1 -12 0 7 1 0 1 -6 1 -7 0 3 1 -3 1 -1 
1 44 0 -45 1 11 1 24 1 -34 1 -1 0 1 1 7 
1 3 1 -11 0 16 1 -3 1 -9 1 11 1 -5 0 -10 
1 8 1 12 1 -13 0 -6 1 1 1 23 1 -14 0 4 
1 -11 1 11 1 3 1 -16 1 5 1 0 1 -6 1 -1 
1 6 1 -6 1 15 0 -12 1 5 1 11 1 -15 1 -4 
1 7 1 -3 0 12 1 -14 1 2 1 -1 1 -1 0 7 
1 23 1 -24 1 -7 0 18 1 -18 1 13 1 -13 1 3 
0 3 1 9 1 -8 1 -2 0 2 1 2 1 -7 1 30 
0 -30 1 1 1 11 1 6 1 -14 1 -7 1 4 1 13 
0 -13 1 11 1 -13 1 2 1 11 0 -12 1 1 1 1 
1 -1 0 4 1 5 1 -13 1 4 1 -2 1 -1 1 2 
1 7 0 -9 1 14 2912 3614 100 MP stroke
1 1 1 -13 0 11 1 -8 1 23 1 -29 1 21 0 -17 
1 -3 1 2 1 35 0 -35 1 1 1 1 1 9 1 -14 
0 14 1 8 1 -10 1 -11 0 1 1 -2 1 17 1 -17 
0 2 1 7 1 -3 1 23 1 -15 0 -11 1 6 1 -1 
1 0 0 -7 1 3 1 6 1 -4 1 17 0 -12 1 -10 
1 41 1 -39 0 42 1 -44 1 4 1 4 0 11 1 6 
1 -23 1 0 1 17 0 -8 1 9 1 -21 1 1 0 -1 
1 1 1 -1 1 22 1 17 0 -34 1 3 1 14 1 13 
0 -13 1 1 1 -6 1 -2 0 -12 1 24 1 -19 1 -5 
1 -2 0 15 1 -13 1 0 1 21 0 -24 1 7 1 -7 
1 5 1 -3 0 7 1 -8 1 4 1 1 0 19 1 16 
1 -25 1 -5 0 -1 1 -10 1 1 1 4 1 -5 0 8 
1 11 1 -14 1 10 2835 3614 100 MP stroke
0 22 1 -32 1 10 1 -9 1 18 0 -11 1 7 1 -20 
1 9 1 9 1 -17 1 6 0 -5 1 -2 1 7 1 -3 
1 0 0 -3 1 1 1 6 1 45 0 -35 1 -7 1 -2 
1 4 1 -11 0 -1 1 5 1 -4 1 -2 0 5 1 12 
1 -17 1 3 0 -2 1 2 1 3 1 7 1 30 0 -23 
1 -5 1 -15 1 2 0 22 1 -8 1 -1 1 -8 1 0 
0 -6 1 1 1 11 1 -13 0 4 1 39 1 -18 1 -13 
0 -11 1 13 1 -12 1 3 1 11 0 -7 1 -3 1 -6 
1 13 0 8 1 -21 1 4 1 -3 1 6 0 -2 1 5 
1 0 1 -1 0 -1 1 -3 1 11 1 -10 0 1 1 -1 
1 6 1 4 1 -5 0 3 1 -11 1 25 1 -22 0 1 
1 -3 1 13 1 42 1 -58 0 2 1 70 1 -48 1 25 
0 -23 1 -15 1 11 2758 3606 100 MP stroke
1 -23 1 62 0 -48 1 62 1 -58 1 -15 0 9 1 31 
1 -9 1 3 0 -29 1 -8 1 19 1 -19 1 2 0 5 
1 -2 1 20 1 5 0 -29 1 8 1 5 1 -10 1 37 
0 23 1 -33 1 8 1 -36 0 90 1 -48 1 -35 1 -1 
0 -1 1 1 1 -6 1 41 1 -17 0 -24 1 21 1 28 
1 -35 0 -3 1 -13 1 46 1 -44 1 0 0 13 1 -13 
1 18 1 -12 0 26 1 -10 1 -17 1 -5 0 4 1 49 
1 -6 1 -26 1 -22 0 9 1 10 1 -12 1 52 0 -54 
1 61 1 -62 1 9 1 6 0 25 1 -46 1 46 1 -42 
0 36 1 -34 1 46 1 -50 1 20 1 -10 1 28 1 -4 
0 -32 1 33 1 -30 1 -5 0 5 1 -1 1 3 1 21 
1 -21 0 2 1 -6 1 19 1 -7 0 -2 1 14 1 -19 
1 -7 1 0 1 13 2680 3613 100 MP stroke
1 -16 1 0 1 18 1 -16 1 7 0 2 1 0 1 69 
1 -50 1 -14 0 -6 1 -3 1 181 1 -160 0 -27 1 15 
1 -1 1 8 0 -11 1 2 1 3 1 -6 1 -8 0 5 
1 7 1 -4 1 -5 0 1 1 -4 1 1 1 5 1 -2 
0 22 1 -17 1 0 1 -9 0 2 1 -5 1 1 1 17 
0 -10 1 -4 1 24 1 -14 1 18 0 -28 1 39 1 96 
1 -98 0 -13 1 19 1 -47 1 3 1 17 0 3 1 2 
1 66 1 -88 0 51 1 -25 1 -24 1 5 0 -4 1 17 
1 -4 1 -16 1 -1 0 -1 1 5 1 -5 1 9 0 9 
1 -19 1 17 1 -7 1 109 0 -117 1 4 1 24 1 -4 
0 -25 1 0 1 7 1 10 0 5 1 -9 1 -8 1 31 
1 -34 0 7 1 7 1 -16 1 15 0 -7 1 -4 1 29 
1 -34 1 21 0 -18 2603 3626 100 MP stroke
1 8 1 -4 1 1 0 -6 1 -1 1 28 1 -21 1 5 
0 -7 1 0 1 2 1 10 0 -18 1 60 1 -1 1 12 
0 -25 1 -21 1 95 1 -117 1 42 0 -32 1 16 1 -9 
1 -4 0 56 1 -54 1 -10 1 21 1 -24 0 -5 1 4 
1 5 1 -3 0 21 1 -24 1 -2 1 4 0 -1 1 -4 
1 4 1 8 1 1 0 3 1 0 1 14 1 -22 0 12 
1 -8 1 -10 1 16 1 17 0 12 1 62 1 -54 1 -27 
0 -4 1 -21 1 18 1 1 0 -4 1 -16 1 40 1 -39 
1 4 0 -2 1 10 1 -12 1 14 0 11 1 11 1 2 
1 -12 1 -20 0 14 1 -23 1 1 1 -1 0 5 1 -1 
1 5 1 1 0 4 1 -3 1 -7 1 5 1 21 0 -26 
1 1 1 3 1 35 0 -8 1 43 1 -50 1 -18 1 1 
0 39 1 -38 1 17 2526 3600 100 MP stroke
1 -26 0 43 1 -43 1 3 1 5 0 -6 1 8 1 -11 
1 32 1 -17 0 43 1 -36 1 126 1 -107 0 -13 1 -19 
1 49 1 -46 1 46 0 116 1 -167 1 91 1 -100 0 43 
1 -38 1 47 1 -42 0 28 1 -18 1 36 1 147 1 -201 
1 32 1 -27 1 -6 0 28 1 8 1 -20 1 0 1 24 
0 -41 1 9 1 14 1 -3 0 86 1 -101 1 -5 1 61 
0 -11 1 -20 1 -6 1 97 1 -81 0 -23 1 65 1 -56 
1 33 0 -47 1 9 1 -6 1 -2 1 0 0 19 1 44 
1 -55 1 -14 0 213 1 -164 1 -7 1 437 0 -441 1 20 
1 8 1 -49 1 27 0 -16 1 -15 1 8 1 54 0 -81 
1 0 1 21 1 -12 1 33 0 -4 1 6 1 -37 1 -4 
0 58 1 -56 1 30 1 51 0 -83 1 56 1 -46 1 -8 
1 -6 0 9 1 -7 2449 3627 100 MP stroke
1 8 1 41 0 -28 1 -1 1 -22 1 8 1 33 0 3 
1 51 1 -40 1 -41 0 8 1 -22 1 20 1 -20 0 7 
1 15 1 -18 1 10 1 -7 0 -3 1 14 1 7 1 -19 
0 64 1 -70 1 45 1 -39 1 4 0 -4 1 18 1 6 
1 -28 0 3 1 28 1 0 1 -21 1 17 0 12 1 -26 
1 4 1 80 0 -86 1 -7 1 33 1 -29 0 69 1 -63 
1 -8 1 -4 1 7 0 -5 1 60 1 -64 1 2 0 26 
1 15 1 -31 1 4 1 -18 0 85 1 -74 1 29 1 -3 
0 112 1 -143 1 15 1 209 0 -109 1 -78 1 222 1 74 
1 -308 0 75 1 -81 1 71 1 -95 0 10 1 0 1 -2 
1 -2 1 9 1 26 1 -35 1 12 0 5 1 -20 1 19 
1 12 0 -25 1 19 1 40 1 249 1 -275 0 51 1 139 
1 -41 1 -188 0 47 2372 3578 100 MP stroke
1 -31 1 23 1 55 1 -81 0 -14 1 -1 1 19 1 39 
0 -60 1 27 1 -18 1 40 0 4 1 -52 1 0 1 -1 
1 11 0 5 1 -16 1 16 1 -8 0 24 1 43 1 -48 
1 101 1 -120 0 30 1 30 1 14 1 -73 0 -4 1 20 
1 140 1 -161 0 22 1 -6 1 -4 1 -9 1 5 0 -11 
1 11 1 -11 1 16 0 -1 1 -16 1 31 1 -20 1 -6 
0 5 1 0 1 -5 1 5 0 15 1 -6 1 28 1 79 
0 -47 1 21 1 -92 1 14 1 -19 0 47 1 -8 1 -17 
1 -17 0 17 1 36 1 -59 1 10 1 12 1 -4 1 3 
1 -11 0 -1 1 20 1 -30 1 17 0 -15 1 5 1 -4 
1 9 1 -13 0 5 1 15 1 20 1 -30 0 13 1 -5 
1 13 1 140 1 -141 0 -27 1 32 1 19 1 -46 0 19 
1 -9 1 25 1 34 2294 3552 100 MP stroke
0 -54 1 -11 1 -1 1 5 1 -13 0 44 1 -36 1 10 
1 -19 0 26 1 14 1 -3 1 -37 1 31 0 -30 1 13 
1 -14 1 31 0 -16 1 32 1 50 1 15 0 -66 1 -6 
1 31 1 -72 1 33 0 63 1 -58 1 128 1 -166 1 157 
1 -129 1 -17 1 111 0 -72 1 87 1 -41 1 -11 0 -10 
1 -14 1 32 1 173 1 333 0 -483 1 -83 1 872 1 -563 
0 42 1 -322 1 -16 1 38 0 -20 1 57 1 -118 1 76 
1 53 0 -112 1 10 1 109 1 -3 0 -86 1 -23 1 -14 
1 112 1 -118 0 51 1 -42 1 5 1 7 0 63 1 0 
1 43 1 -131 0 63 1 -25 1 -11 1 23 1 -25 0 25 
1 16 1 34 1 192 0 -152 1 203 1 -261 1 -27 1 129 
0 -50 1 -92 1 96 1 -91 0 200 1 -56 1 34 1 -221 
0 28 1 132 1 -63 2217 3524 100 MP stroke
1 140 1 -161 0 -8 1 31 1 -86 1 131 0 -95 1 55 
1 -103 1 81 1 -75 0 59 1 327 1 -345 1 161 0 -213 
1 61 1 -24 1 -11 0 -28 1 57 1 113 1 -132 1 -37 
0 -3 1 23 1 -12 1 8 0 11 1 -3 1 -10 1 76 
1 -86 0 10 1 2 1 70 1 -73 0 5 1 118 1 -68 
1 45 0 -20 1 -11 1 -55 1 -21 1 10 0 34 1 -46 
1 -7 1 29 0 -8 1 114 1 -135 1 67 1 -63 0 14 
1 1 1 -17 1 11 0 2 1 -12 1 28 1 137 0 -87 
1 453 1 -31 1 -451 1 -39 0 2 1 2 1 -16 1 23 
0 14 1 -28 1 -7 1 129 1 -131 0 25 1 -19 1 7 
1 99 0 40 1 -102 1 -44 1 75 0 527 1 -536 1 1094 
1 -413 1 -718 0 52 1 16 1 126 1 -213 0 13 1 -23 
1 35 1 -39 1 13 2140 3613 100 MP stroke
0 200 1 -99 1 -96 1 -17 0 9 1 11 1 -20 1 105 
0 -85 1 269 1 -33 1 -168 1 246 0 -268 1 69 1 -122 
1 179 0 -173 1 0 1 47 1 -70 1 67 0 -45 1 -21 
1 7 1 10 0 -4 1 0 1 55 1 0 0 -9 1 -54 
1 98 1 -53 1 -19 0 582 1 -524 1 104 1 -62 0 55 
1 -74 1 -99 1 10 1 -18 0 24 1 -29 1 25 1 18 
0 -41 1 11 1 -11 1 5 0 11 1 17 1 -9 1 -11 
1 -13 0 65 1 -58 1 36 1 18 0 127 1 -112 1 -62 
1 44 1 -13 0 30 1 -20 1 -1 1 -31 0 -17 1 -3 
1 29 1 -33 1 39 0 -16 1 20 1 -21 1 -19 0 165 
1 -102 1 -62 1 -4 0 -1 1 16 1 17 1 84 1 -48 
0 268 1 -314 1 -9 1 18 0 -5 1 -1 1 18 1 -45 
1 49 0 -32 1 -3 2064 3615 100 MP stroke
1 14 1 6 0 -17 1 -8 1 -7 1 56 0 -35 1 -10 
1 -12 1 38 1 -29 0 5 1 -5 1 -10 1 79 0 -79 
1 16 1 11 1 19 1 -16 0 115 1 -64 1 -65 1 1 
0 56 1 -6 1 -25 1 5 0 -43 1 3 1 18 1 93 
1 18 0 24 1 -101 1 59 1 -95 0 54 1 90 1 -166 
1 58 1 -53 0 258 1 -248 1 28 1 26 0 -65 1 113 
1 71 1 -138 0 289 1 -331 1 129 1 -64 1 -34 0 80 
1 121 1 90 1 -133 0 -134 1 348 1 -1 1 335 1 89 
0 -542 1 -264 1 192 1 -57 0 -40 1 -33 1 -41 1 -47 
0 25 1 90 1 -25 1 -30 1 -62 0 29 1 50 1 114 
1 -128 0 -5 1 -5 1 89 1 -100 1 257 0 -273 1 126 
1 -127 1 89 0 -90 1 33 1 102 1 -127 0 -34 1 9 
1 -1 1 154 1 -163 1987 3629 100 MP stroke
0 105 1 120 1 -198 1 75 0 -98 1 268 1 -220 1 -46 
1 367 0 -232 1 -81 1 -54 1 467 0 -312 1 -47 1 16 
1 -119 0 302 1 -196 1 -61 1 199 1 -173 0 39 1 -71 
1 -8 1 -2 0 73 1 -109 1 46 1 -46 1 194 0 -83 
1 -68 1 -40 1 94 0 132 1 -183 1 -2 1 -18 0 5 
1 0 1 -23 1 18 1 -27 0 316 1 -306 1 4 1 90 
0 -88 1 1 1 -14 1 42 1 -15 0 -4 1 167 1 -57 
1 -78 0 374 1 -388 1 -45 1 248 0 -172 1 -45 1 58 
1 104 1 -190 0 3 1 -4 1 17 1 -12 1 57 1 -36 
1 -25 1 2 0 91 1 -13 1 -27 1 904 0 -912 1 -28 
1 -18 1 24 1 27 0 -31 1 3 1 -27 1 27 0 45 
1 -55 1 -6 1 20 0 86 1 -69 1 -27 1 164 1 21 
0 371 1 -48 1 -397 1910 3497 100 MP stroke
1 23 0 -128 1 26 1 -20 1 -16 1 -9 0 9 1 78 
1 -3 1 -1 0 -9 1 -21 1 30 1 367 0 1702 1 -1915 
1 165 1 -161 1 -203 0 5 1 -51 1 33 1 -16 0 26 
1 -39 1 34 1 105 1 -135 0 65 1 -56 1 14 1 625 
0 557 1 -1193 1 64 1 -14 0 -23 1 5 1 -7 1 -32 
1 3 0 11 1 9 1 -17 1 11 0 6 1 40 1 -38 
1 18 1 19 0 110 1 -3 1 1 1 -149 0 66 1 -95 
1 48 1 35 0 -55 1 54 1 -87 1 6 1 34 0 19 
1 -24 1 -10 1 0 0 -15 1 4 1 105 1 266 1 -371 
0 -13 1 16 1 -14 1 7 1 14 1 -2 1 -2 0 35 
1 -47 1 22 1 -25 1 2 0 10 1 8 1 -16 1 49 
0 -10 1 1 1 -41 1 34 1 23 0 -62 1 19 1 -18 
1 33 0 -29 1 -5 1833 3626 100 MP stroke
1 66 1 13 0 -73 1 9 1 64 1 -16 1 -50 0 39 
1 16 1 1 1 0 0 -70 1 179 1 -153 1 -21 1 -7 
0 6 1 39 1 -7 1 -21 0 2 1 0 1 -14 1 32 
0 -2 1 55 1 -77 1 -8 1 8 0 18 1 -28 1 15 
1 19 0 -28 1 26 1 2 1 33 1 -69 0 11 1 -4 
1 -5 1 15 0 7 1 30 1 340 1 -394 0 106 1 -36 
1 161 1 -209 1 -1 0 -11 1 11 1 -6 1 -1 0 18 
1 155 1 -92 1 158 1 -241 0 34 1 9 1 12 1 -64 
0 55 1 -17 1 -37 1 41 0 101 1 -137 1 750 1 -651 
1 -5 0 59 1 21 1 -115 1 188 0 313 1 -334 1 -95 
1 -124 1 175 0 -147 1 45 1 -6 1 -42 0 22 1 0 
1 232 1 -279 1 67 0 -77 1 169 1 30 1 -155 0 -47 
1 9 1 37 1 161 1756 3418 100 MP stroke
0 -118 1 -83 1 -5 1 39 1 91 0 -117 1 78 1 -83 
1 17 0 55 1 -68 1 32 1 78 1 -119 0 137 1 186 
1 -248 1 6 0 82 1 192 1 -317 1 54 0 -56 1 71 
1 -76 1 241 1 -170 0 -51 1 -25 1 -23 1 39 0 -12 
1 -34 1 9 1 708 1 -631 0 -79 1 88 1 -89 1 -7 
0 76 1 -23 1 59 1 -46 0 -67 1 53 1 -52 1 102 
1 -35 0 -40 1 136 1 443 1 -457 0 33 1 -142 1 -28 
1 -5 1 -6 0 34 1 -6 1 21 1 -33 0 -15 1 10 
1 139 1 -149 0 98 1 -39 1 -43 1 57 1 -19 0 -34 
1 6 1 93 1 -91 0 -23 1 18 1 13 1 73 1 -91 
0 -5 1 -3 1 81 1 3 0 -81 1 57 1 85 1 152 
0 -308 1 4 1 36 1 21 1 -59 0 40 1 -25 1 257 
1 -274 0 237 1 -169 1680 3557 100 MP stroke
1 -47 1 -14 1 325 0 -252 1 -9 1 -55 1 99 0 -109 
1 11 1 42 1 184 0 -129 1 172 1 78 1 -225 1 -136 
0 92 1 -10 1 -89 1 29 0 59 1 -3 1 -77 1 82 
1 -85 0 12 1 741 1 -404 1 -23 0 -242 1 24 1 -109 
1 17 0 34 1 -43 1 6 1 -4 1 23 0 -20 1 -17 
1 21 1 516 0 -469 1 -12 1 36 1 29 1 -27 0 -80 
1 84 1 -38 1 -19 0 -37 1 4 1 4 1 16 0 14 
1 -40 1 83 1 -85 1 15 0 3 1 -15 1 39 1 31 
0 -71 1 1 1 27 1 18 1 -47 0 15 1 79 1 -61 
1 -26 0 56 1 -59 1 181 1 -150 0 -20 1 34 1 -41 
1 16 1 -16 0 7 1 15 1 -1 1 54 0 2 1 9 
1 -90 1 57 1 -56 0 5 1 -10 1 54 1 60 0 -79 
1 32 1 -2 1 -63 1603 3626 100 MP stroke
0 5 1 0 1 13 1 58 1 -33 0 -39 1 -6 1 84 
1 -76 0 -4 1 27 1 -10 1 -16 1 309 0 -263 1 -23 
1 -28 1 48 1 25 1 -18 1 14 1 -1 0 -56 1 -13 
1 4 1 5 0 19 1 21 1 -25 1 189 0 -169 1 -19 
1 -1 1 -5 1 -18 0 4 1 27 1 -28 1 49 0 28 
1 -55 1 5 1 -11 1 -19 0 230 1 -177 1 -52 1 10 
0 19 1 49 1 -10 1 -66 0 43 1 -34 1 12 1 -11 
1 146 0 -13 1 -112 1 -20 1 214 0 -141 1 3 1 -76 
1 92 1 95 0 -47 1 -84 1 124 1 -108 0 23 1 -25 
1 -47 1 34 0 88 1 -65 1 -67 1 -14 1 4 0 45 
1 18 1 -36 1 35 0 -79 1 94 1 -33 1 -35 1 5 
0 -6 1 93 1 -106 1 28 0 29 1 -21 1 -46 1 23 
0 8 1 -30 1 122 1526 3503 100 MP stroke
1 -108 1 21 0 36 1 -75 1 15 1 53 0 -35 1 22 
1 -38 1 17 1 -3 0 -27 1 9 1 -2 1 126 0 -24 
1 -102 1 23 1 157 0 -120 1 12 1 77 1 -65 1 -66 
0 125 1 -88 1 181 1 -104 0 72 1 -212 1 51 1 58 
1 29 0 13 1 90 1 -232 1 62 0 -39 1 0 1 75 
1 -51 0 -32 1 39 1 13 1 -47 1 -21 0 6 1 -14 
1 108 1 28 0 -15 1 -66 1 -39 1 -16 1 -3 0 200 
1 -199 1 155 1 -119 0 -30 1 129 1 26 1 -115 0 -4 
1 -8 1 -25 1 37 1 -18 0 -26 1 -1 1 7 1 5 
0 13 1 -10 1 3 1 22 1 9 0 17 1 -66 1 123 
1 -94 0 284 1 -309 1 56 1 -46 0 47 1 -14 1 -13 
1 29 1 34 0 -84 1 -3 1 52 1 74 0 -137 1 72 
1 -51 1 -19 1 -2 1449 3628 100 MP stroke
0 90 1 -52 1 -39 1 43 1 -25 1 50 1 34 0 -49 
1 -44 1 -8 1 37 1 -29 0 31 1 -40 1 52 1 49 
0 24 1 -125 1 4 1 108 1 -99 0 162 1 -116 1 62 
1 -25 0 -37 1 -25 1 23 1 -53 1 0 0 10 1 -11 
1 3 1 99 0 -9 1 -26 1 -44 1 11 0 81 1 -89 
1 -11 1 -9 1 -2 0 8 1 18 1 93 1 -24 0 -55 
1 -36 1 99 1 -25 1 -54 0 83 1 -100 1 -14 1 66 
0 50 1 -57 1 186 1 -239 0 82 1 81 1 -149 1 -7 
1 33 0 -8 1 -34 1 23 1 -7 0 82 1 -43 1 28 
1 -26 1 -57 0 22 1 94 1 -96 1 -24 0 154 1 -88 
1 -24 1 60 0 -57 1 -29 1 97 1 -60 1 -45 1 71 
1 -9 1 -13 0 -22 1 -34 1 12 1 24 1 -6 0 99 
1 -10 1 -39 1 7 1371 3541 100 MP stroke
0 -18 1 25 1 -32 1 -62 0 26 1 3 1 -28 1 6 
1 10 0 -15 1 1 1 -4 1 51 0 59 1 -99 1 8 
1 -15 1 123 0 -70 1 23 1 -78 1 58 0 -33 1 17 
1 -3 1 24 0 -17 1 -36 1 -4 1 8 1 -8 0 -4 
1 -2 1 115 1 -53 0 -30 1 9 1 25 1 30 1 -87 
0 43 1 8 1 -21 1 135 0 -125 1 0 1 -17 1 21 
0 5 1 -13 1 -9 1 -35 1 3 0 200 1 -165 1 30 
1 -65 0 92 1 -72 1 8 1 -10 1 -24 0 10 1 25 
1 96 1 -124 1 43 1 32 1 -78 0 97 1 -99 1 83 
1 116 1 -38 0 111 1 -259 1 1 1 -4 0 107 1 10 
1 47 1 -75 1 -88 0 65 1 -49 1 -11 1 12 0 90 
1 -94 1 5 1 19 0 -36 1 226 1 -212 1 42 1 -69 
0 15 1 -5 1 1 1294 3617 100 MP stroke
1 -8 0 99 1 -75 1 128 1 -118 1 -28 0 58 1 -3 
1 -45 1 -10 0 124 1 -107 1 -8 1 -13 0 5 1 -10 
1 63 1 -51 1 20 0 -3 1 135 1 -121 1 -21 0 46 
1 0 1 -43 1 4 1 17 0 48 1 133 1 -186 1 -4 
0 64 1 8 1 -14 1 74 1 -164 0 2 1 49 1 -50 
1 38 0 -29 1 228 1 -213 1 28 0 238 1 -283 1 40 
1 -48 1 -5 0 32 1 3 1 51 1 -67 0 2 1 17 
1 -30 1 18 1 6 0 6 1 -29 1 127 1 -136 0 213 
1 -170 1 20 1 -34 0 -22 1 5 1 -5 1 87 1 -79 
0 -12 1 44 1 -5 1 211 0 -215 1 73 1 -71 1 53 
1 -78 0 5 1 -4 1 91 1 -38 0 -50 1 60 1 -53 
1 42 0 -31 1 -34 1 17 1 42 1 39 0 -25 1 255 
1 -238 1 -90 0 91 1218 3534 100 MP stroke
1 -93 1 21 1 158 1 -102 0 1 1 -39 1 -40 1 9 
0 72 1 -66 1 54 1 -1 0 -59 1 132 1 -97 1 -9 
1 -6 0 -28 1 67 1 -66 1 0 0 51 1 11 1 -64 
1 13 1 -7 0 92 1 -28 1 -19 1 78 0 -89 1 -30 
1 114 1 -120 0 109 1 23 1 -74 1 -23 1 25 0 29 
1 -51 1 -4 1 -22 0 76 1 -75 1 36 1 -20 1 -27 
0 210 1 -173 1 10 1 73 0 53 1 -109 1 103 1 -170 
0 21 1 -6 1 -8 1 -7 1 6 0 6 1 -6 1 -1 
1 10 0 -13 1 74 1 -58 1 46 1 -42 0 -15 1 121 
1 67 1 -190 0 -3 1 178 1 -145 1 -37 0 7 1 -8 
1 11 1 28 1 -35 0 168 1 19 1 -158 1 7 0 -13 
1 -5 1 7 1 4 1 76 0 -93 1 42 1 -59 1 101 
0 -66 1 6 1 76 1141 3512 100 MP stroke
1 28 0 -44 1 -92 1 67 1 103 1 10 0 -115 1 80 
1 -124 1 6 0 -26 1 23 1 27 1 -2 1 -32 0 80 
1 -80 1 15 1 18 0 -57 1 22 1 -20 1 20 0 6 
1 46 1 -69 1 69 1 -60 0 82 1 155 1 -245 1 62 
0 14 1 -59 1 -21 1 170 1 8 0 -118 1 -57 1 20 
1 6 0 92 1 -99 1 143 1 -88 0 -50 1 26 1 -52 
1 5 1 88 0 -54 1 -11 1 16 1 -7 0 -20 1 11 
1 255 1 -283 1 143 0 19 1 -86 1 -63 1 68 0 -66 
1 91 1 -64 1 -10 1 118 0 44 1 -174 1 -5 1 28 
0 90 1 -88 1 -6 1 22 0 15 1 119 1 -63 1 -64 
1 -17 0 -29 1 72 1 -91 1 17 0 -21 1 25 1 44 
1 -61 1 8 0 11 1 28 1 -43 1 35 0 122 1 -8 
1 -125 1 -5 0 466 1065 3128 100 MP stroke
1 -482 1 176 1 -179 1 21 0 110 1 -134 1 26 1 128 
0 -112 1 7 1 -31 1 154 1 -168 0 48 1 1 1 50 
1 66 0 -147 1 46 1 -7 1 43 0 -71 1 49 1 11 
1 64 1 -99 0 30 1 -76 1 -12 1 16 0 183 1 -208 
1 36 1 -16 1 10 0 17 1 5 1 -23 1 35 0 -31 
1 -13 1 -14 1 33 0 101 1 -144 1 29 1 -5 1 34 
0 130 1 -113 1 -4 1 -45 0 81 1 -74 1 10 1 -43 
1 33 0 -33 1 203 1 -76 1 -92 0 71 1 -63 1 -19 
1 197 0 -114 1 -106 1 51 1 -51 1 11 0 125 1 -103 
1 11 1 94 0 176 1 -87 1 -113 1 -7 1 -85 0 -15 
1 9 1 68 1 -32 0 30 1 -67 1 28 1 -44 1 6 
1 42 1 -16 1 -8 0 95 1 -76 1 -43 1 49 0 -16 
1 -23 1 -3 1 37 987 3585 100 MP stroke
1 -24 0 64 1 33 1 -95 1 101 0 -116 1 157 1 -158 
1 -1 0 7 1 9 1 2 1 -13 1 55 0 -54 1 95 
1 46 1 -129 0 83 1 18 1 -83 1 20 1 276 0 -274 
1 88 1 -112 1 44 0 241 1 -291 1 15 1 -33 0 18 
1 65 1 12 1 -72 1 80 0 -112 1 56 1 -9 1 -53 
0 2 1 59 1 219 1 -272 1 133 0 79 1 -218 1 100 
1 26 0 -99 1 104 1 43 1 -121 0 252 1 -268 1 233 
1 -214 1 -13 0 23 1 125 1 -167 1 128 0 -145 1 44 
1 -14 1 83 1 -114 0 146 1 -122 1 124 1 -115 0 -11 
1 13 1 -12 1 242 1 -194 0 67 1 -116 1 -5 1 100 
0 -73 1 36 1 -28 1 -30 0 3 1 -10 1 74 1 -34 
1 29 0 84 1 -170 1 36 1 34 0 -1 1 300 1 -217 
1 30 1 -171 0 4 911 3608 100 MP stroke
1 333 1 -265 1 -17 0 -50 1 28 1 116 1 -149 0 -16 
1 157 1 349 1 -483 1 68 0 43 1 -129 1 5 1 58 
0 15 1 2 1 67 1 -146 1 127 1 -15 1 -33 1 -35 
0 131 1 -121 1 85 1 -121 0 147 1 -92 1 -31 1 -3 
1 -2 0 15 1 94 1 -37 1 -93 0 14 1 -37 1 16 
1 60 1 -51 0 86 1 112 1 -192 1 111 0 334 1 -392 
1 -10 1 -1 0 -1 1 13 1 -6 1 49 1 127 0 -125 
1 -27 1 15 1 -110 0 184 1 -22 1 -139 1 -22 1 159 
0 -42 1 47 1 -158 1 125 0 -124 1 82 1 -35 1 6 
0 5 1 0 1 -25 1 27 1 137 0 -199 1 17 1 210 
1 -106 0 -86 1 23 1 -54 1 151 1 -145 0 33 1 -29 
1 -11 1 16 0 3 1 67 1 -43 1 64 0 -111 1 310 
1 -300 1 -6 1 256 833 3356 100 MP stroke
0 -241 1 310 1 -331 1 62 0 33 1 -83 1 366 1 -375 
1 184 0 -134 1 -36 1 215 1 -180 0 -47 1 112 1 28 
1 -56 0 -28 1 148 1 -163 1 5 1 -47 0 7 1 53 
1 20 1 287 0 -377 1 37 1 105 1 -76 1 -31 0 26 
1 332 1 -392 1 158 0 -147 1 296 1 -257 1 31 0 -81 
1 -6 1 52 1 333 1 -129 0 -188 1 54 1 -34 1 74 
0 -154 1 4 1 31 1 -25 1 131 0 -104 1 169 1 -138 
1 -68 0 8 1 90 1 -48 1 -53 0 84 1 360 1 -435 
1 101 1 -15 0 -63 1 -37 1 111 1 -6 0 -62 1 100 
1 17 1 32 1 -36 0 -144 1 271 1 -254 1 116 0 178 
1 -229 1 -44 1 52 0 -79 1 57 1 51 1 -25 1 52 
0 -142 1 151 1 -64 1 -31 0 48 1 40 1 -37 1 -123 
1 50 0 149 1 107 757 3323 100 MP stroke
1 -278 1 -19 0 111 1 611 1 -714 1 123 1 230 0 -327 
1 38 1 -75 1 124 0 -30 1 -98 1 299 1 -183 0 15 
1 9 1 -45 1 -60 1 -26 0 234 1 -157 1 -40 1 -40 
0 30 1 233 1 -223 1 343 1 -84 0 -8 1 -229 1 234 
1 -96 0 4 1 -162 1 -40 1 113 0 -46 1 80 1 -157 
1 62 1 120 0 11 1 -88 1 42 1 -126 0 346 1 -291 
1 200 1 -219 1 276 0 -302 1 -30 1 138 1 -101 0 185 
1 -193 1 16 1 -29 0 -1 1 218 1 -120 1 -59 1 10 
0 -29 1 60 1 -59 1 178 0 -212 1 270 1 -140 1 -116 
1 23 0 237 1 -112 1 -34 1 31 0 -102 1 -15 1 116 
1 -107 0 15 1 41 1 403 1 -363 0 27 691 3452 87 MP stroke
gr

c8
0 sg
%%IncludeResource: font Helvetica
/Helvetica /ISOLatin1Encoding 120 FMSR

5391 1511 mt 
(KIC 7522297) s
2981 3918 mt 
(Frequency \(micro Hertz\)) s
 408 2789 mt  -90 rotate
(Oscillation power) s
90 rotate
4 w
DO
SO
6 w
 691 3630 mt 6566 3630 L
 691 1037 mt 6566 1037 L
 691 3630 mt  691 1037 L
6566 3630 mt 6566 1037 L
 691 3630 mt 6566 3630 L
 691 3630 mt  691 1037 L
 691 3630 mt  691 3571 L
 691 1037 mt  691 1095 L
 625 3775 mt 
(10) s
1278 3630 mt 1278 3571 L
1278 1037 mt 1278 1095 L
1212 3775 mt 
(20) s
1866 3630 mt 1866 3571 L
1866 1037 mt 1866 1095 L
1800 3775 mt 
(30) s
2453 3630 mt 2453 3571 L
2453 1037 mt 2453 1095 L
2387 3775 mt 
(40) s
3041 3630 mt 3041 3571 L
3041 1037 mt 3041 1095 L
2975 3775 mt 
(50) s
3628 3630 mt 3628 3571 L
3628 1037 mt 3628 1095 L
3562 3775 mt 
(60) s
4216 3630 mt 4216 3571 L
4216 1037 mt 4216 1095 L
4150 3775 mt 
(70) s
4803 3630 mt 4803 3571 L
4803 1037 mt 4803 1095 L
4737 3775 mt 
(80) s
5391 3630 mt 5391 3571 L
5391 1037 mt 5391 1095 L
5325 3775 mt 
(90) s
5978 3630 mt 5978 3571 L
5978 1037 mt 5978 1095 L
5878 3775 mt 
(100) s
6566 3630 mt 6566 3571 L
6566 1037 mt 6566 1095 L
6466 3775 mt 
(110) s
 691 3630 mt  749 3630 L
6566 3630 mt 6507 3630 L
 590 3674 mt 
(0) s
 691 3124 mt  749 3124 L
6566 3124 mt 6507 3124 L
 490 3168 mt 
(0.5) s
 691 2618 mt  749 2618 L
6566 2618 mt 6507 2618 L
 590 2662 mt 
(1) s
 691 2112 mt  749 2112 L
6566 2112 mt 6507 2112 L
 490 2156 mt 
(1.5) s
 691 1606 mt  749 1606 L
6566 1606 mt 6507 1606 L
 590 1650 mt 
(2) s
 691 1101 mt  749 1101 L
6566 1101 mt 6507 1101 L
 490 1145 mt 
(2.5) s
 691  983 mt 
(x 10) s
%%IncludeResource: font Helvetica
/Helvetica /ISOLatin1Encoding 80 FMSR

 917  909 mt 
(5) s
 691 3630 mt 6566 3630 L
 691 1037 mt 6566 1037 L
 691 3630 mt  691 1037 L
6566 3630 mt 6566 1037 L

end %%Color Dict

eplot
%%EndObject

epage
end

showpage

%%Trailer
%%EOF
