102567622
102568803
102569695
102569955
102570071
102570825
102571376
102571404
102571660
102572121
102572304
102573231
102573297
102574520
102574573
102574896
102575198
102576272
102576457
102576526
102576882
102577015
102577023
102577477
102577833
102579009
102580697
102581097
102581252
102581399
102581416
102582002
102582386
102583117
102583175
102583489
102583503
102583892
102584786
102585521
102585581
102585877
102585936
102586219
102586626
102587846
102589399
102590268
102590548
102590804
102591137
102591423
102591439
102591774
102592502
102593020
102593578
102593664
102594418
102595567
102596541
102597610
102598062
102598885
102599605
102600397
102601007
102601367
102601551
102601652
102601753
102601871
102602002
102602483
102602816
102604446
102605130
102605181
102605237
102605310
102605313
102606716
102606880
102607212
102607336
102607704
102608178
102608703
102609031
102609477
102609629
102610692
102610901
102611274
102612104
102612876
102613585
102613878
102613970
102614337
102616546
102617605
102618296
102618690
102618714
102618733
102618794
102619449
102620285
102620975
102621599
102622075
102622424
102622985
102623655
102623743
102624262
102624290
102624373
102624925
102625840
102626343
102627086
102627212
102628437
102630182
102630510
102630805
102631820
102632259
102633186
102633367
102633757
102633769
102633848
102634415
102634932
102635126
102635501
102635560
102636504
102637062
102637237
102637262
102637438
102638034
102639082
102639822
102639950
102640887
102641065
102642226
102642432
102642718
102643048
102643816
102645018
102645343
102645579
102646332
102646358
102646402
102646651
102647296
102647418
102647653
102647832
102648670
102648934
102649746
102650000
102650672
102652186
102652268
102652340
102653449
102653807
102654156
102654389
102654461
102655024
102655433
102655743
102656416
102656515
102656540
102657026
102657821
102659208
102659308
102660134
102661292
102661735
102662180
102662299
102664328
102664730
102665306
102665677
102665919
102667319
102667669
102667698
102668611
102668814
102668960
102669190
102670422
102670576
102670790
102672065
102672149
102672591
102673366
102673776
102673861
102674018
102675286
102675887
102675911
102676004
102676651
102676749
102677368
102677834
102679331
102680276
102680492
102680832
102681107
102681803
102683633
102684715
102684786
102685359
102685387
102685405
102685867
102686001
102686562
102687238
102688059
102688262
102688399
102688552
102688898
102689111
102689399
102689576
102690411
102690607
102690788
102690813
102691871
102692778
102693088
102693373
102693596
102693812
102694188
102694248
102694654
102694833
102694848
102694855
102695868
102696859
102697124
102697221
102697267
102697482
102697826
102697871
102698000
102699132
102699436
102700346
102700841
102701434
102701678
102701712
102702215
102702432
102702646
102702971
102704525
102704719
102705344
102705349
102705435
102706020
102706286
102706346
102707030
102707133
102707647
102707766
102707955
102708307
102708694
102709475
102709514
102712216
102713358
102713587
102713613
102714305
102714764
102715026
102715243
102715626
102716113
102716180
102716356
102716433
102716951
102717364
102717436
102717889
102718516
102718574
102718735
102718948
102719178
102719470
102720804
102721333
102721804
102721895
102721925
102721967
102722465
102723199
102723508
102723554
102724864
102725035
102725513
102725714
102726093
102726271
102726655
102726683
102726854
102726859
102727008
102727063
102727176
102728837
102729262
102729596
102729597
102729660
102729965
102730068
102730573
102730917
102731845
102732030
102732271
102732771
102733047
102733615
102735063
102735264
102735981
102736607
102737011
102737637
102738619
102739151
102739465
102741315
102741486
102742060
102743223
102743799
102743827
102744706
102745305
102745562
102746122
102746322
102746786
102746792
102748522
102749041
102750056
102750125
102751782
102752013
102752388
102754779
102754972
102755814
102755935
102757223
102760913
102761440
102761611
102762175
102762536
102762620
102762684
102763219
102763553
102764321
102765126
102765582
102766038
102766835
102766939
102767085
102767871
102768182
102768488
102768861
102770063
102771922
102772852
102774177
102776749
102777303
102777770
102778275
102778440
102778510
102779389
102779558
102780024
102780552
102781334
102781532
102783216
102783541
102788196
102788308
102788927
102790572
102790587
102791095
102791704
102793018
102794029
102796614
102800862
