2.589670000000000166e-02 -8.225999999999999979e-02 4.570000000000000173e-01
3.093330000000000038e-02 -8.351999999999999702e-02 4.640000000000000235e-01
-2.875329999999999900e-02 -7.717999999999999861e-02 4.540000000000000147e-01
2.109329999999999886e-02 -7.684000000000000552e-02 4.520000000000000129e-01
2.561329999999999857e-02 -7.684000000000000552e-02 4.520000000000000129e-01
3.039999999999999994e-02 -7.752000000000000557e-02 4.560000000000000164e-01
3.526669999999999805e-02 -7.820000000000000562e-02 4.600000000000000200e-01
3.995329999999999715e-02 -7.836999999999999522e-02 4.610000000000000209e-01
-3.808330000000000048e-02 -7.312000000000000444e-02 4.570000000000000173e-01
-3.329329999999999790e-02 -7.263999999999999624e-02 4.540000000000000147e-01
-2.850000000000000103e-02 -7.199999999999999456e-02 4.500000000000000111e-01
-2.378670000000000090e-02 -7.136000000000000676e-02 4.460000000000000075e-01
-1.924000000000000016e-02 -7.104000000000000592e-02 4.440000000000000058e-01
-1.026670000000000013e-02 -7.040000000000000424e-02 4.400000000000000022e-01
-5.839999999999999705e-03 -7.008000000000000340e-02 4.380000000000000004e-01
-1.456669999999999970e-03 -6.991999999999999604e-02 4.369999999999999996e-01
2.919999999999999853e-03 -7.008000000000000340e-02 4.380000000000000004e-01
7.316669999999999945e-03 -7.023999999999999688e-02 4.390000000000000013e-01
1.638999999999999832e-02 -7.152000000000000024e-02 4.470000000000000084e-01
2.095330000000000109e-02 -7.184000000000000108e-02 4.490000000000000102e-01
2.544329999999999856e-02 -7.184000000000000108e-02 4.490000000000000102e-01
3.006669999999999829e-02 -7.216000000000000192e-02 4.510000000000000120e-01
3.488329999999999903e-02 -7.280000000000000360e-02 4.550000000000000155e-01
3.960670000000000163e-02 -7.312000000000000444e-02 4.570000000000000173e-01
4.494999999999999690e-02 -7.439999999999999392e-02 4.650000000000000244e-01
-9.597329999999999750e-02 -7.080000000000000182e-02 4.719999999999999751e-01
-9.009330000000000116e-02 -6.990000000000000380e-02 4.660000000000000253e-01
-5.698000000000000287e-02 -6.930000000000000049e-02 4.620000000000000218e-01
-5.235999999999999682e-02 -6.930000000000000049e-02 4.620000000000000218e-01
-4.753330000000000055e-02 -6.900000000000000577e-02 4.600000000000000200e-01
-4.256000000000000061e-02 -6.840000000000000246e-02 4.560000000000000164e-01
-3.783330000000000026e-02 -6.809999999999999387e-02 4.540000000000000147e-01
-3.307329999999999992e-02 -6.765000000000000180e-02 4.510000000000000120e-01
-2.837330000000000060e-02 -6.719999999999999585e-02 4.480000000000000093e-01
-2.373329999999999884e-02 -6.675000000000000377e-02 4.450000000000000067e-01
-1.919670000000000057e-02 -6.644999999999999518e-02 4.430000000000000049e-01
-1.473329999999999952e-02 -6.629999999999999782e-02 4.420000000000000040e-01
-1.026670000000000013e-02 -6.600000000000000311e-02 4.400000000000000022e-01
-5.853330000000000338e-03 -6.585000000000000575e-02 4.390000000000000013e-01
-1.456669999999999970e-03 -6.554999999999999716e-02 4.369999999999999996e-01
2.913329999999999999e-03 -6.554999999999999716e-02 4.369999999999999996e-01
7.316669999999999945e-03 -6.585000000000000575e-02 4.390000000000000013e-01
1.178670000000000065e-02 -6.629999999999999782e-02 4.420000000000000040e-01
1.620670000000000097e-02 -6.629999999999999782e-02 4.420000000000000040e-01
2.067329999999999862e-02 -6.644999999999999518e-02 4.430000000000000049e-01
2.510329999999999853e-02 -6.644999999999999518e-02 4.430000000000000049e-01
2.966670000000000071e-02 -6.675000000000000377e-02 4.450000000000000067e-01
3.450000000000000289e-02 -6.750000000000000444e-02 4.500000000000000111e-01
3.926000000000000323e-02 -6.794999999999999651e-02 4.530000000000000138e-01
4.388670000000000071e-02 -6.809999999999999387e-02 4.540000000000000147e-01
4.895999999999999658e-02 -6.884999999999999454e-02 4.590000000000000191e-01
-1.074230000000000046e-01 -6.733999999999999708e-02 4.809999999999999831e-01
-1.028270000000000017e-01 -6.747999999999999832e-02 4.819999999999999840e-01
-9.719329999999999636e-02 -6.691999999999999338e-02 4.779999999999999805e-01
-9.144670000000000576e-02 -6.622000000000000108e-02 4.729999999999999760e-01
-8.598329999999999862e-02 -6.565999999999999615e-02 4.689999999999999725e-01
-8.129329999999999889e-02 -6.565999999999999615e-02 4.689999999999999725e-01
-7.660329999999999917e-02 -6.565999999999999615e-02 4.689999999999999725e-01
-7.160669999999999535e-02 -6.537999999999999368e-02 4.670000000000000262e-01
-6.650670000000000193e-02 -6.496000000000000385e-02 4.640000000000000235e-01
-6.186669999999999670e-02 -6.496000000000000385e-02 4.640000000000000235e-01
-5.698000000000000287e-02 -6.468000000000000138e-02 4.620000000000000218e-01
-5.213330000000000047e-02 -6.439999999999999891e-02 4.600000000000000200e-01
-4.722330000000000277e-02 -6.397999999999999521e-02 4.570000000000000173e-01
-4.237330000000000263e-02 -6.356000000000000538e-02 4.540000000000000147e-01
-3.749999999999999861e-02 -6.300000000000000044e-02 4.500000000000000111e-01
-3.277999999999999664e-02 -6.257999999999999674e-02 4.470000000000000084e-01
-2.818330000000000141e-02 -6.230000000000000121e-02 4.450000000000000067e-01
-2.362670000000000048e-02 -6.201999999999999874e-02 4.430000000000000049e-01
-1.915330000000000157e-02 -6.187999999999999751e-02 4.420000000000000040e-01
-1.466669999999999953e-02 -6.160000000000000198e-02 4.400000000000000022e-01
-1.024330000000000032e-02 -6.146000000000000074e-02 4.390000000000000013e-01
-5.839999999999999705e-03 -6.131999999999999951e-02 4.380000000000000004e-01
-1.453330000000000073e-03 -6.103999999999999704e-02 4.359999999999999987e-01
2.913329999999999999e-03 -6.117999999999999827e-02 4.369999999999999996e-01
7.300000000000000065e-03 -6.131999999999999951e-02 4.380000000000000004e-01
1.170670000000000044e-02 -6.146000000000000074e-02 4.390000000000000013e-01
1.617000000000000035e-02 -6.174000000000000321e-02 4.410000000000000031e-01
2.058000000000000107e-02 -6.174000000000000321e-02 4.410000000000000031e-01
2.498999999999999833e-02 -6.174000000000000321e-02 4.410000000000000031e-01
2.946669999999999845e-02 -6.187999999999999751e-02 4.420000000000000040e-01
3.396330000000000182e-02 -6.201999999999999874e-02 4.430000000000000049e-01
3.856670000000000237e-02 -6.230000000000000121e-02 4.450000000000000067e-01
4.311330000000000023e-02 -6.244000000000000244e-02 4.460000000000000075e-01
-1.060829999999999967e-01 -6.174999999999999933e-02 4.749999999999999778e-01
-1.011200000000000015e-01 -6.162000000000000116e-02 4.739999999999999769e-01
-9.597329999999999750e-02 -6.135999999999999788e-02 4.719999999999999751e-01
-9.086669999999999470e-02 -6.110000000000000153e-02 4.699999999999999734e-01
-8.598329999999999862e-02 -6.097000000000000336e-02 4.689999999999999725e-01
-8.111999999999999766e-02 -6.083999999999999825e-02 4.680000000000000271e-01
-7.611329999999999485e-02 -6.058000000000000190e-02 4.660000000000000253e-01
-7.084000000000000019e-02 -6.006000000000000227e-02 4.620000000000000218e-01
-6.579000000000000126e-02 -5.967000000000000082e-02 4.590000000000000191e-01
-6.079999999999999988e-02 -5.927999999999999936e-02 4.560000000000000164e-01
-5.611669999999999853e-02 -5.915000000000000119e-02 4.550000000000000155e-01
-5.145330000000000042e-02 -5.902000000000000302e-02 4.540000000000000147e-01
-4.660330000000000028e-02 -5.863000000000000156e-02 4.510000000000000120e-01
-4.181329999999999769e-02 -5.824000000000000010e-02 4.480000000000000093e-01
-3.708329999999999960e-02 -5.784999999999999865e-02 4.450000000000000067e-01
-3.255999999999999867e-02 -5.772000000000000047e-02 4.440000000000000058e-01
-2.805670000000000039e-02 -5.759000000000000230e-02 4.430000000000000049e-01
-2.351999999999999924e-02 -5.732999999999999902e-02 4.410000000000000031e-01
-1.902329999999999993e-02 -5.707000000000000267e-02 4.390000000000000013e-01
-1.460000000000000013e-02 -5.693999999999999756e-02 4.380000000000000004e-01
-1.021999999999999992e-02 -5.693999999999999756e-02 4.380000000000000004e-01
-5.826669999999999940e-03 -5.680999999999999939e-02 4.369999999999999996e-01
-1.456669999999999970e-03 -5.680999999999999939e-02 4.369999999999999996e-01
2.913329999999999999e-03 -5.680999999999999939e-02 4.369999999999999996e-01
7.283330000000000186e-03 -5.680999999999999939e-02 4.369999999999999996e-01
1.167999999999999941e-02 -5.693999999999999756e-02 4.380000000000000004e-01
1.606000000000000136e-02 -5.693999999999999756e-02 4.380000000000000004e-01
2.048670000000000005e-02 -5.707000000000000267e-02 4.390000000000000013e-01
2.493329999999999852e-02 -5.720000000000000084e-02 4.400000000000000022e-01
-1.047430000000000028e-01 -5.627999999999999670e-02 4.689999999999999725e-01
-1.002669999999999950e-01 -5.639999999999999875e-02 4.699999999999999734e-01
-9.536329999999999807e-02 -5.627999999999999670e-02 4.689999999999999725e-01
-9.048000000000000487e-02 -5.616000000000000159e-02 4.680000000000000271e-01
-8.543330000000000368e-02 -5.591999999999999749e-02 4.660000000000000253e-01
-8.042670000000000374e-02 -5.568000000000000033e-02 4.640000000000000235e-01
-7.545999999999999930e-02 -5.544000000000000317e-02 4.620000000000000218e-01
-7.037999999999999812e-02 -5.507999999999999702e-02 4.590000000000000191e-01
-6.536000000000000143e-02 -5.471999999999999781e-02 4.560000000000000164e-01
-6.053329999999999822e-02 -5.448000000000000065e-02 4.540000000000000147e-01
-5.574670000000000319e-02 -5.423999999999999655e-02 4.520000000000000129e-01
-5.077330000000000038e-02 -5.376000000000000223e-02 4.480000000000000093e-01
-4.608670000000000128e-02 -5.351999999999999813e-02 4.460000000000000075e-01
-4.153330000000000216e-02 -5.340000000000000302e-02 4.450000000000000067e-01
-3.699999999999999817e-02 -5.328000000000000097e-02 4.440000000000000058e-01
-3.241329999999999906e-02 -5.303999999999999687e-02 4.420000000000000040e-01
-2.786670000000000119e-02 -5.279999999999999971e-02 4.400000000000000022e-01
-2.341330000000000147e-02 -5.267999999999999766e-02 4.390000000000000013e-01
-1.898000000000000034e-02 -5.256000000000000255e-02 4.380000000000000004e-01
-1.456670000000000013e-02 -5.244000000000000050e-02 4.369999999999999996e-01
-1.019669999999999951e-02 -5.244000000000000050e-02 4.369999999999999996e-01
-5.826669999999999940e-03 -5.244000000000000050e-02 4.369999999999999996e-01
-1.453330000000000073e-03 -5.231999999999999845e-02 4.359999999999999987e-01
2.906670000000000087e-03 -5.231999999999999845e-02 4.359999999999999987e-01
7.250000000000000368e-03 -5.220000000000000334e-02 4.349999999999999978e-01
1.162670000000000023e-02 -5.231999999999999845e-02 4.359999999999999987e-01
1.598669999999999952e-02 -5.231999999999999845e-02 4.359999999999999987e-01
2.039329999999999962e-02 -5.244000000000000050e-02 4.369999999999999996e-01
-9.983999999999999819e-02 -5.147999999999999798e-02 4.680000000000000271e-01
-9.515999999999999459e-02 -5.147999999999999798e-02 4.680000000000000271e-01
-9.009330000000000116e-02 -5.126000000000000001e-02 4.660000000000000253e-01
-8.488329999999999487e-02 -5.093000000000000305e-02 4.630000000000000226e-01
-8.007999999999999841e-02 -5.081999999999999712e-02 4.620000000000000218e-01
-7.496999999999999498e-02 -5.049000000000000016e-02 4.590000000000000191e-01
-7.007330000000000503e-02 -5.027000000000000218e-02 4.570000000000000173e-01
-6.507330000000000059e-02 -4.993999999999999828e-02 4.540000000000000147e-01
-6.013330000000000064e-02 -4.961000000000000132e-02 4.510000000000000120e-01
-5.525329999999999825e-02 -4.927999999999999742e-02 4.480000000000000093e-01
-5.054669999999999996e-02 -4.905999999999999944e-02 4.460000000000000075e-01
-4.587999999999999717e-02 -4.884000000000000147e-02 4.440000000000000058e-01
-4.134670000000000012e-02 -4.873000000000000248e-02 4.430000000000000049e-01
-3.683329999999999937e-02 -4.861999999999999655e-02 4.420000000000000040e-01
-3.219330000000000108e-02 -4.828999999999999959e-02 4.390000000000000013e-01
-2.774000000000000077e-02 -4.818000000000000060e-02 4.380000000000000004e-01
-2.325330000000000105e-02 -4.796000000000000263e-02 4.359999999999999987e-01
-1.889329999999999829e-02 -4.796000000000000263e-02 4.359999999999999987e-01
-1.456670000000000013e-02 -4.807000000000000162e-02 4.369999999999999996e-01
-1.019669999999999951e-02 -4.807000000000000162e-02 4.369999999999999996e-01
-5.826669999999999940e-03 -4.807000000000000162e-02 4.369999999999999996e-01
-1.453330000000000073e-03 -4.796000000000000263e-02 4.359999999999999987e-01
2.899999999999999800e-03 -4.784999999999999670e-02 4.349999999999999978e-01
7.250000000000000368e-03 -4.784999999999999670e-02 4.349999999999999978e-01
1.159999999999999920e-02 -4.784999999999999670e-02 4.349999999999999978e-01
1.598669999999999952e-02 -4.796000000000000263e-02 4.359999999999999987e-01
-9.941329999999999611e-02 -4.660000000000000253e-02 4.660000000000000253e-01
-9.475329999999999864e-02 -4.660000000000000253e-02 4.660000000000000253e-01
-8.970670000000000033e-02 -4.639999999999999680e-02 4.640000000000000235e-01
-8.469999999999999751e-02 -4.619999999999999801e-02 4.620000000000000218e-01
-7.973329999999999307e-02 -4.599999999999999922e-02 4.600000000000000200e-01
-7.464329999999999576e-02 -4.569999999999999757e-02 4.570000000000000173e-01
-6.976670000000000094e-02 -4.549999999999999878e-02 4.550000000000000155e-01
-6.478670000000000262e-02 -4.519999999999999712e-02 4.520000000000000129e-01
-5.986670000000000186e-02 -4.490000000000000241e-02 4.490000000000000102e-01
-5.525329999999999825e-02 -4.479999999999999954e-02 4.480000000000000093e-01
-5.043330000000000035e-02 -4.449999999999999789e-02 4.450000000000000067e-01
-4.577669999999999656e-02 -4.429999999999999910e-02 4.430000000000000049e-01
-4.116000000000000214e-02 -4.410000000000000031e-02 4.410000000000000031e-01
-3.666670000000000346e-02 -4.399999999999999745e-02 4.400000000000000022e-01
-3.212000000000000272e-02 -4.379999999999999866e-02 4.380000000000000004e-01
-2.761330000000000034e-02 -4.359999999999999987e-02 4.359999999999999987e-01
-2.314669999999999922e-02 -4.340000000000000108e-02 4.339999999999999969e-01
-1.880669999999999911e-02 -4.340000000000000108e-02 4.339999999999999969e-01
-1.446670000000000074e-02 -4.340000000000000108e-02 4.339999999999999969e-01
-1.017329999999999970e-02 -4.359999999999999987e-02 4.359999999999999987e-01
-5.839999999999999705e-03 -4.379999999999999866e-02 4.380000000000000004e-01
-1.453330000000000073e-03 -4.359999999999999987e-02 4.359999999999999987e-01
2.899999999999999800e-03 -4.349999999999999700e-02 4.349999999999999978e-01
7.233329999999999621e-03 -4.340000000000000108e-02 4.339999999999999969e-01
1.157329999999999991e-02 -4.340000000000000108e-02 4.339999999999999969e-01
1.594999999999999890e-02 -4.349999999999999700e-02 4.349999999999999978e-01
-9.393999999999999573e-02 -4.157999999999999891e-02 4.620000000000000218e-01
-8.931999999999999662e-02 -4.157999999999999891e-02 4.620000000000000218e-01
-8.433329999999999993e-02 -4.139999999999999930e-02 4.600000000000000200e-01
-7.938670000000000448e-02 -4.121999999999999970e-02 4.580000000000000182e-01
-7.448000000000000453e-02 -4.104000000000000009e-02 4.560000000000000164e-01
-6.945999999999999397e-02 -4.077000000000000068e-02 4.530000000000000138e-01
-6.464330000000000076e-02 -4.059000000000000108e-02 4.510000000000000120e-01
-5.986670000000000186e-02 -4.041000000000000147e-02 4.490000000000000102e-01
-5.512999999999999845e-02 -4.023000000000000187e-02 4.470000000000000084e-01
-5.043330000000000035e-02 -4.005000000000000226e-02 4.450000000000000067e-01
-4.577669999999999656e-02 -3.987000000000000266e-02 4.430000000000000049e-01
-4.116000000000000214e-02 -3.969000000000000306e-02 4.410000000000000031e-01
-3.666670000000000346e-02 -3.960000000000000325e-02 4.400000000000000022e-01
-3.212000000000000272e-02 -3.941999999999999671e-02 4.380000000000000004e-01
-2.755000000000000157e-02 -3.914999999999999730e-02 4.349999999999999978e-01
-2.314669999999999922e-02 -3.905999999999999750e-02 4.339999999999999969e-01
-1.884999999999999870e-02 -3.914999999999999730e-02 4.349999999999999978e-01
-1.446670000000000074e-02 -3.905999999999999750e-02 4.339999999999999969e-01
-5.826669999999999940e-03 -3.932999999999999691e-02 4.369999999999999996e-01
-1.453330000000000073e-03 -3.923999999999999710e-02 4.359999999999999987e-01
2.906670000000000087e-03 -3.923999999999999710e-02 4.359999999999999987e-01
7.250000000000000368e-03 -3.914999999999999730e-02 4.349999999999999978e-01
1.159999999999999920e-02 -3.914999999999999730e-02 4.349999999999999978e-01
1.594999999999999890e-02 -3.914999999999999730e-02 4.349999999999999978e-01
-9.414329999999999921e-02 -3.703999999999999654e-02 4.630000000000000226e-01
-8.931999999999999662e-02 -3.695999999999999980e-02 4.620000000000000218e-01
-8.396670000000000522e-02 -3.663999999999999896e-02 4.580000000000000182e-01
-7.903999999999999915e-02 -3.647999999999999854e-02 4.560000000000000164e-01
-7.448000000000000453e-02 -3.647999999999999854e-02 4.560000000000000164e-01
-6.945999999999999397e-02 -3.624000000000000138e-02 4.530000000000000138e-01
-6.450000000000000178e-02 -3.599999999999999728e-02 4.500000000000000111e-01
-5.933329999999999854e-02 -3.559999999999999970e-02 4.450000000000000067e-01
-5.476000000000000312e-02 -3.552000000000000296e-02 4.440000000000000058e-01
-5.031999999999999668e-02 -3.552000000000000296e-02 4.440000000000000058e-01
-4.556999999999999940e-02 -3.527999999999999886e-02 4.410000000000000031e-01
-4.106669999999999765e-02 -3.520000000000000212e-02 4.400000000000000022e-01
-3.658329999999999915e-02 -3.511999999999999844e-02 4.390000000000000013e-01
-3.212000000000000272e-02 -3.504000000000000170e-02 4.380000000000000004e-01
-2.761330000000000034e-02 -3.488000000000000128e-02 4.359999999999999987e-01
-2.319999999999999840e-02 -3.479999999999999760e-02 4.349999999999999978e-01
-1.889329999999999829e-02 -3.488000000000000128e-02 4.359999999999999987e-01
-1.459999999999999926e-03 -3.504000000000000170e-02 4.380000000000000004e-01
2.919999999999999853e-03 -3.504000000000000170e-02 4.380000000000000004e-01
7.283330000000000186e-03 -3.495999999999999802e-02 4.369999999999999996e-01
1.159999999999999920e-02 -3.479999999999999760e-02 4.349999999999999978e-01
1.591329999999999828e-02 -3.472000000000000086e-02 4.339999999999999969e-01
-9.393999999999999573e-02 -3.234000000000000069e-02 4.620000000000000218e-01
-8.893330000000000679e-02 -3.219999999999999946e-02 4.600000000000000200e-01
-8.396670000000000522e-02 -3.205999999999999822e-02 4.580000000000000182e-01
-7.903999999999999915e-02 -3.191999999999999699e-02 4.560000000000000164e-01
-7.415330000000000532e-02 -3.178000000000000269e-02 4.540000000000000147e-01
-6.915330000000000088e-02 -3.157000000000000084e-02 4.510000000000000120e-01
-6.421330000000000093e-02 -3.135999999999999899e-02 4.480000000000000093e-01
-5.906669999999999976e-02 -3.100999999999999937e-02 4.430000000000000049e-01
-5.451330000000000064e-02 -3.093999999999999875e-02 4.420000000000000040e-01
-5.009330000000000033e-02 -3.093999999999999875e-02 4.420000000000000040e-01
-4.546669999999999878e-02 -3.080000000000000099e-02 4.400000000000000022e-01
-4.106669999999999765e-02 -3.080000000000000099e-02 4.400000000000000022e-01
-3.658329999999999915e-02 -3.073000000000000037e-02 4.390000000000000013e-01
-3.234000000000000069e-02 -3.087000000000000161e-02 4.410000000000000031e-01
-2.780329999999999954e-02 -3.073000000000000037e-02 4.390000000000000013e-01
-2.325330000000000105e-02 -3.051999999999999852e-02 4.359999999999999987e-01
2.926670000000000139e-03 -3.073000000000000037e-02 4.390000000000000013e-01
7.283330000000000186e-03 -3.058999999999999914e-02 4.369999999999999996e-01
1.157329999999999991e-02 -3.038000000000000075e-02 4.339999999999999969e-01
1.591329999999999828e-02 -3.038000000000000075e-02 4.339999999999999969e-01
-8.893330000000000679e-02 -2.759999999999999953e-02 4.600000000000000200e-01
-8.415000000000000258e-02 -2.753999999999999851e-02 4.590000000000000191e-01
-7.921330000000000038e-02 -2.741999999999999993e-02 4.570000000000000173e-01
-7.415330000000000532e-02 -2.724000000000000032e-02 4.540000000000000147e-01
-6.915330000000000088e-02 -2.706000000000000072e-02 4.510000000000000120e-01
-6.435670000000000279e-02 -2.693999999999999867e-02 4.490000000000000102e-01
-5.933329999999999854e-02 -2.670000000000000151e-02 4.450000000000000067e-01
-5.463670000000000332e-02 -2.657999999999999946e-02 4.430000000000000049e-01
-4.997999999999999665e-02 -2.646000000000000088e-02 4.410000000000000031e-01
-4.546669999999999878e-02 -2.639999999999999986e-02 4.400000000000000022e-01
-4.106669999999999765e-02 -2.639999999999999986e-02 4.400000000000000022e-01
-3.666670000000000346e-02 -2.639999999999999986e-02 4.400000000000000022e-01
-3.212000000000000272e-02 -2.628000000000000128e-02 4.380000000000000004e-01
-1.439999999999999961e-02 -2.591999999999999860e-02 4.319999999999999951e-01
7.266670000000000247e-03 -2.615999999999999923e-02 4.359999999999999987e-01
1.159999999999999920e-02 -2.610000000000000167e-02 4.349999999999999978e-01
1.591329999999999828e-02 -2.604000000000000065e-02 4.339999999999999969e-01
2.020670000000000105e-02 -2.597999999999999962e-02 4.329999999999999960e-01
-8.359999999999999376e-02 -2.280000000000000082e-02 4.560000000000000164e-01
-7.886669999999999792e-02 -2.274999999999999939e-02 4.550000000000000155e-01
-7.382669999999999511e-02 -2.259999999999999856e-02 4.520000000000000129e-01
-6.900000000000000577e-02 -2.249999999999999917e-02 4.500000000000000111e-01
-6.421330000000000093e-02 -2.239999999999999977e-02 4.480000000000000093e-01
-5.946669999999999734e-02 -2.230000000000000038e-02 4.460000000000000075e-01
-5.476000000000000312e-02 -2.220000000000000098e-02 4.440000000000000058e-01
-5.020669999999999994e-02 -2.214999999999999955e-02 4.430000000000000049e-01
-4.546669999999999878e-02 -2.199999999999999872e-02 4.400000000000000022e-01
-4.097329999999999722e-02 -2.195000000000000076e-02 4.390000000000000013e-01
-3.649999999999999772e-02 -2.189999999999999933e-02 4.380000000000000004e-01
-3.189999999999999780e-02 -2.174999999999999850e-02 4.349999999999999978e-01
-1.436669999999999961e-02 -2.154999999999999971e-02 4.309999999999999942e-01
-1.008000000000000042e-02 -2.160000000000000114e-02 4.319999999999999951e-01
1.159999999999999920e-02 -2.174999999999999850e-02 4.349999999999999978e-01
1.594999999999999890e-02 -2.174999999999999850e-02 4.349999999999999978e-01
2.020670000000000105e-02 -2.164999999999999911e-02 4.329999999999999960e-01
-8.341669999999999641e-02 -1.820000000000000090e-02 4.550000000000000155e-01
-7.869329999999999381e-02 -1.815999999999999906e-02 4.540000000000000147e-01
-7.382669999999999511e-02 -1.807999999999999885e-02 4.520000000000000129e-01
-6.900000000000000577e-02 -1.799999999999999864e-02 4.500000000000000111e-01
-6.421330000000000093e-02 -1.791999999999999843e-02 4.480000000000000093e-01
-5.960000000000000020e-02 -1.788000000000000006e-02 4.470000000000000084e-01
-5.476000000000000312e-02 -1.776000000000000148e-02 4.440000000000000058e-01
-5.031999999999999668e-02 -1.776000000000000148e-02 4.440000000000000058e-01
-4.567330000000000001e-02 -1.768000000000000127e-02 4.420000000000000040e-01
-4.116000000000000214e-02 -1.763999999999999943e-02 4.410000000000000031e-01
-3.658329999999999915e-02 -1.755999999999999922e-02 4.390000000000000013e-01
-3.212000000000000272e-02 -1.752000000000000085e-02 4.380000000000000004e-01
-2.767669999999999852e-02 -1.747999999999999901e-02 4.369999999999999996e-01
-1.880669999999999911e-02 -1.736000000000000043e-02 4.339999999999999969e-01
-1.443329999999999960e-02 -1.731999999999999859e-02 4.329999999999999960e-01
-1.008000000000000042e-02 -1.728000000000000022e-02 4.319999999999999951e-01
-5.773330000000000128e-03 -1.731999999999999859e-02 4.329999999999999960e-01
1.159999999999999920e-02 -1.739999999999999880e-02 4.349999999999999978e-01
1.594999999999999890e-02 -1.739999999999999880e-02 4.349999999999999978e-01
2.020670000000000105e-02 -1.731999999999999859e-02 4.329999999999999960e-01
2.453670000000000156e-02 -1.731999999999999859e-02 4.329999999999999960e-01
-7.869329999999999381e-02 -1.362000000000000016e-02 4.540000000000000147e-01
-7.382669999999999511e-02 -1.355999999999999914e-02 4.520000000000000129e-01
-6.930669999999999886e-02 -1.355999999999999914e-02 4.520000000000000129e-01
-6.464330000000000076e-02 -1.353000000000000036e-02 4.510000000000000120e-01
-6.013330000000000064e-02 -1.353000000000000036e-02 4.510000000000000120e-01
-5.599330000000000279e-02 -1.362000000000000016e-02 4.540000000000000147e-01
-4.567330000000000001e-02 -1.325999999999999922e-02 4.420000000000000040e-01
-4.125329999999999969e-02 -1.325999999999999922e-02 4.420000000000000040e-01
-3.666670000000000346e-02 -1.319999999999999993e-02 4.400000000000000022e-01
-3.219330000000000108e-02 -1.316999999999999942e-02 4.390000000000000013e-01
-2.774000000000000077e-02 -1.314000000000000064e-02 4.380000000000000004e-01
-2.330669999999999964e-02 -1.311000000000000013e-02 4.369999999999999996e-01
-1.889329999999999829e-02 -1.307999999999999961e-02 4.359999999999999987e-01
-1.450000000000000074e-02 -1.305000000000000084e-02 4.349999999999999978e-01
-1.012670000000000063e-02 -1.302000000000000032e-02 4.339999999999999969e-01
-5.786669999999999835e-03 -1.302000000000000032e-02 4.339999999999999969e-01
-1.440000000000000091e-03 -1.295999999999999930e-02 4.319999999999999951e-01
2.880000000000000181e-03 -1.295999999999999930e-02 4.319999999999999951e-01
2.879999999999999921e-02 -1.295999999999999930e-02 4.319999999999999951e-01
-7.399000000000000021e-02 -9.060000000000000345e-03 4.530000000000000138e-01
-6.930669999999999886e-02 -9.039999999999999425e-03 4.520000000000000129e-01
-6.493000000000000160e-02 -9.060000000000000345e-03 4.530000000000000138e-01
-6.053329999999999822e-02 -9.079999999999999530e-03 4.540000000000000147e-01
-5.587000000000000299e-02 -9.060000000000000345e-03 4.530000000000000138e-01
-5.077330000000000038e-02 -8.959999999999999215e-03 4.480000000000000093e-01
-4.598329999999999779e-02 -8.899999999999999925e-03 4.450000000000000067e-01
-4.134670000000000012e-02 -8.859999999999999820e-03 4.430000000000000049e-01
-3.674999999999999795e-02 -8.819999999999999715e-03 4.410000000000000031e-01
-3.219330000000000108e-02 -8.779999999999999610e-03 4.390000000000000013e-01
-2.774000000000000077e-02 -8.760000000000000425e-03 4.380000000000000004e-01
-2.335999999999999882e-02 -8.760000000000000425e-03 4.380000000000000004e-01
-1.893670000000000075e-02 -8.739999999999999505e-03 4.369999999999999996e-01
-1.456670000000000013e-02 -8.739999999999999505e-03 4.369999999999999996e-01
-1.019669999999999951e-02 -8.739999999999999505e-03 4.369999999999999996e-01
-1.443330000000000047e-03 -8.659999999999999296e-03 4.329999999999999960e-01
2.880000000000000181e-03 -8.640000000000000110e-03 4.319999999999999951e-01
2.459329999999999850e-02 -8.680000000000000215e-03 4.339999999999999969e-01
2.893329999999999860e-02 -8.680000000000000215e-03 4.339999999999999969e-01
3.319670000000000259e-02 -8.659999999999999296e-03 4.329999999999999960e-01
3.752670000000000311e-02 -8.659999999999999296e-03 4.329999999999999960e-01
-6.961330000000000295e-02 -4.539999999999999765e-03 4.540000000000000147e-01
-6.507330000000000059e-02 -4.539999999999999765e-03 4.540000000000000147e-01
-6.040000000000000230e-02 -4.530000000000000172e-03 4.530000000000000138e-01
-5.537670000000000092e-02 -4.490000000000000067e-03 4.490000000000000102e-01
-5.065999999999999670e-02 -4.470000000000000015e-03 4.470000000000000084e-01
-4.608670000000000128e-02 -4.460000000000000422e-03 4.460000000000000075e-01
-4.143999999999999767e-02 -4.440000000000000370e-03 4.440000000000000058e-01
-3.683329999999999937e-02 -4.420000000000000318e-03 4.420000000000000040e-01
-3.234000000000000069e-02 -4.409999999999999858e-03 4.410000000000000031e-01
-2.786670000000000119e-02 -4.400000000000000265e-03 4.400000000000000022e-01
-2.341330000000000147e-02 -4.389999999999999805e-03 4.390000000000000013e-01
-1.898000000000000034e-02 -4.380000000000000213e-03 4.380000000000000004e-01
-1.463330000000000013e-02 -4.389999999999999805e-03 4.390000000000000013e-01
-1.024330000000000032e-02 -4.389999999999999805e-03 4.390000000000000013e-01
-5.839999999999999705e-03 -4.380000000000000213e-03 4.380000000000000004e-01
-1.449999999999999900e-03 -4.349999999999999700e-03 4.349999999999999978e-01
2.893329999999999947e-03 -4.340000000000000108e-03 4.339999999999999969e-01
7.216669999999999682e-03 -4.329999999999999648e-03 4.329999999999999960e-01
1.152000000000000073e-02 -4.320000000000000055e-03 4.319999999999999951e-01
1.587670000000000053e-02 -4.329999999999999648e-03 4.329999999999999960e-01
2.025329999999999839e-02 -4.340000000000000108e-03 4.339999999999999969e-01
2.459329999999999850e-02 -4.340000000000000108e-03 4.339999999999999969e-01
2.893329999999999860e-02 -4.340000000000000108e-03 4.339999999999999969e-01
3.327329999999999871e-02 -4.340000000000000108e-03 4.339999999999999969e-01
3.752670000000000311e-02 -4.329999999999999648e-03 4.329999999999999960e-01
4.185669999999999669e-02 -4.329999999999999648e-03 4.329999999999999960e-01
4.629330000000000250e-02 -4.340000000000000108e-03 4.339999999999999969e-01
5.063329999999999914e-02 -4.340000000000000108e-03 4.339999999999999969e-01
5.510000000000000314e-02 -4.349999999999999700e-03 4.349999999999999978e-01
5.945000000000000284e-02 -4.349999999999999700e-03 4.349999999999999978e-01
-6.564670000000000227e-02 0.000000000000000000e+00 4.580000000000000182e-01
-6.066669999999999702e-02 0.000000000000000000e+00 4.550000000000000155e-01
-5.574670000000000319e-02 0.000000000000000000e+00 4.520000000000000129e-01
-5.088669999999999999e-02 0.000000000000000000e+00 4.490000000000000102e-01
-4.629330000000000250e-02 0.000000000000000000e+00 4.480000000000000093e-01
-4.162670000000000259e-02 0.000000000000000000e+00 4.460000000000000075e-01
-3.699999999999999817e-02 0.000000000000000000e+00 4.440000000000000058e-01
-3.255999999999999867e-02 0.000000000000000000e+00 4.440000000000000058e-01
-2.805670000000000039e-02 0.000000000000000000e+00 4.430000000000000049e-01
-2.351999999999999924e-02 0.000000000000000000e+00 4.410000000000000031e-01
-1.906669999999999893e-02 0.000000000000000000e+00 4.400000000000000022e-01
-1.466669999999999953e-02 0.000000000000000000e+00 4.400000000000000022e-01
-1.026670000000000013e-02 0.000000000000000000e+00 4.400000000000000022e-01
-5.866670000000000045e-03 0.000000000000000000e+00 4.400000000000000022e-01
-1.453330000000000073e-03 0.000000000000000000e+00 4.359999999999999987e-01
2.899999999999999800e-03 0.000000000000000000e+00 4.349999999999999978e-01
7.233329999999999621e-03 0.000000000000000000e+00 4.339999999999999969e-01
1.152000000000000073e-02 0.000000000000000000e+00 4.319999999999999951e-01
1.587670000000000053e-02 0.000000000000000000e+00 4.329999999999999960e-01
2.025329999999999839e-02 0.000000000000000000e+00 4.339999999999999969e-01
2.459329999999999850e-02 0.000000000000000000e+00 4.339999999999999969e-01
2.893329999999999860e-02 0.000000000000000000e+00 4.339999999999999969e-01
3.327329999999999871e-02 0.000000000000000000e+00 4.339999999999999969e-01
3.761330000000000229e-02 0.000000000000000000e+00 4.339999999999999969e-01
4.204999999999999710e-02 0.000000000000000000e+00 4.349999999999999978e-01
4.650669999999999804e-02 0.000000000000000000e+00 4.359999999999999987e-01
5.098330000000000223e-02 0.000000000000000000e+00 4.369999999999999996e-01
5.573329999999999951e-02 0.000000000000000000e+00 4.400000000000000022e-01
5.999670000000000003e-02 0.000000000000000000e+00 4.390000000000000013e-01
6.409330000000000582e-02 0.000000000000000000e+00 4.369999999999999996e-01
-6.146669999999999912e-02 4.610000000000000382e-03 4.610000000000000209e-01
-5.636329999999999812e-02 4.570000000000000277e-03 4.570000000000000173e-01
-5.133999999999999675e-02 4.530000000000000172e-03 4.530000000000000138e-01
-4.660330000000000028e-02 4.510000000000000120e-03 4.510000000000000120e-01
-4.190669999999999812e-02 4.490000000000000067e-03 4.490000000000000102e-01
-3.733329999999999982e-02 4.479999999999999608e-03 4.480000000000000093e-01
-3.277999999999999664e-02 4.470000000000000015e-03 4.470000000000000084e-01
-2.824669999999999959e-02 4.460000000000000422e-03 4.460000000000000075e-01
-2.367999999999999966e-02 4.440000000000000370e-03 4.440000000000000058e-01
-1.915330000000000157e-02 4.420000000000000318e-03 4.420000000000000040e-01
-1.473329999999999952e-02 4.420000000000000318e-03 4.420000000000000040e-01
-1.029000000000000054e-02 4.409999999999999858e-03 4.410000000000000031e-01
-5.866670000000000045e-03 4.400000000000000265e-03 4.400000000000000022e-01
-1.456669999999999970e-03 4.369999999999999753e-03 4.369999999999999996e-01
2.906670000000000087e-03 4.360000000000000160e-03 4.359999999999999987e-01
7.250000000000000368e-03 4.349999999999999700e-03 4.349999999999999978e-01
1.157329999999999991e-02 4.340000000000000108e-03 4.339999999999999969e-01
1.591329999999999828e-02 4.340000000000000108e-03 4.339999999999999969e-01
2.029999999999999860e-02 4.349999999999999700e-03 4.349999999999999978e-01
2.464999999999999830e-02 4.349999999999999700e-03 4.349999999999999978e-01
2.893329999999999860e-02 4.340000000000000108e-03 4.339999999999999969e-01
3.334999999999999770e-02 4.349999999999999700e-03 4.349999999999999978e-01
3.778669999999999946e-02 4.360000000000000160e-03 4.359999999999999987e-01
4.214670000000000222e-02 4.360000000000000160e-03 4.359999999999999987e-01
4.671999999999999764e-02 4.380000000000000213e-03 4.380000000000000004e-01
5.145000000000000268e-02 4.409999999999999858e-03 4.410000000000000031e-01
5.649330000000000324e-02 4.460000000000000422e-03 4.460000000000000075e-01
6.081670000000000131e-02 4.449999999999999963e-03 4.450000000000000067e-01
6.511999999999999733e-02 4.440000000000000370e-03 4.440000000000000058e-01
-5.167999999999999677e-02 9.119999999999999635e-03 4.560000000000000164e-01
-4.691329999999999806e-02 9.079999999999999530e-03 4.540000000000000147e-01
-4.218670000000000059e-02 9.039999999999999425e-03 4.520000000000000129e-01
-3.758330000000000004e-02 9.020000000000000240e-03 4.510000000000000120e-01
-3.292670000000000319e-02 8.980000000000000135e-03 4.490000000000000102e-01
-2.837330000000000060e-02 8.959999999999999215e-03 4.480000000000000093e-01
-2.378670000000000090e-02 8.920000000000000845e-03 4.460000000000000075e-01
-1.919670000000000057e-02 8.859999999999999820e-03 4.430000000000000049e-01
-1.473329999999999952e-02 8.840000000000000635e-03 4.420000000000000040e-01
-1.029000000000000054e-02 8.819999999999999715e-03 4.410000000000000031e-01
-5.866670000000000045e-03 8.800000000000000530e-03 4.400000000000000022e-01
-1.463330000000000099e-03 8.779999999999999610e-03 4.390000000000000013e-01
2.919999999999999853e-03 8.760000000000000425e-03 4.380000000000000004e-01
7.283330000000000186e-03 8.739999999999999505e-03 4.369999999999999996e-01
1.162670000000000023e-02 8.720000000000000320e-03 4.359999999999999987e-01
1.594999999999999890e-02 8.699999999999999400e-03 4.349999999999999978e-01
2.029999999999999860e-02 8.699999999999999400e-03 4.349999999999999978e-01
2.470670000000000158e-02 8.720000000000000320e-03 4.359999999999999987e-01
2.906670000000000087e-02 8.720000000000000320e-03 4.359999999999999987e-01
3.350329999999999975e-02 8.739999999999999505e-03 4.369999999999999996e-01
3.787329999999999863e-02 8.739999999999999505e-03 4.369999999999999996e-01
4.224329999999999752e-02 8.739999999999999505e-03 4.369999999999999996e-01
4.703999999999999848e-02 8.819999999999999715e-03 4.410000000000000031e-01
5.191670000000000312e-02 8.899999999999999925e-03 4.450000000000000067e-01
5.649330000000000324e-02 8.920000000000000845e-03 4.460000000000000075e-01
6.095330000000000192e-02 8.920000000000000845e-03 4.460000000000000075e-01
6.526669999999999694e-02 8.899999999999999925e-03 4.450000000000000067e-01
-4.732669999999999932e-02 1.374000000000000048e-02 4.580000000000000182e-01
-4.256000000000000061e-02 1.367999999999999945e-02 4.560000000000000164e-01
-3.783330000000000026e-02 1.362000000000000016e-02 4.540000000000000147e-01
-3.321999999999999953e-02 1.358999999999999965e-02 4.530000000000000138e-01
-2.862670000000000145e-02 1.355999999999999914e-02 4.520000000000000129e-01
-2.400000000000000050e-02 1.349999999999999985e-02 4.500000000000000111e-01
-1.932669999999999874e-02 1.337999999999999953e-02 4.460000000000000075e-01
-1.480000000000000066e-02 1.332000000000000024e-02 4.440000000000000058e-01
-1.033670000000000075e-02 1.328999999999999973e-02 4.430000000000000049e-01
-5.879999999999999810e-03 1.323000000000000044e-02 4.410000000000000031e-01
-1.466669999999999996e-03 1.319999999999999993e-02 4.400000000000000022e-01
2.926670000000000139e-03 1.316999999999999942e-02 4.390000000000000013e-01
7.316669999999999945e-03 1.316999999999999942e-02 4.390000000000000013e-01
1.167999999999999941e-02 1.314000000000000064e-02 4.380000000000000004e-01
1.606000000000000136e-02 1.314000000000000064e-02 4.380000000000000004e-01
2.039329999999999962e-02 1.311000000000000013e-02 4.369999999999999996e-01
2.481999999999999831e-02 1.314000000000000064e-02 4.380000000000000004e-01
2.933329999999999965e-02 1.319999999999999993e-02 4.400000000000000022e-01
3.380999999999999978e-02 1.323000000000000044e-02 4.410000000000000031e-01
3.813330000000000192e-02 1.319999999999999993e-02 4.400000000000000022e-01
4.263000000000000123e-02 1.323000000000000044e-02 4.410000000000000031e-01
4.725329999999999808e-02 1.328999999999999973e-02 4.430000000000000049e-01
5.203329999999999761e-02 1.337999999999999953e-02 4.460000000000000075e-01
5.674669999999999714e-02 1.344000000000000056e-02 4.480000000000000093e-01
6.204670000000000324e-02 1.362000000000000016e-02 4.540000000000000147e-01
6.673329999999999540e-02 1.365000000000000067e-02 4.550000000000000155e-01
-4.256000000000000061e-02 1.823999999999999927e-02 4.560000000000000164e-01
-3.791669999999999763e-02 1.820000000000000090e-02 4.550000000000000155e-01
-3.336669999999999914e-02 1.820000000000000090e-02 4.550000000000000155e-01
-2.887999999999999942e-02 1.823999999999999927e-02 4.560000000000000164e-01
-2.437330000000000052e-02 1.828000000000000111e-02 4.570000000000000173e-01
-1.963000000000000161e-02 1.812000000000000069e-02 4.530000000000000138e-01
-1.493330000000000005e-02 1.791999999999999843e-02 4.480000000000000093e-01
-1.043000000000000003e-02 1.788000000000000006e-02 4.470000000000000084e-01
-5.933329999999999681e-03 1.779999999999999985e-02 4.450000000000000067e-01
-1.476670000000000023e-03 1.771999999999999964e-02 4.430000000000000049e-01
2.946670000000000192e-03 1.768000000000000127e-02 4.420000000000000040e-01
7.366669999999999642e-03 1.768000000000000127e-02 4.420000000000000040e-01
1.178670000000000065e-02 1.768000000000000127e-02 4.420000000000000040e-01
1.613329999999999972e-02 1.760000000000000106e-02 4.400000000000000022e-01
2.053330000000000086e-02 1.760000000000000106e-02 4.400000000000000022e-01
2.498999999999999833e-02 1.763999999999999943e-02 4.410000000000000031e-01
2.946669999999999845e-02 1.768000000000000127e-02 4.420000000000000040e-01
3.396330000000000182e-02 1.771999999999999964e-02 4.430000000000000049e-01
3.839329999999999826e-02 1.771999999999999964e-02 4.430000000000000049e-01
4.291999999999999982e-02 1.776000000000000148e-02 4.440000000000000058e-01
4.768000000000000016e-02 1.788000000000000006e-02 4.470000000000000084e-01
5.238330000000000070e-02 1.796000000000000027e-02 4.490000000000000102e-01
5.763329999999999842e-02 1.820000000000000090e-02 4.550000000000000155e-01
6.314000000000000168e-02 1.847999999999999990e-02 4.620000000000000218e-01
6.761330000000000118e-02 1.844000000000000153e-02 4.610000000000000209e-01
-3.774999999999999883e-02 2.264999999999999999e-02 4.530000000000000138e-01
-3.329329999999999790e-02 2.270000000000000143e-02 4.540000000000000147e-01
-2.881670000000000065e-02 2.274999999999999939e-02 4.550000000000000155e-01
-2.437330000000000052e-02 2.284999999999999878e-02 4.570000000000000173e-01
-1.971670000000000020e-02 2.274999999999999939e-02 4.550000000000000155e-01
-1.513330000000000057e-02 2.270000000000000143e-02 4.540000000000000147e-01
-1.056999999999999953e-02 2.264999999999999999e-02 4.530000000000000138e-01
-6.000000000000000125e-03 2.249999999999999917e-02 4.500000000000000111e-01
-1.490000000000000005e-03 2.234999999999999834e-02 4.470000000000000084e-01
2.973330000000000157e-03 2.230000000000000038e-02 4.460000000000000075e-01
7.433330000000000146e-03 2.230000000000000038e-02 4.460000000000000075e-01
1.189330000000000075e-02 2.230000000000000038e-02 4.460000000000000075e-01
1.631669999999999995e-02 2.224999999999999895e-02 4.450000000000000067e-01
2.071999999999999884e-02 2.220000000000000098e-02 4.440000000000000058e-01
2.515999999999999834e-02 2.220000000000000098e-02 4.440000000000000058e-01
2.973330000000000070e-02 2.230000000000000038e-02 4.460000000000000075e-01
3.419330000000000286e-02 2.230000000000000038e-02 4.460000000000000075e-01
3.873999999999999666e-02 2.234999999999999834e-02 4.470000000000000084e-01
4.340329999999999883e-02 2.245000000000000120e-02 4.490000000000000102e-01
4.832000000000000184e-02 2.264999999999999999e-02 4.530000000000000138e-01
5.343330000000000302e-02 2.290000000000000022e-02 4.580000000000000182e-01
5.839330000000000215e-02 2.305000000000000104e-02 4.610000000000000209e-01
6.396000000000000296e-02 2.340000000000000066e-02 4.680000000000000271e-01
-3.321999999999999953e-02 2.717999999999999930e-02 4.530000000000000138e-01
-2.869000000000000022e-02 2.717999999999999930e-02 4.530000000000000138e-01
-2.421330000000000010e-02 2.724000000000000032e-02 4.540000000000000147e-01
-1.975999999999999979e-02 2.735999999999999890e-02 4.560000000000000164e-01
-1.516669999999999997e-02 2.730000000000000135e-02 4.550000000000000155e-01
-1.061669999999999975e-02 2.730000000000000135e-02 4.550000000000000155e-01
-6.053329999999999995e-03 2.724000000000000032e-02 4.540000000000000147e-01
-1.506670000000000101e-03 2.711999999999999827e-02 4.520000000000000129e-01
3.006669999999999916e-03 2.706000000000000072e-02 4.510000000000000120e-01
7.499999999999999722e-03 2.699999999999999969e-02 4.500000000000000111e-01
1.200000000000000025e-02 2.699999999999999969e-02 4.500000000000000111e-01
1.642669999999999894e-02 2.688000000000000111e-02 4.480000000000000093e-01
2.090670000000000028e-02 2.688000000000000111e-02 4.480000000000000093e-01
2.538670000000000163e-02 2.688000000000000111e-02 4.480000000000000093e-01
2.993329999999999949e-02 2.693999999999999867e-02 4.490000000000000102e-01
3.450000000000000289e-02 2.699999999999999969e-02 4.500000000000000111e-01
3.908670000000000200e-02 2.706000000000000072e-02 4.510000000000000120e-01
4.369329999999999742e-02 2.711999999999999827e-02 4.520000000000000129e-01
4.864000000000000268e-02 2.735999999999999890e-02 4.560000000000000164e-01
5.401670000000000083e-02 2.777999999999999914e-02 4.630000000000000226e-01
5.940669999999999978e-02 2.813999999999999835e-02 4.689999999999999725e-01
-2.405329999999999968e-02 3.157000000000000084e-02 4.510000000000000120e-01
-1.963000000000000161e-02 3.171000000000000207e-02 4.530000000000000138e-01
-1.510000000000000057e-02 3.171000000000000207e-02 4.530000000000000138e-01
-1.059329999999999994e-02 3.178000000000000269e-02 4.540000000000000147e-01
-6.053329999999999995e-03 3.178000000000000269e-02 4.540000000000000147e-01
-1.516669999999999911e-03 3.185000000000000331e-02 4.550000000000000155e-01
3.026669999999999968e-03 3.178000000000000269e-02 4.540000000000000147e-01
7.550000000000000287e-03 3.171000000000000207e-02 4.530000000000000138e-01
1.210669999999999975e-02 3.178000000000000269e-02 4.540000000000000147e-01
1.664670000000000039e-02 3.178000000000000269e-02 4.540000000000000147e-01
2.118669999999999928e-02 3.178000000000000269e-02 4.540000000000000147e-01
2.578329999999999858e-02 3.185000000000000331e-02 4.550000000000000155e-01
3.039999999999999994e-02 3.191999999999999699e-02 4.560000000000000164e-01
3.503669999999999701e-02 3.198999999999999760e-02 4.570000000000000173e-01
3.978000000000000286e-02 3.212999999999999884e-02 4.590000000000000191e-01
4.456330000000000013e-02 3.227000000000000007e-02 4.610000000000000209e-01
4.949329999999999702e-02 3.248000000000000193e-02 4.640000000000000235e-01
5.483330000000000148e-02 3.289999999999999869e-02 4.699999999999999734e-01
-1.958669999999999856e-02 3.615999999999999770e-02 4.520000000000000129e-01
-1.506670000000000058e-02 3.615999999999999770e-02 4.520000000000000129e-01
-1.054670000000000087e-02 3.615999999999999770e-02 4.520000000000000129e-01
-6.026669999999999597e-03 3.615999999999999770e-02 4.520000000000000129e-01
-1.513330000000000014e-03 3.631999999999999812e-02 4.540000000000000147e-01
3.026669999999999968e-03 3.631999999999999812e-02 4.540000000000000147e-01
7.566670000000000167e-03 3.631999999999999812e-02 4.540000000000000147e-01
1.216000000000000067e-02 3.647999999999999854e-02 4.560000000000000164e-01
1.675669999999999937e-02 3.656000000000000222e-02 4.570000000000000173e-01
2.137330000000000133e-02 3.663999999999999896e-02 4.580000000000000182e-01
2.606670000000000167e-02 3.679999999999999938e-02 4.600000000000000200e-01
3.073330000000000159e-02 3.688000000000000306e-02 4.610000000000000209e-01
3.549669999999999909e-02 3.703999999999999654e-02 4.630000000000000226e-01
4.030000000000000249e-02 3.719999999999999696e-02 4.650000000000000244e-01
4.504670000000000202e-02 3.728000000000000064e-02 4.660000000000000253e-01
4.981329999999999786e-02 3.735999999999999738e-02 4.670000000000000262e-01
5.436669999999999697e-02 3.728000000000000064e-02 4.660000000000000253e-01
-1.510000000000000057e-02 4.077000000000000068e-02 4.530000000000000138e-01
-1.054670000000000087e-02 4.068000000000000088e-02 4.520000000000000129e-01
-6.026669999999999597e-03 4.068000000000000088e-02 4.520000000000000129e-01
-1.506670000000000101e-03 4.068000000000000088e-02 4.520000000000000129e-01
3.020000000000000115e-03 4.077000000000000068e-02 4.530000000000000138e-01
7.550000000000000287e-03 4.077000000000000068e-02 4.530000000000000138e-01
1.210669999999999975e-02 4.086000000000000049e-02 4.540000000000000147e-01
1.671999999999999875e-02 4.104000000000000009e-02 4.560000000000000164e-01
2.128000000000000030e-02 4.104000000000000009e-02 4.560000000000000164e-01
2.595329999999999859e-02 4.121999999999999970e-02 4.580000000000000182e-01
3.066670000000000160e-02 4.139999999999999930e-02 4.600000000000000200e-01
3.549669999999999909e-02 4.166999999999999871e-02 4.630000000000000226e-01
4.030000000000000249e-02 4.184999999999999831e-02 4.650000000000000244e-01
4.514329999999999732e-02 4.202999999999999792e-02 4.670000000000000262e-01
4.949329999999999702e-02 4.175999999999999851e-02 4.640000000000000235e-01
5.343330000000000302e-02 4.121999999999999970e-02 4.580000000000000182e-01
-1.047670000000000025e-02 4.490000000000000241e-02 4.490000000000000102e-01
-5.986670000000000359e-03 4.490000000000000241e-02 4.490000000000000102e-01
-1.500000000000000031e-03 4.499999999999999833e-02 4.500000000000000111e-01
3.013329999999999828e-03 4.519999999999999712e-02 4.520000000000000129e-01
7.533330000000000408e-03 4.519999999999999712e-02 4.520000000000000129e-01
1.205329999999999943e-02 4.519999999999999712e-02 4.520000000000000129e-01
1.664670000000000039e-02 4.540000000000000285e-02 4.540000000000000147e-01
2.123330000000000009e-02 4.549999999999999878e-02 4.550000000000000155e-01
2.589670000000000166e-02 4.569999999999999757e-02 4.570000000000000173e-01
3.059999999999999873e-02 4.590000000000000330e-02 4.590000000000000191e-01
3.542000000000000010e-02 4.619999999999999801e-02 4.620000000000000218e-01
4.012670000000000126e-02 4.630000000000000088e-02 4.630000000000000226e-01
4.485329999999999873e-02 4.639999999999999680e-02 4.640000000000000235e-01
4.917330000000000312e-02 4.610000000000000209e-02 4.610000000000000209e-01
5.343330000000000302e-02 4.580000000000000043e-02 4.580000000000000182e-01
-5.986670000000000359e-03 4.939000000000000334e-02 4.490000000000000102e-01
-1.500000000000000031e-03 4.950000000000000233e-02 4.500000000000000111e-01
3.000000000000000062e-03 4.950000000000000233e-02 4.500000000000000111e-01
7.533330000000000408e-03 4.972000000000000031e-02 4.520000000000000129e-01
1.205329999999999943e-02 4.972000000000000031e-02 4.520000000000000129e-01
1.657329999999999914e-02 4.972000000000000031e-02 4.520000000000000129e-01
2.118669999999999928e-02 4.993999999999999828e-02 4.540000000000000147e-01
2.578329999999999858e-02 5.004999999999999727e-02 4.550000000000000155e-01
3.046669999999999934e-02 5.027000000000000218e-02 4.570000000000000173e-01
3.534330000000000110e-02 5.070999999999999813e-02 4.610000000000000209e-01
4.003999999999999920e-02 5.081999999999999712e-02 4.620000000000000218e-01
4.436999999999999972e-02 5.049000000000000016e-02 4.590000000000000191e-01
4.853330000000000144e-02 5.004999999999999727e-02 4.550000000000000155e-01
-1.496670000000000075e-03 5.387999999999999734e-02 4.490000000000000102e-01
2.993330000000000209e-03 5.387999999999999734e-02 4.490000000000000102e-01
7.516669999999999602e-03 5.412000000000000144e-02 4.510000000000000120e-01
1.205329999999999943e-02 5.423999999999999655e-02 4.520000000000000129e-01
1.657329999999999914e-02 5.423999999999999655e-02 4.520000000000000129e-01
2.118669999999999928e-02 5.448000000000000065e-02 4.540000000000000147e-01
2.578329999999999858e-02 5.460000000000000270e-02 4.550000000000000155e-01
3.039999999999999994e-02 5.471999999999999781e-02 4.560000000000000164e-01
3.511330000000000007e-02 5.496000000000000191e-02 4.580000000000000182e-01
3.969330000000000080e-02 5.496000000000000191e-02 4.580000000000000182e-01
4.398330000000000295e-02 5.460000000000000270e-02 4.550000000000000155e-01
2.986669999999999863e-03 5.824000000000000010e-02 4.480000000000000093e-01
7.499999999999999722e-03 5.850000000000000339e-02 4.500000000000000111e-01
1.202669999999999954e-02 5.863000000000000156e-02 4.510000000000000120e-01
1.657329999999999914e-02 5.875999999999999973e-02 4.520000000000000129e-01
2.113999999999999907e-02 5.888999999999999790e-02 4.530000000000000138e-01
2.572670000000000165e-02 5.902000000000000302e-02 4.540000000000000147e-01
3.033330000000000054e-02 5.915000000000000119e-02 4.550000000000000155e-01
3.480670000000000291e-02 5.902000000000000302e-02 4.540000000000000147e-01
3.917330000000000118e-02 5.875999999999999973e-02 4.520000000000000129e-01
7.433330000000000146e-03 6.244000000000000244e-02 4.460000000000000075e-01
1.194669999999999933e-02 6.271999999999999797e-02 4.480000000000000093e-01
1.653670000000000140e-02 6.314000000000000168e-02 4.510000000000000120e-01
2.113999999999999907e-02 6.342000000000000415e-02 4.530000000000000138e-01
2.578329999999999858e-02 6.370000000000000662e-02 4.550000000000000155e-01
3.033330000000000054e-02 6.370000000000000662e-02 4.550000000000000155e-01
3.472999999999999698e-02 6.342000000000000415e-02 4.530000000000000138e-01
1.178670000000000065e-02 6.629999999999999782e-02 4.420000000000000040e-01
2.104670000000000152e-02 6.765000000000000180e-02 4.510000000000000120e-01
2.572670000000000165e-02 6.809999999999999387e-02 4.540000000000000147e-01
3.033330000000000054e-02 6.825000000000000511e-02 4.550000000000000155e-01
