-1.520000000000000084e-03 -1.094399999999999956e-01 4.560000000000000164e-01
3.086670000000000125e-03 -1.111199999999999966e-01 4.630000000000000226e-01
-1.510000000000000057e-02 -1.041900000000000048e-01 4.530000000000000138e-01
-1.068670000000000037e-02 -1.053400000000000031e-01 4.580000000000000182e-01
-6.173330000000000310e-03 -1.064900000000000013e-01 4.630000000000000226e-01
-1.566670000000000042e-03 -1.081000000000000016e-01 4.699999999999999734e-01
3.133330000000000143e-03 -1.081000000000000016e-01 4.699999999999999734e-01
7.766669999999999824e-03 -1.071799999999999975e-01 4.660000000000000253e-01
1.218669999999999996e-02 -1.051099999999999951e-01 4.570000000000000173e-01
1.653670000000000140e-02 -1.037300000000000028e-01 4.510000000000000120e-01
-2.432000000000000134e-02 -1.003200000000000064e-01 4.560000000000000164e-01
-2.001999999999999960e-02 -1.016399999999999942e-01 4.620000000000000218e-01
-1.549999999999999989e-02 -1.023000000000000020e-01 4.650000000000000244e-01
-1.085000000000000027e-02 -1.023000000000000020e-01 4.650000000000000244e-01
-6.213330000000000415e-03 -1.025200000000000000e-01 4.660000000000000253e-01
-1.553329999999999902e-03 -1.025200000000000000e-01 4.660000000000000253e-01
3.106670000000000178e-03 -1.025200000000000000e-01 4.660000000000000253e-01
7.766669999999999824e-03 -1.025200000000000000e-01 4.660000000000000253e-01
1.242670000000000059e-02 -1.025200000000000000e-01 4.660000000000000253e-01
1.701329999999999856e-02 -1.020800000000000041e-01 4.640000000000000235e-01
2.151329999999999909e-02 -1.014199999999999963e-01 4.610000000000000209e-01
-2.932330000000000006e-02 -9.722999999999999698e-02 4.630000000000000226e-01
-2.485329999999999831e-02 -9.786000000000000254e-02 4.660000000000000253e-01
-2.023669999999999983e-02 -9.807000000000000439e-02 4.670000000000000262e-01
-1.553329999999999989e-02 -9.786000000000000254e-02 4.660000000000000253e-01
-1.085000000000000027e-02 -9.765000000000000069e-02 4.650000000000000244e-01
-6.186670000000000016e-03 -9.743999999999999884e-02 4.640000000000000235e-01
-1.546669999999999989e-03 -9.743999999999999884e-02 4.640000000000000235e-01
3.093330000000000038e-03 -9.743999999999999884e-02 4.640000000000000235e-01
7.733330000000000065e-03 -9.743999999999999884e-02 4.640000000000000235e-01
1.237330000000000027e-02 -9.743999999999999884e-02 4.640000000000000235e-01
1.697670000000000082e-02 -9.722999999999999698e-02 4.630000000000000226e-01
2.155999999999999930e-02 -9.701999999999999513e-02 4.620000000000000218e-01
2.600999999999999840e-02 -9.639000000000000346e-02 4.590000000000000191e-01
3.046669999999999934e-02 -9.596999999999999975e-02 4.570000000000000173e-01
-3.883330000000000115e-02 -9.320000000000000506e-02 4.660000000000000253e-01
-3.409999999999999837e-02 -9.299999999999999933e-02 4.650000000000000244e-01
-2.938670000000000171e-02 -9.279999999999999361e-02 4.640000000000000235e-01
-2.474669999999999995e-02 -9.279999999999999361e-02 4.640000000000000235e-01
-2.006329999999999919e-02 -9.260000000000000175e-02 4.630000000000000226e-01
-1.543330000000000049e-02 -9.260000000000000175e-02 4.630000000000000226e-01
-1.080330000000000006e-02 -9.260000000000000175e-02 4.630000000000000226e-01
-6.159999999999999677e-03 -9.239999999999999603e-02 4.620000000000000218e-01
-1.539999999999999919e-03 -9.239999999999999603e-02 4.620000000000000218e-01
3.079999999999999839e-03 -9.239999999999999603e-02 4.620000000000000218e-01
7.700000000000000247e-03 -9.239999999999999603e-02 4.620000000000000218e-01
1.229330000000000006e-02 -9.220000000000000417e-02 4.610000000000000209e-01
1.686669999999999836e-02 -9.199999999999999845e-02 4.600000000000000200e-01
2.151329999999999909e-02 -9.220000000000000417e-02 4.610000000000000209e-01
2.606670000000000167e-02 -9.199999999999999845e-02 4.600000000000000200e-01
3.046669999999999934e-02 -9.139999999999999514e-02 4.570000000000000173e-01
3.472999999999999698e-02 -9.059999999999999998e-02 4.530000000000000138e-01
-5.796670000000000295e-02 -8.930000000000000437e-02 4.699999999999999734e-01
-5.326670000000000016e-02 -8.930000000000000437e-02 4.699999999999999734e-01
-4.846330000000000082e-02 -8.910999999999999477e-02 4.689999999999999725e-01
-4.330669999999999659e-02 -8.816000000000000225e-02 4.640000000000000235e-01
-3.883330000000000115e-02 -8.853999999999999371e-02 4.660000000000000253e-01
-3.402670000000000000e-02 -8.816000000000000225e-02 4.640000000000000235e-01
-2.932330000000000006e-02 -8.797000000000000652e-02 4.630000000000000226e-01
-2.463999999999999871e-02 -8.777999999999999692e-02 4.620000000000000218e-01
-1.997670000000000001e-02 -8.759000000000000119e-02 4.610000000000000209e-01
-1.536670000000000050e-02 -8.759000000000000119e-02 4.610000000000000209e-01
-1.073329999999999944e-02 -8.740000000000000546e-02 4.600000000000000200e-01
-6.119999999999999572e-03 -8.720999999999999586e-02 4.590000000000000191e-01
-1.529999999999999893e-03 -8.720999999999999586e-02 4.590000000000000191e-01
3.059999999999999786e-03 -8.720999999999999586e-02 4.590000000000000191e-01
7.666670000000000429e-03 -8.740000000000000546e-02 4.600000000000000200e-01
1.226670000000000017e-02 -8.740000000000000546e-02 4.600000000000000200e-01
1.683000000000000121e-02 -8.720999999999999586e-02 4.590000000000000191e-01
2.142000000000000154e-02 -8.720999999999999586e-02 4.590000000000000191e-01
2.600999999999999840e-02 -8.720999999999999586e-02 4.590000000000000191e-01
3.053329999999999933e-02 -8.702000000000000013e-02 4.580000000000000182e-01
3.480670000000000291e-02 -8.626000000000000334e-02 4.540000000000000147e-01
3.848000000000000032e-02 -8.436000000000000443e-02 4.440000000000000058e-01
-6.794000000000000039e-02 -8.531999999999999307e-02 4.739999999999999769e-01
-6.293329999999999758e-02 -8.495999999999999386e-02 4.719999999999999751e-01
-5.821330000000000254e-02 -8.495999999999999386e-02 4.719999999999999751e-01
-5.349330000000000057e-02 -8.495999999999999386e-02 4.719999999999999751e-01
-4.846330000000000082e-02 -8.441999999999999504e-02 4.689999999999999725e-01
-4.340000000000000108e-02 -8.369999999999999662e-02 4.650000000000000244e-01
-3.866669999999999829e-02 -8.351999999999999702e-02 4.640000000000000235e-01
-3.388000000000000039e-02 -8.315999999999999781e-02 4.620000000000000218e-01
-2.919669999999999904e-02 -8.297999999999999821e-02 4.610000000000000209e-01
-2.458669999999999953e-02 -8.297999999999999821e-02 4.610000000000000209e-01
-1.993330000000000102e-02 -8.279999999999999860e-02 4.600000000000000200e-01
-1.529999999999999936e-02 -8.261999999999999900e-02 4.590000000000000191e-01
-1.068670000000000037e-02 -8.243999999999999939e-02 4.580000000000000182e-01
-6.093330000000000100e-03 -8.225999999999999979e-02 4.570000000000000173e-01
-1.520000000000000084e-03 -8.208000000000000018e-02 4.560000000000000164e-01
3.040000000000000167e-03 -8.208000000000000018e-02 4.560000000000000164e-01
7.616669999999999864e-03 -8.225999999999999979e-02 4.570000000000000173e-01
1.216000000000000067e-02 -8.208000000000000018e-02 4.560000000000000164e-01
1.671999999999999875e-02 -8.208000000000000018e-02 4.560000000000000164e-01
2.132670000000000052e-02 -8.225999999999999979e-02 4.570000000000000173e-01
2.589670000000000166e-02 -8.225999999999999979e-02 4.570000000000000173e-01
3.046669999999999934e-02 -8.225999999999999979e-02 4.570000000000000173e-01
3.488329999999999903e-02 -8.190000000000000058e-02 4.550000000000000155e-01
3.865330000000000155e-02 -8.028000000000000413e-02 4.460000000000000075e-01
4.234000000000000263e-02 -7.883999999999999342e-02 4.380000000000000004e-01
-6.779670000000000141e-02 -8.040999999999999537e-02 4.729999999999999760e-01
-6.279999999999999472e-02 -8.007000000000000228e-02 4.709999999999999742e-01
-5.796670000000000295e-02 -7.989999999999999880e-02 4.699999999999999734e-01
-5.315330000000000055e-02 -7.972999999999999532e-02 4.689999999999999725e-01
-4.805000000000000243e-02 -7.904999999999999527e-02 4.650000000000000244e-01
-4.321330000000000310e-02 -7.871000000000000218e-02 4.630000000000000226e-01
-3.849999999999999950e-02 -7.853999999999999870e-02 4.620000000000000218e-01
-3.380670000000000203e-02 -7.836999999999999522e-02 4.610000000000000209e-01
-2.906999999999999862e-02 -7.803000000000000214e-02 4.590000000000000191e-01
-2.447999999999999829e-02 -7.803000000000000214e-02 4.590000000000000191e-01
-1.984669999999999837e-02 -7.785999999999999865e-02 4.580000000000000182e-01
-1.523329999999999997e-02 -7.768999999999999517e-02 4.570000000000000173e-01
-1.064000000000000015e-02 -7.752000000000000557e-02 4.560000000000000164e-01
-6.080000000000000335e-03 -7.752000000000000557e-02 4.560000000000000164e-01
-1.513330000000000014e-03 -7.717999999999999861e-02 4.540000000000000147e-01
3.026669999999999968e-03 -7.717999999999999861e-02 4.540000000000000147e-01
7.566670000000000167e-03 -7.717999999999999861e-02 4.540000000000000147e-01
1.213329999999999964e-02 -7.735000000000000209e-02 4.550000000000000155e-01
1.671999999999999875e-02 -7.752000000000000557e-02 4.560000000000000164e-01
2.132670000000000052e-02 -7.768999999999999517e-02 4.570000000000000173e-01
2.589670000000000166e-02 -7.768999999999999517e-02 4.570000000000000173e-01
3.053329999999999933e-02 -7.785999999999999865e-02 4.580000000000000182e-01
3.511330000000000007e-02 -7.785999999999999865e-02 4.580000000000000182e-01
3.951999999999999957e-02 -7.752000000000000557e-02 4.560000000000000164e-01
4.234000000000000263e-02 -7.445999999999999841e-02 4.380000000000000004e-01
4.597330000000000166e-02 -7.327000000000000179e-02 4.309999999999999942e-01
-6.751000000000000056e-02 -7.535999999999999643e-02 4.709999999999999742e-01
-6.253330000000000000e-02 -7.503999999999999559e-02 4.689999999999999725e-01
-5.772000000000000047e-02 -7.488000000000000211e-02 4.680000000000000271e-01
-5.281330000000000052e-02 -7.456000000000000127e-02 4.660000000000000253e-01
-4.794670000000000182e-02 -7.424000000000000044e-02 4.640000000000000235e-01
-4.311999999999999861e-02 -7.391999999999999960e-02 4.620000000000000218e-01
-3.833330000000000071e-02 -7.359999999999999876e-02 4.600000000000000200e-01
-3.351330000000000281e-02 -7.312000000000000444e-02 4.570000000000000173e-01
-2.887999999999999942e-02 -7.295999999999999708e-02 4.560000000000000164e-01
-2.432000000000000134e-02 -7.295999999999999708e-02 4.560000000000000164e-01
-1.975999999999999979e-02 -7.295999999999999708e-02 4.560000000000000164e-01
-1.516669999999999997e-02 -7.280000000000000360e-02 4.550000000000000155e-01
-1.059329999999999994e-02 -7.263999999999999624e-02 4.540000000000000147e-01
-6.040000000000000230e-03 -7.248000000000000276e-02 4.530000000000000138e-01
-1.510000000000000057e-03 -7.248000000000000276e-02 4.530000000000000138e-01
3.020000000000000115e-03 -7.248000000000000276e-02 4.530000000000000138e-01
7.550000000000000287e-03 -7.248000000000000276e-02 4.530000000000000138e-01
1.208000000000000046e-02 -7.248000000000000276e-02 4.530000000000000138e-01
1.664670000000000039e-02 -7.263999999999999624e-02 4.540000000000000147e-01
2.128000000000000030e-02 -7.295999999999999708e-02 4.560000000000000164e-01
2.583999999999999839e-02 -7.295999999999999708e-02 4.560000000000000164e-01
3.046669999999999934e-02 -7.312000000000000444e-02 4.570000000000000173e-01
3.511330000000000007e-02 -7.327999999999999792e-02 4.580000000000000182e-01
3.951999999999999957e-02 -7.295999999999999708e-02 4.560000000000000164e-01
4.263000000000000123e-02 -7.055999999999999772e-02 4.410000000000000031e-01
-6.765329999999999955e-02 -7.080000000000000182e-02 4.719999999999999751e-01
-6.253330000000000000e-02 -7.034999999999999587e-02 4.689999999999999725e-01
-5.772000000000000047e-02 -7.019999999999999851e-02 4.680000000000000271e-01
-5.269999999999999685e-02 -6.975000000000000644e-02 4.650000000000000244e-01
-4.773999999999999772e-02 -6.930000000000000049e-02 4.620000000000000218e-01
-4.293330000000000063e-02 -6.900000000000000577e-02 4.600000000000000200e-01
-3.808330000000000048e-02 -6.854999999999999982e-02 4.570000000000000173e-01
-3.343999999999999750e-02 -6.840000000000000246e-02 4.560000000000000164e-01
-2.887999999999999942e-02 -6.840000000000000246e-02 4.560000000000000164e-01
-2.421330000000000010e-02 -6.809999999999999387e-02 4.540000000000000147e-01
-1.963000000000000161e-02 -6.794999999999999651e-02 4.530000000000000138e-01
-1.506670000000000058e-02 -6.779999999999999916e-02 4.520000000000000129e-01
-1.052329999999999932e-02 -6.765000000000000180e-02 4.510000000000000120e-01
-6.013329999999999891e-03 -6.765000000000000180e-02 4.510000000000000120e-01
-1.506670000000000101e-03 -6.779999999999999916e-02 4.520000000000000129e-01
3.020000000000000115e-03 -6.794999999999999651e-02 4.530000000000000138e-01
7.550000000000000287e-03 -6.794999999999999651e-02 4.530000000000000138e-01
1.208000000000000046e-02 -6.794999999999999651e-02 4.530000000000000138e-01
1.660999999999999976e-02 -6.794999999999999651e-02 4.530000000000000138e-01
2.118669999999999928e-02 -6.809999999999999387e-02 4.540000000000000147e-01
2.572670000000000165e-02 -6.809999999999999387e-02 4.540000000000000147e-01
3.039999999999999994e-02 -6.840000000000000246e-02 4.560000000000000164e-01
3.503669999999999701e-02 -6.854999999999999982e-02 4.570000000000000173e-01
3.951999999999999957e-02 -6.840000000000000246e-02 4.560000000000000164e-01
4.379000000000000253e-02 -6.794999999999999651e-02 4.530000000000000138e-01
4.768000000000000016e-02 -6.704999999999999849e-02 4.470000000000000084e-01
-6.693670000000000175e-02 -6.537999999999999368e-02 4.670000000000000262e-01
-6.226670000000000121e-02 -6.537999999999999368e-02 4.670000000000000262e-01
-5.747329999999999800e-02 -6.524000000000000632e-02 4.660000000000000253e-01
-5.247330000000000050e-02 -6.482000000000000262e-02 4.630000000000000226e-01
-4.763669999999999710e-02 -6.454000000000000015e-02 4.610000000000000209e-01
-4.274669999999999859e-02 -6.411999999999999644e-02 4.580000000000000182e-01
-3.799999999999999906e-02 -6.383999999999999397e-02 4.560000000000000164e-01
-3.336669999999999914e-02 -6.370000000000000662e-02 4.550000000000000155e-01
-2.881670000000000065e-02 -6.370000000000000662e-02 4.550000000000000155e-01
-2.421330000000000010e-02 -6.356000000000000538e-02 4.540000000000000147e-01
-1.963000000000000161e-02 -6.342000000000000415e-02 4.530000000000000138e-01
-1.506670000000000058e-02 -6.328000000000000291e-02 4.520000000000000129e-01
-1.052329999999999932e-02 -6.314000000000000168e-02 4.510000000000000120e-01
-6.013329999999999891e-03 -6.314000000000000168e-02 4.510000000000000120e-01
-1.503329999999999987e-03 -6.314000000000000168e-02 4.510000000000000120e-01
3.013329999999999828e-03 -6.328000000000000291e-02 4.520000000000000129e-01
7.533330000000000408e-03 -6.328000000000000291e-02 4.520000000000000129e-01
1.208000000000000046e-02 -6.342000000000000415e-02 4.530000000000000138e-01
1.660999999999999976e-02 -6.342000000000000415e-02 4.530000000000000138e-01
2.118669999999999928e-02 -6.356000000000000538e-02 4.540000000000000147e-01
2.572670000000000165e-02 -6.356000000000000538e-02 4.540000000000000147e-01
3.026670000000000055e-02 -6.356000000000000538e-02 4.540000000000000147e-01
3.480670000000000291e-02 -6.356000000000000538e-02 4.540000000000000147e-01
3.926000000000000323e-02 -6.342000000000000415e-02 4.530000000000000138e-01
4.388670000000000071e-02 -6.356000000000000538e-02 4.540000000000000147e-01
4.853330000000000144e-02 -6.370000000000000662e-02 4.550000000000000155e-01
-5.722669999999999840e-02 -6.031999999999999862e-02 4.640000000000000235e-01
-5.235999999999999682e-02 -6.006000000000000227e-02 4.620000000000000218e-01
-4.753330000000000055e-02 -5.979999999999999899e-02 4.600000000000000200e-01
-4.274669999999999859e-02 -5.954000000000000264e-02 4.580000000000000182e-01
-3.799999999999999906e-02 -5.927999999999999936e-02 4.560000000000000164e-01
-3.343999999999999750e-02 -5.927999999999999936e-02 4.560000000000000164e-01
-2.881670000000000065e-02 -5.915000000000000119e-02 4.550000000000000155e-01
-2.421330000000000010e-02 -5.902000000000000302e-02 4.540000000000000147e-01
-1.963000000000000161e-02 -5.888999999999999790e-02 4.530000000000000138e-01
-1.506670000000000058e-02 -5.875999999999999973e-02 4.520000000000000129e-01
-1.052329999999999932e-02 -5.863000000000000156e-02 4.510000000000000120e-01
-6.000000000000000125e-03 -5.850000000000000339e-02 4.500000000000000111e-01
-1.496670000000000075e-03 -5.836999999999999827e-02 4.490000000000000102e-01
3.000000000000000062e-03 -5.850000000000000339e-02 4.500000000000000111e-01
7.533330000000000408e-03 -5.875999999999999973e-02 4.520000000000000129e-01
1.205329999999999943e-02 -5.875999999999999973e-02 4.520000000000000129e-01
1.657329999999999914e-02 -5.875999999999999973e-02 4.520000000000000129e-01
2.113999999999999907e-02 -5.888999999999999790e-02 4.530000000000000138e-01
2.572670000000000165e-02 -5.902000000000000302e-02 4.540000000000000147e-01
3.026670000000000055e-02 -5.902000000000000302e-02 4.540000000000000147e-01
3.480670000000000291e-02 -5.902000000000000302e-02 4.540000000000000147e-01
3.934669999999999834e-02 -5.902000000000000302e-02 4.540000000000000147e-01
4.398330000000000295e-02 -5.915000000000000119e-02 4.550000000000000155e-01
4.853330000000000144e-02 -5.915000000000000119e-02 4.550000000000000155e-01
-5.698000000000000287e-02 -5.544000000000000317e-02 4.620000000000000218e-01
-5.213330000000000047e-02 -5.519999999999999907e-02 4.600000000000000200e-01
-4.722330000000000277e-02 -5.483999999999999986e-02 4.570000000000000173e-01
-4.246670000000000306e-02 -5.460000000000000270e-02 4.550000000000000155e-01
-3.783330000000000026e-02 -5.448000000000000065e-02 4.540000000000000147e-01
-3.329329999999999790e-02 -5.448000000000000065e-02 4.540000000000000147e-01
-2.862670000000000145e-02 -5.423999999999999655e-02 4.520000000000000129e-01
-2.410669999999999827e-02 -5.423999999999999655e-02 4.520000000000000129e-01
-1.958669999999999856e-02 -5.423999999999999655e-02 4.520000000000000129e-01
-1.503329999999999944e-02 -5.412000000000000144e-02 4.510000000000000120e-01
-1.050000000000000065e-02 -5.399999999999999939e-02 4.500000000000000111e-01
-5.973329999999999786e-03 -5.376000000000000223e-02 4.480000000000000093e-01
-1.493329999999999961e-03 -5.376000000000000223e-02 4.480000000000000093e-01
2.993330000000000209e-03 -5.387999999999999734e-02 4.490000000000000102e-01
7.499999999999999722e-03 -5.399999999999999939e-02 4.500000000000000111e-01
1.208000000000000046e-02 -5.435999999999999860e-02 4.530000000000000138e-01
1.660999999999999976e-02 -5.435999999999999860e-02 4.530000000000000138e-01
2.113999999999999907e-02 -5.435999999999999860e-02 4.530000000000000138e-01
2.566999999999999837e-02 -5.435999999999999860e-02 4.530000000000000138e-01
3.020000000000000115e-02 -5.435999999999999860e-02 4.530000000000000138e-01
3.480670000000000291e-02 -5.448000000000000065e-02 4.540000000000000147e-01
3.934669999999999834e-02 -5.448000000000000065e-02 4.540000000000000147e-01
4.398330000000000295e-02 -5.460000000000000270e-02 4.550000000000000155e-01
4.853330000000000144e-02 -5.460000000000000270e-02 4.550000000000000155e-01
-5.685670000000000307e-02 -5.070999999999999813e-02 4.610000000000000209e-01
-5.190670000000000006e-02 -5.038000000000000117e-02 4.580000000000000182e-01
-4.701670000000000155e-02 -5.004999999999999727e-02 4.550000000000000155e-01
-4.227999999999999814e-02 -4.982999999999999929e-02 4.530000000000000138e-01
-3.766669999999999741e-02 -4.972000000000000031e-02 4.520000000000000129e-01
-3.314670000000000116e-02 -4.972000000000000031e-02 4.520000000000000129e-01
-2.856329999999999980e-02 -4.961000000000000132e-02 4.510000000000000120e-01
-2.410669999999999827e-02 -4.972000000000000031e-02 4.520000000000000129e-01
-1.958669999999999856e-02 -4.972000000000000031e-02 4.520000000000000129e-01
-1.499999999999999944e-02 -4.950000000000000233e-02 4.500000000000000111e-01
-1.045330000000000044e-02 -4.927999999999999742e-02 4.480000000000000093e-01
-5.960000000000000020e-03 -4.916999999999999843e-02 4.470000000000000084e-01
-1.493329999999999961e-03 -4.927999999999999742e-02 4.480000000000000093e-01
2.993330000000000209e-03 -4.939000000000000334e-02 4.490000000000000102e-01
7.499999999999999722e-03 -4.950000000000000233e-02 4.500000000000000111e-01
1.208000000000000046e-02 -4.982999999999999929e-02 4.530000000000000138e-01
1.664670000000000039e-02 -4.993999999999999828e-02 4.540000000000000147e-01
2.113999999999999907e-02 -4.982999999999999929e-02 4.530000000000000138e-01
2.561329999999999857e-02 -4.972000000000000031e-02 4.520000000000000129e-01
3.013329999999999828e-02 -4.972000000000000031e-02 4.520000000000000129e-01
3.472999999999999698e-02 -4.982999999999999929e-02 4.530000000000000138e-01
3.943329999999999752e-02 -5.004999999999999727e-02 4.550000000000000155e-01
4.408000000000000113e-02 -5.016000000000000320e-02 4.560000000000000164e-01
4.864000000000000268e-02 -5.016000000000000320e-02 4.560000000000000164e-01
-6.133330000000000032e-02 -4.599999999999999922e-02 4.600000000000000200e-01
-5.673330000000000040e-02 -4.599999999999999922e-02 4.600000000000000200e-01
-5.190670000000000006e-02 -4.580000000000000043e-02 4.580000000000000182e-01
-4.712000000000000216e-02 -4.560000000000000164e-02 4.560000000000000164e-01
-4.218670000000000059e-02 -4.519999999999999712e-02 4.520000000000000129e-01
-3.758330000000000004e-02 -4.510000000000000120e-02 4.510000000000000120e-01
-3.300000000000000155e-02 -4.499999999999999833e-02 4.500000000000000111e-01
-2.837330000000000060e-02 -4.479999999999999954e-02 4.480000000000000093e-01
-2.394670000000000132e-02 -4.490000000000000241e-02 4.490000000000000102e-01
-1.945670000000000038e-02 -4.490000000000000241e-02 4.490000000000000102e-01
-1.496669999999999945e-02 -4.490000000000000241e-02 4.490000000000000102e-01
-1.043000000000000003e-02 -4.469999999999999668e-02 4.470000000000000084e-01
-5.933329999999999681e-03 -4.449999999999999789e-02 4.450000000000000067e-01
2.993330000000000209e-03 -4.490000000000000241e-02 4.490000000000000102e-01
7.499999999999999722e-03 -4.499999999999999833e-02 4.500000000000000111e-01
1.205329999999999943e-02 -4.519999999999999712e-02 4.520000000000000129e-01
1.664670000000000039e-02 -4.540000000000000285e-02 4.540000000000000147e-01
2.113999999999999907e-02 -4.529999999999999999e-02 4.530000000000000138e-01
2.566999999999999837e-02 -4.529999999999999999e-02 4.530000000000000138e-01
3.020000000000000115e-02 -4.529999999999999999e-02 4.530000000000000138e-01
3.488329999999999903e-02 -4.549999999999999878e-02 4.550000000000000155e-01
3.951999999999999957e-02 -4.560000000000000164e-02 4.560000000000000164e-01
4.427330000000000154e-02 -4.580000000000000043e-02 4.580000000000000182e-01
4.885330000000000228e-02 -4.580000000000000043e-02 4.580000000000000182e-01
-6.550330000000000041e-02 -4.112999999999999989e-02 4.570000000000000173e-01
-6.093330000000000274e-02 -4.112999999999999989e-02 4.570000000000000173e-01
-5.685670000000000307e-02 -4.148999999999999910e-02 4.610000000000000209e-01
-5.213330000000000047e-02 -4.139999999999999930e-02 4.600000000000000200e-01
-4.701670000000000155e-02 -4.095000000000000029e-02 4.550000000000000155e-01
-4.200000000000000261e-02 -4.050000000000000128e-02 4.500000000000000111e-01
-3.741669999999999718e-02 -4.041000000000000147e-02 4.490000000000000102e-01
-3.285330000000000195e-02 -4.032000000000000167e-02 4.480000000000000093e-01
-2.837330000000000060e-02 -4.032000000000000167e-02 4.480000000000000093e-01
-2.384000000000000008e-02 -4.023000000000000187e-02 4.470000000000000084e-01
-1.936999999999999833e-02 -4.023000000000000187e-02 4.470000000000000084e-01
-1.493330000000000005e-02 -4.032000000000000167e-02 4.480000000000000093e-01
-1.045330000000000044e-02 -4.032000000000000167e-02 4.480000000000000093e-01
-5.960000000000000020e-03 -4.023000000000000187e-02 4.470000000000000084e-01
-1.490000000000000005e-03 -4.023000000000000187e-02 4.470000000000000084e-01
2.986669999999999863e-03 -4.032000000000000167e-02 4.480000000000000093e-01
7.499999999999999722e-03 -4.050000000000000128e-02 4.500000000000000111e-01
1.205329999999999943e-02 -4.068000000000000088e-02 4.520000000000000129e-01
1.657329999999999914e-02 -4.068000000000000088e-02 4.520000000000000129e-01
2.113999999999999907e-02 -4.077000000000000068e-02 4.530000000000000138e-01
2.572670000000000165e-02 -4.086000000000000049e-02 4.540000000000000147e-01
3.033330000000000054e-02 -4.095000000000000029e-02 4.550000000000000155e-01
3.495999999999999802e-02 -4.104000000000000009e-02 4.560000000000000164e-01
3.969330000000000080e-02 -4.121999999999999970e-02 4.580000000000000182e-01
4.436999999999999972e-02 -4.130999999999999950e-02 4.590000000000000191e-01
4.906669999999999782e-02 -4.139999999999999930e-02 4.600000000000000200e-01
-6.079999999999999988e-02 -3.647999999999999854e-02 4.560000000000000164e-01
-5.661000000000000060e-02 -3.672000000000000264e-02 4.590000000000000191e-01
-5.167999999999999677e-02 -3.647999999999999854e-02 4.560000000000000164e-01
-4.660330000000000028e-02 -3.608000000000000096e-02 4.510000000000000120e-01
-4.181329999999999769e-02 -3.583999999999999686e-02 4.480000000000000093e-01
-3.724999999999999839e-02 -3.576000000000000012e-02 4.470000000000000084e-01
-3.285330000000000195e-02 -3.583999999999999686e-02 4.480000000000000093e-01
-2.843669999999999878e-02 -3.592000000000000054e-02 4.490000000000000102e-01
-2.384000000000000008e-02 -3.576000000000000012e-02 4.470000000000000084e-01
-1.941330000000000139e-02 -3.583999999999999686e-02 4.480000000000000093e-01
-1.496669999999999945e-02 -3.592000000000000054e-02 4.490000000000000102e-01
-1.050000000000000065e-02 -3.599999999999999728e-02 4.500000000000000111e-01
-6.013329999999999891e-03 -3.608000000000000096e-02 4.510000000000000120e-01
-1.500000000000000031e-03 -3.599999999999999728e-02 4.500000000000000111e-01
2.986669999999999863e-03 -3.583999999999999686e-02 4.480000000000000093e-01
7.499999999999999722e-03 -3.599999999999999728e-02 4.500000000000000111e-01
1.208000000000000046e-02 -3.624000000000000138e-02 4.530000000000000138e-01
1.660999999999999976e-02 -3.624000000000000138e-02 4.530000000000000138e-01
2.113999999999999907e-02 -3.624000000000000138e-02 4.530000000000000138e-01
2.572670000000000165e-02 -3.631999999999999812e-02 4.540000000000000147e-01
3.046669999999999934e-02 -3.656000000000000222e-02 4.570000000000000173e-01
3.518999999999999906e-02 -3.672000000000000264e-02 4.590000000000000191e-01
3.995329999999999715e-02 -3.688000000000000306e-02 4.610000000000000209e-01
4.456330000000000013e-02 -3.688000000000000306e-02 4.610000000000000209e-01
4.917330000000000312e-02 -3.688000000000000306e-02 4.610000000000000209e-01
5.390000000000000346e-02 -3.695999999999999980e-02 4.620000000000000218e-01
-6.053329999999999822e-02 -3.178000000000000269e-02 4.540000000000000147e-01
-5.587000000000000299e-02 -3.171000000000000207e-02 4.530000000000000138e-01
-5.099999999999999672e-02 -3.150000000000000022e-02 4.500000000000000111e-01
-4.629330000000000250e-02 -3.135999999999999899e-02 4.480000000000000093e-01
-4.162670000000000259e-02 -3.122000000000000122e-02 4.460000000000000075e-01
-3.724999999999999839e-02 -3.128999999999999837e-02 4.470000000000000084e-01
-3.277999999999999664e-02 -3.128999999999999837e-02 4.470000000000000084e-01
-2.830999999999999836e-02 -3.128999999999999837e-02 4.470000000000000084e-01
-2.384000000000000008e-02 -3.128999999999999837e-02 4.470000000000000084e-01
-1.936999999999999833e-02 -3.128999999999999837e-02 4.470000000000000084e-01
-1.493330000000000005e-02 -3.135999999999999899e-02 4.480000000000000093e-01
-1.050000000000000065e-02 -3.150000000000000022e-02 4.500000000000000111e-01
-6.013329999999999891e-03 -3.157000000000000084e-02 4.510000000000000120e-01
-1.503329999999999987e-03 -3.157000000000000084e-02 4.510000000000000120e-01
2.986669999999999863e-03 -3.135999999999999899e-02 4.480000000000000093e-01
7.499999999999999722e-03 -3.150000000000000022e-02 4.500000000000000111e-01
1.208000000000000046e-02 -3.171000000000000207e-02 4.530000000000000138e-01
1.664670000000000039e-02 -3.178000000000000269e-02 4.540000000000000147e-01
2.118669999999999928e-02 -3.178000000000000269e-02 4.540000000000000147e-01
2.578329999999999858e-02 -3.185000000000000331e-02 4.550000000000000155e-01
3.039999999999999994e-02 -3.191999999999999699e-02 4.560000000000000164e-01
3.518999999999999906e-02 -3.212999999999999884e-02 4.590000000000000191e-01
3.986669999999999797e-02 -3.219999999999999946e-02 4.600000000000000200e-01
4.465999999999999831e-02 -3.234000000000000069e-02 4.620000000000000218e-01
4.938669999999999866e-02 -3.241000000000000131e-02 4.630000000000000226e-01
5.401670000000000083e-02 -3.241000000000000131e-02 4.630000000000000226e-01
-6.040000000000000230e-02 -2.717999999999999930e-02 4.530000000000000138e-01
-5.550000000000000072e-02 -2.699999999999999969e-02 4.500000000000000111e-01
-5.065999999999999670e-02 -2.682000000000000009e-02 4.470000000000000084e-01
-4.608670000000000128e-02 -2.675999999999999907e-02 4.460000000000000075e-01
-4.153330000000000216e-02 -2.670000000000000151e-02 4.450000000000000067e-01
-3.724999999999999839e-02 -2.682000000000000009e-02 4.470000000000000084e-01
-3.285330000000000195e-02 -2.688000000000000111e-02 4.480000000000000093e-01
-2.837330000000000060e-02 -2.688000000000000111e-02 4.480000000000000093e-01
-2.389329999999999926e-02 -2.688000000000000111e-02 4.480000000000000093e-01
-1.936999999999999833e-02 -2.682000000000000009e-02 4.470000000000000084e-01
-1.493330000000000005e-02 -2.688000000000000111e-02 4.480000000000000093e-01
-1.050000000000000065e-02 -2.699999999999999969e-02 4.500000000000000111e-01
-6.013329999999999891e-03 -2.706000000000000072e-02 4.510000000000000120e-01
-1.503329999999999987e-03 -2.706000000000000072e-02 4.510000000000000120e-01
3.000000000000000062e-03 -2.699999999999999969e-02 4.500000000000000111e-01
7.533330000000000408e-03 -2.711999999999999827e-02 4.520000000000000129e-01
1.208000000000000046e-02 -2.717999999999999930e-02 4.530000000000000138e-01
1.660999999999999976e-02 -2.717999999999999930e-02 4.530000000000000138e-01
2.118669999999999928e-02 -2.724000000000000032e-02 4.540000000000000147e-01
2.578329999999999858e-02 -2.730000000000000135e-02 4.550000000000000155e-01
3.039999999999999994e-02 -2.735999999999999890e-02 4.560000000000000164e-01
3.503669999999999701e-02 -2.741999999999999993e-02 4.570000000000000173e-01
3.978000000000000286e-02 -2.753999999999999851e-02 4.590000000000000191e-01
4.465999999999999831e-02 -2.772000000000000158e-02 4.620000000000000218e-01
4.949329999999999702e-02 -2.784000000000000016e-02 4.640000000000000235e-01
-6.945999999999999397e-02 -2.264999999999999999e-02 4.530000000000000138e-01
-6.507330000000000059e-02 -2.270000000000000143e-02 4.540000000000000147e-01
-6.026669999999999944e-02 -2.259999999999999856e-02 4.520000000000000129e-01
-5.537670000000000092e-02 -2.245000000000000120e-02 4.490000000000000102e-01
-5.054669999999999996e-02 -2.230000000000000038e-02 4.460000000000000075e-01
-4.608670000000000128e-02 -2.230000000000000038e-02 4.460000000000000075e-01
-4.162670000000000259e-02 -2.230000000000000038e-02 4.460000000000000075e-01
-3.716669999999999696e-02 -2.230000000000000038e-02 4.460000000000000075e-01
-3.277999999999999664e-02 -2.234999999999999834e-02 4.470000000000000084e-01
-2.830999999999999836e-02 -2.234999999999999834e-02 4.470000000000000084e-01
-2.389329999999999926e-02 -2.239999999999999977e-02 4.480000000000000093e-01
-1.941330000000000139e-02 -2.239999999999999977e-02 4.480000000000000093e-01
-1.499999999999999944e-02 -2.249999999999999917e-02 4.500000000000000111e-01
-1.052329999999999932e-02 -2.255000000000000060e-02 4.510000000000000120e-01
-6.000000000000000125e-03 -2.249999999999999917e-02 4.500000000000000111e-01
-1.496670000000000075e-03 -2.245000000000000120e-02 4.490000000000000102e-01
3.000000000000000062e-03 -2.249999999999999917e-02 4.500000000000000111e-01
7.516669999999999602e-03 -2.255000000000000060e-02 4.510000000000000120e-01
1.205329999999999943e-02 -2.259999999999999856e-02 4.520000000000000129e-01
1.657329999999999914e-02 -2.259999999999999856e-02 4.520000000000000129e-01
2.123330000000000009e-02 -2.274999999999999939e-02 4.550000000000000155e-01
2.583999999999999839e-02 -2.280000000000000082e-02 4.560000000000000164e-01
3.046669999999999934e-02 -2.284999999999999878e-02 4.570000000000000173e-01
3.511330000000000007e-02 -2.290000000000000022e-02 4.580000000000000182e-01
3.995329999999999715e-02 -2.305000000000000104e-02 4.610000000000000209e-01
4.465999999999999831e-02 -2.309999999999999901e-02 4.620000000000000218e-01
4.938669999999999866e-02 -2.315000000000000044e-02 4.630000000000000226e-01
5.308329999999999993e-02 -2.274999999999999939e-02 4.550000000000000155e-01
-6.521670000000000245e-02 -1.820000000000000090e-02 4.550000000000000155e-01
-6.040000000000000230e-02 -1.812000000000000069e-02 4.530000000000000138e-01
-5.550000000000000072e-02 -1.799999999999999864e-02 4.500000000000000111e-01
-5.077330000000000038e-02 -1.791999999999999843e-02 4.480000000000000093e-01
-4.619000000000000189e-02 -1.788000000000000006e-02 4.470000000000000084e-01
-4.153330000000000216e-02 -1.779999999999999985e-02 4.450000000000000067e-01
-3.708329999999999960e-02 -1.779999999999999985e-02 4.450000000000000067e-01
-3.277999999999999664e-02 -1.788000000000000006e-02 4.470000000000000084e-01
-2.830999999999999836e-02 -1.788000000000000006e-02 4.470000000000000084e-01
-2.389329999999999926e-02 -1.791999999999999843e-02 4.480000000000000093e-01
-1.945670000000000038e-02 -1.796000000000000027e-02 4.490000000000000102e-01
-1.503329999999999944e-02 -1.804000000000000048e-02 4.510000000000000120e-01
-1.052329999999999932e-02 -1.804000000000000048e-02 4.510000000000000120e-01
-5.986670000000000359e-03 -1.796000000000000027e-02 4.490000000000000102e-01
-1.496670000000000075e-03 -1.796000000000000027e-02 4.490000000000000102e-01
3.000000000000000062e-03 -1.799999999999999864e-02 4.500000000000000111e-01
7.533330000000000408e-03 -1.807999999999999885e-02 4.520000000000000129e-01
1.202669999999999954e-02 -1.804000000000000048e-02 4.510000000000000120e-01
1.657329999999999914e-02 -1.807999999999999885e-02 4.520000000000000129e-01
2.118669999999999928e-02 -1.815999999999999906e-02 4.540000000000000147e-01
2.583999999999999839e-02 -1.823999999999999927e-02 4.560000000000000164e-01
3.046669999999999934e-02 -1.828000000000000111e-02 4.570000000000000173e-01
3.518999999999999906e-02 -1.836000000000000132e-02 4.590000000000000191e-01
3.995329999999999715e-02 -1.844000000000000153e-02 4.610000000000000209e-01
4.465999999999999831e-02 -1.847999999999999990e-02 4.620000000000000218e-01
4.938669999999999866e-02 -1.851999999999999827e-02 4.630000000000000226e-01
-4.153330000000000216e-02 -1.335000000000000075e-02 4.450000000000000067e-01
-3.716669999999999696e-02 -1.337999999999999953e-02 4.460000000000000075e-01
-3.277999999999999664e-02 -1.341000000000000004e-02 4.470000000000000084e-01
-2.830999999999999836e-02 -1.341000000000000004e-02 4.470000000000000084e-01
-2.389329999999999926e-02 -1.344000000000000056e-02 4.480000000000000093e-01
-1.945670000000000038e-02 -1.346999999999999933e-02 4.490000000000000102e-01
-1.499999999999999944e-02 -1.349999999999999985e-02 4.500000000000000111e-01
-1.050000000000000065e-02 -1.349999999999999985e-02 4.500000000000000111e-01
-6.000000000000000125e-03 -1.349999999999999985e-02 4.500000000000000111e-01
-1.500000000000000031e-03 -1.349999999999999985e-02 4.500000000000000111e-01
3.006669999999999916e-03 -1.353000000000000036e-02 4.510000000000000120e-01
7.566670000000000167e-03 -1.362000000000000016e-02 4.540000000000000147e-01
1.210669999999999975e-02 -1.362000000000000016e-02 4.540000000000000147e-01
1.660999999999999976e-02 -1.358999999999999965e-02 4.530000000000000138e-01
2.118669999999999928e-02 -1.362000000000000016e-02 4.540000000000000147e-01
2.578329999999999858e-02 -1.365000000000000067e-02 4.550000000000000155e-01
3.046669999999999934e-02 -1.370999999999999996e-02 4.570000000000000173e-01
3.518999999999999906e-02 -1.376999999999999925e-02 4.590000000000000191e-01
3.995329999999999715e-02 -1.383000000000000028e-02 4.610000000000000209e-01
4.456330000000000013e-02 -1.383000000000000028e-02 4.610000000000000209e-01
4.949329999999999702e-02 -1.392000000000000008e-02 4.640000000000000235e-01
5.401670000000000083e-02 -1.388999999999999957e-02 4.630000000000000226e-01
-4.172000000000000014e-02 -8.940000000000000030e-03 4.470000000000000084e-01
-3.716669999999999696e-02 -8.920000000000000845e-03 4.460000000000000075e-01
-1.945670000000000038e-02 -8.980000000000000135e-03 4.490000000000000102e-01
-1.496669999999999945e-02 -8.980000000000000135e-03 4.490000000000000102e-01
-1.045330000000000044e-02 -8.959999999999999215e-03 4.480000000000000093e-01
-6.000000000000000125e-03 -8.999999999999999320e-03 4.500000000000000111e-01
-1.500000000000000031e-03 -8.999999999999999320e-03 4.500000000000000111e-01
3.000000000000000062e-03 -8.999999999999999320e-03 4.500000000000000111e-01
7.533330000000000408e-03 -9.039999999999999425e-03 4.520000000000000129e-01
1.205329999999999943e-02 -9.039999999999999425e-03 4.520000000000000129e-01
1.657329999999999914e-02 -9.039999999999999425e-03 4.520000000000000129e-01
2.118669999999999928e-02 -9.079999999999999530e-03 4.540000000000000147e-01
2.578329999999999858e-02 -9.100000000000000450e-03 4.550000000000000155e-01
3.046669999999999934e-02 -9.140000000000000555e-03 4.570000000000000173e-01
3.511330000000000007e-02 -9.159999999999999740e-03 4.580000000000000182e-01
3.986669999999999797e-02 -9.199999999999999845e-03 4.600000000000000200e-01
4.456330000000000013e-02 -9.220000000000000764e-03 4.610000000000000209e-01
4.938669999999999866e-02 -9.259999999999999135e-03 4.630000000000000226e-01
5.390000000000000346e-02 -9.239999999999999949e-03 4.620000000000000218e-01
5.573329999999999951e-02 -8.800000000000000530e-03 4.400000000000000022e-01
5.972330000000000000e-02 -8.739999999999999505e-03 4.369999999999999996e-01
-4.190669999999999812e-02 -4.490000000000000067e-03 4.490000000000000102e-01
-1.945670000000000038e-02 -4.490000000000000067e-03 4.490000000000000102e-01
-1.493330000000000005e-02 -4.479999999999999608e-03 4.480000000000000093e-01
-1.043000000000000003e-02 -4.470000000000000015e-03 4.470000000000000084e-01
-5.986670000000000359e-03 -4.490000000000000067e-03 4.490000000000000102e-01
-1.496670000000000075e-03 -4.490000000000000067e-03 4.490000000000000102e-01
3.000000000000000062e-03 -4.499999999999999660e-03 4.500000000000000111e-01
7.499999999999999722e-03 -4.499999999999999660e-03 4.500000000000000111e-01
1.202669999999999954e-02 -4.510000000000000120e-03 4.510000000000000120e-01
1.653670000000000140e-02 -4.510000000000000120e-03 4.510000000000000120e-01
2.109329999999999886e-02 -4.519999999999999712e-03 4.520000000000000129e-01
2.572670000000000165e-02 -4.539999999999999765e-03 4.540000000000000147e-01
3.039999999999999994e-02 -4.559999999999999817e-03 4.560000000000000164e-01
3.511330000000000007e-02 -4.579999999999999870e-03 4.580000000000000182e-01
3.986669999999999797e-02 -4.599999999999999922e-03 4.600000000000000200e-01
4.456330000000000013e-02 -4.610000000000000382e-03 4.610000000000000209e-01
4.938669999999999866e-02 -4.629999999999999567e-03 4.630000000000000226e-01
5.401670000000000083e-02 -4.629999999999999567e-03 4.630000000000000226e-01
5.700000000000000205e-02 -4.499999999999999660e-03 4.500000000000000111e-01
5.999670000000000003e-02 -4.389999999999999805e-03 4.390000000000000013e-01
-1.483330000000000065e-02 0.000000000000000000e+00 4.450000000000000067e-01
-1.038329999999999982e-02 0.000000000000000000e+00 4.450000000000000067e-01
-5.960000000000000020e-03 0.000000000000000000e+00 4.470000000000000084e-01
-1.490000000000000005e-03 0.000000000000000000e+00 4.470000000000000084e-01
2.980000000000000010e-03 0.000000000000000000e+00 4.470000000000000084e-01
7.483329999999999843e-03 0.000000000000000000e+00 4.490000000000000102e-01
1.200000000000000025e-02 0.000000000000000000e+00 4.500000000000000111e-01
1.653670000000000140e-02 0.000000000000000000e+00 4.510000000000000120e-01
2.109329999999999886e-02 0.000000000000000000e+00 4.520000000000000129e-01
2.572670000000000165e-02 0.000000000000000000e+00 4.540000000000000147e-01
3.039999999999999994e-02 0.000000000000000000e+00 4.560000000000000164e-01
3.503669999999999701e-02 0.000000000000000000e+00 4.570000000000000173e-01
3.995329999999999715e-02 0.000000000000000000e+00 4.610000000000000209e-01
4.475670000000000343e-02 0.000000000000000000e+00 4.630000000000000226e-01
4.949329999999999702e-02 0.000000000000000000e+00 4.640000000000000235e-01
5.436669999999999697e-02 0.000000000000000000e+00 4.660000000000000253e-01
5.915329999999999894e-02 0.000000000000000000e+00 4.670000000000000262e-01
6.365329999999999600e-02 0.000000000000000000e+00 4.339999999999999969e-01
-4.218670000000000059e-02 4.519999999999999712e-03 4.520000000000000129e-01
-1.945670000000000038e-02 4.490000000000000067e-03 4.490000000000000102e-01
-1.490000000000000005e-02 4.470000000000000015e-03 4.470000000000000084e-01
-1.038329999999999982e-02 4.449999999999999963e-03 4.450000000000000067e-01
-5.960000000000000020e-03 4.470000000000000015e-03 4.470000000000000084e-01
-1.486670000000000049e-03 4.460000000000000422e-03 4.460000000000000075e-01
2.973330000000000157e-03 4.460000000000000422e-03 4.460000000000000075e-01
7.466669999999999904e-03 4.479999999999999608e-03 4.480000000000000093e-01
1.194669999999999933e-02 4.479999999999999608e-03 4.480000000000000093e-01
1.646330000000000016e-02 4.490000000000000067e-03 4.490000000000000102e-01
2.104670000000000152e-02 4.510000000000000120e-03 4.510000000000000120e-01
2.578329999999999858e-02 4.550000000000000225e-03 4.550000000000000155e-01
3.046669999999999934e-02 4.570000000000000277e-03 4.570000000000000173e-01
3.511330000000000007e-02 4.579999999999999870e-03 4.580000000000000182e-01
3.995329999999999715e-02 4.610000000000000382e-03 4.610000000000000209e-01
4.475670000000000343e-02 4.629999999999999567e-03 4.630000000000000226e-01
4.959999999999999826e-02 4.649999999999999620e-03 4.650000000000000244e-01
5.448329999999999840e-02 4.669999999999999672e-03 4.670000000000000262e-01
5.953329999999999733e-02 4.700000000000000185e-03 4.699999999999999734e-01
6.450670000000000015e-02 4.720000000000000237e-03 4.719999999999999751e-01
-3.766669999999999741e-02 9.039999999999999425e-03 4.520000000000000129e-01
-3.343999999999999750e-02 9.119999999999999635e-03 4.560000000000000164e-01
-2.887999999999999942e-02 9.119999999999999635e-03 4.560000000000000164e-01
-2.416000000000000092e-02 9.060000000000000345e-03 4.530000000000000138e-01
-1.949999999999999997e-02 8.999999999999999320e-03 4.500000000000000111e-01
-1.493330000000000005e-02 8.959999999999999215e-03 4.480000000000000093e-01
-1.043000000000000003e-02 8.940000000000000030e-03 4.470000000000000084e-01
-5.946670000000000254e-03 8.920000000000000845e-03 4.460000000000000075e-01
-1.490000000000000005e-03 8.940000000000000030e-03 4.470000000000000084e-01
2.980000000000000010e-03 8.940000000000000030e-03 4.470000000000000084e-01
7.450000000000000025e-03 8.940000000000000030e-03 4.470000000000000084e-01
1.194669999999999933e-02 8.959999999999999215e-03 4.480000000000000093e-01
1.646330000000000016e-02 8.980000000000000135e-03 4.490000000000000102e-01
2.100000000000000130e-02 8.999999999999999320e-03 4.500000000000000111e-01
2.561329999999999857e-02 9.039999999999999425e-03 4.520000000000000129e-01
3.033330000000000054e-02 9.100000000000000450e-03 4.550000000000000155e-01
3.511330000000000007e-02 9.159999999999999740e-03 4.580000000000000182e-01
3.995329999999999715e-02 9.220000000000000764e-03 4.610000000000000209e-01
4.465999999999999831e-02 9.239999999999999949e-03 4.620000000000000218e-01
4.949329999999999702e-02 9.280000000000000054e-03 4.640000000000000235e-01
5.448329999999999840e-02 9.339999999999999344e-03 4.670000000000000262e-01
5.953329999999999733e-02 9.400000000000000369e-03 4.699999999999999734e-01
6.478000000000000425e-02 9.480000000000000579e-03 4.739999999999999769e-01
-2.875329999999999900e-02 1.362000000000000016e-02 4.540000000000000147e-01
-2.421330000000000010e-02 1.362000000000000016e-02 4.540000000000000147e-01
-1.954329999999999956e-02 1.353000000000000036e-02 4.510000000000000120e-01
-1.499999999999999944e-02 1.349999999999999985e-02 4.500000000000000111e-01
-1.043000000000000003e-02 1.341000000000000004e-02 4.470000000000000084e-01
-5.960000000000000020e-03 1.341000000000000004e-02 4.470000000000000084e-01
-1.493329999999999961e-03 1.344000000000000056e-02 4.480000000000000093e-01
2.993330000000000209e-03 1.346999999999999933e-02 4.490000000000000102e-01
7.450000000000000025e-03 1.341000000000000004e-02 4.470000000000000084e-01
1.194669999999999933e-02 1.344000000000000056e-02 4.480000000000000093e-01
1.646330000000000016e-02 1.346999999999999933e-02 4.490000000000000102e-01
2.100000000000000130e-02 1.349999999999999985e-02 4.500000000000000111e-01
2.566999999999999837e-02 1.358999999999999965e-02 4.530000000000000138e-01
3.046669999999999934e-02 1.370999999999999996e-02 4.570000000000000173e-01
3.526669999999999805e-02 1.379999999999999977e-02 4.600000000000000200e-01
4.003999999999999920e-02 1.386000000000000079e-02 4.620000000000000218e-01
4.465999999999999831e-02 1.386000000000000079e-02 4.620000000000000218e-01
4.949329999999999702e-02 1.392000000000000008e-02 4.640000000000000235e-01
5.448329999999999840e-02 1.400999999999999988e-02 4.670000000000000262e-01
5.953329999999999733e-02 1.409999999999999969e-02 4.699999999999999734e-01
6.464330000000000076e-02 1.418999999999999949e-02 4.729999999999999760e-01
6.937329999999999885e-02 1.418999999999999949e-02 4.729999999999999760e-01
-6.053329999999999995e-03 1.815999999999999906e-02 4.540000000000000147e-01
-1.510000000000000057e-03 1.812000000000000069e-02 4.530000000000000138e-01
3.013329999999999828e-03 1.807999999999999885e-02 4.520000000000000129e-01
7.466669999999999904e-03 1.791999999999999843e-02 4.480000000000000093e-01
1.192000000000000004e-02 1.788000000000000006e-02 4.470000000000000084e-01
1.642669999999999894e-02 1.791999999999999843e-02 4.480000000000000093e-01
2.100000000000000130e-02 1.799999999999999864e-02 4.500000000000000111e-01
2.561329999999999857e-02 1.807999999999999885e-02 4.520000000000000129e-01
3.033330000000000054e-02 1.820000000000000090e-02 4.550000000000000155e-01
3.503669999999999701e-02 1.828000000000000111e-02 4.570000000000000173e-01
3.986669999999999797e-02 1.839999999999999969e-02 4.600000000000000200e-01
4.465999999999999831e-02 1.847999999999999990e-02 4.620000000000000218e-01
4.949329999999999702e-02 1.856000000000000011e-02 4.640000000000000235e-01
5.436669999999999697e-02 1.864000000000000032e-02 4.660000000000000253e-01
5.953329999999999733e-02 1.880000000000000074e-02 4.699999999999999734e-01
6.436999999999999666e-02 1.883999999999999911e-02 4.709999999999999742e-01
6.878670000000000617e-02 1.875999999999999890e-02 4.689999999999999725e-01
-1.064000000000000015e-02 2.280000000000000082e-02 4.560000000000000164e-01
-6.080000000000000335e-03 2.280000000000000082e-02 4.560000000000000164e-01
-1.513330000000000014e-03 2.270000000000000143e-02 4.540000000000000147e-01
3.006669999999999916e-03 2.255000000000000060e-02 4.510000000000000120e-01
7.483329999999999843e-03 2.245000000000000120e-02 4.490000000000000102e-01
1.194669999999999933e-02 2.239999999999999977e-02 4.480000000000000093e-01
1.642669999999999894e-02 2.239999999999999977e-02 4.480000000000000093e-01
2.095330000000000109e-02 2.245000000000000120e-02 4.490000000000000102e-01
2.549999999999999836e-02 2.249999999999999917e-02 4.500000000000000111e-01
3.026670000000000055e-02 2.270000000000000143e-02 4.540000000000000147e-01
3.503669999999999701e-02 2.284999999999999878e-02 4.570000000000000173e-01
3.986669999999999797e-02 2.299999999999999961e-02 4.600000000000000200e-01
4.465999999999999831e-02 2.309999999999999901e-02 4.620000000000000218e-01
4.959999999999999826e-02 2.324999999999999983e-02 4.650000000000000244e-01
5.460000000000000270e-02 2.340000000000000066e-02 4.680000000000000271e-01
5.953329999999999733e-02 2.350000000000000006e-02 4.699999999999999734e-01
6.396000000000000296e-02 2.340000000000000066e-02 4.680000000000000271e-01
6.805329999999999713e-02 2.319999999999999840e-02 4.640000000000000235e-01
-1.513330000000000057e-02 2.724000000000000032e-02 4.540000000000000147e-01
-1.061669999999999975e-02 2.730000000000000135e-02 4.550000000000000155e-01
-6.080000000000000335e-03 2.735999999999999890e-02 4.560000000000000164e-01
-1.510000000000000057e-03 2.717999999999999930e-02 4.530000000000000138e-01
3.006669999999999916e-03 2.706000000000000072e-02 4.510000000000000120e-01
7.499999999999999722e-03 2.699999999999999969e-02 4.500000000000000111e-01
1.200000000000000025e-02 2.699999999999999969e-02 4.500000000000000111e-01
1.650000000000000078e-02 2.699999999999999969e-02 4.500000000000000111e-01
2.100000000000000130e-02 2.699999999999999969e-02 4.500000000000000111e-01
2.561329999999999857e-02 2.711999999999999827e-02 4.520000000000000129e-01
3.033330000000000054e-02 2.730000000000000135e-02 4.550000000000000155e-01
3.511330000000000007e-02 2.748000000000000095e-02 4.580000000000000182e-01
3.995329999999999715e-02 2.766000000000000056e-02 4.610000000000000209e-01
4.475670000000000343e-02 2.777999999999999914e-02 4.630000000000000226e-01
4.970669999999999950e-02 2.795999999999999874e-02 4.660000000000000253e-01
5.471670000000000006e-02 2.813999999999999835e-02 4.689999999999999725e-01
5.940669999999999978e-02 2.813999999999999835e-02 4.689999999999999725e-01
6.341330000000000577e-02 2.784000000000000016e-02 4.640000000000000235e-01
-1.510000000000000057e-02 3.171000000000000207e-02 4.530000000000000138e-01
-1.059329999999999994e-02 3.178000000000000269e-02 4.540000000000000147e-01
-6.053329999999999995e-03 3.178000000000000269e-02 4.540000000000000147e-01
-1.503329999999999987e-03 3.157000000000000084e-02 4.510000000000000120e-01
3.000000000000000062e-03 3.150000000000000022e-02 4.500000000000000111e-01
7.499999999999999722e-03 3.150000000000000022e-02 4.500000000000000111e-01
1.202669999999999954e-02 3.157000000000000084e-02 4.510000000000000120e-01
1.657329999999999914e-02 3.164000000000000146e-02 4.520000000000000129e-01
2.109329999999999886e-02 3.164000000000000146e-02 4.520000000000000129e-01
2.566999999999999837e-02 3.171000000000000207e-02 4.530000000000000138e-01
3.033330000000000054e-02 3.185000000000000331e-02 4.550000000000000155e-01
3.503669999999999701e-02 3.198999999999999760e-02 4.570000000000000173e-01
3.995329999999999715e-02 3.227000000000000007e-02 4.610000000000000209e-01
4.475670000000000343e-02 3.241000000000000131e-02 4.630000000000000226e-01
4.970669999999999950e-02 3.262000000000000316e-02 4.660000000000000253e-01
5.448329999999999840e-02 3.268999999999999684e-02 4.670000000000000262e-01
5.852000000000000257e-02 3.234000000000000069e-02 4.620000000000000218e-01
6.272999999999999410e-02 3.212999999999999884e-02 4.590000000000000191e-01
-1.506670000000000058e-02 3.615999999999999770e-02 4.520000000000000129e-01
-1.052329999999999932e-02 3.608000000000000096e-02 4.510000000000000120e-01
-6.013329999999999891e-03 3.608000000000000096e-02 4.510000000000000120e-01
-1.500000000000000031e-03 3.599999999999999728e-02 4.500000000000000111e-01
3.000000000000000062e-03 3.599999999999999728e-02 4.500000000000000111e-01
7.499999999999999722e-03 3.599999999999999728e-02 4.500000000000000111e-01
1.200000000000000025e-02 3.599999999999999728e-02 4.500000000000000111e-01
1.653670000000000140e-02 3.608000000000000096e-02 4.510000000000000120e-01
2.118669999999999928e-02 3.631999999999999812e-02 4.540000000000000147e-01
2.578329999999999858e-02 3.640000000000000180e-02 4.550000000000000155e-01
3.039999999999999994e-02 3.647999999999999854e-02 4.560000000000000164e-01
3.511330000000000007e-02 3.663999999999999896e-02 4.580000000000000182e-01
3.995329999999999715e-02 3.688000000000000306e-02 4.610000000000000209e-01
4.465999999999999831e-02 3.695999999999999980e-02 4.620000000000000218e-01
4.949329999999999702e-02 3.712000000000000022e-02 4.640000000000000235e-01
5.413330000000000225e-02 3.712000000000000022e-02 4.640000000000000235e-01
5.826669999999999766e-02 3.679999999999999938e-02 4.600000000000000200e-01
6.259330000000000449e-02 3.663999999999999896e-02 4.580000000000000182e-01
-1.510000000000000057e-02 4.077000000000000068e-02 4.530000000000000138e-01
-1.052329999999999932e-02 4.059000000000000108e-02 4.510000000000000120e-01
-6.013329999999999891e-03 4.059000000000000108e-02 4.510000000000000120e-01
-1.500000000000000031e-03 4.050000000000000128e-02 4.500000000000000111e-01
3.000000000000000062e-03 4.050000000000000128e-02 4.500000000000000111e-01
7.499999999999999722e-03 4.050000000000000128e-02 4.500000000000000111e-01
1.200000000000000025e-02 4.050000000000000128e-02 4.500000000000000111e-01
1.657329999999999914e-02 4.068000000000000088e-02 4.520000000000000129e-01
2.118669999999999928e-02 4.086000000000000049e-02 4.540000000000000147e-01
2.578329999999999858e-02 4.095000000000000029e-02 4.550000000000000155e-01
3.039999999999999994e-02 4.104000000000000009e-02 4.560000000000000164e-01
3.518999999999999906e-02 4.130999999999999950e-02 4.590000000000000191e-01
3.995329999999999715e-02 4.148999999999999910e-02 4.610000000000000209e-01
4.475670000000000343e-02 4.166999999999999871e-02 4.630000000000000226e-01
4.949329999999999702e-02 4.175999999999999851e-02 4.640000000000000235e-01
5.378329999999999916e-02 4.148999999999999910e-02 4.610000000000000209e-01
5.801329999999999681e-02 4.121999999999999970e-02 4.580000000000000182e-01
-1.054670000000000087e-02 4.519999999999999712e-02 4.520000000000000129e-01
-6.026669999999999597e-03 4.519999999999999712e-02 4.520000000000000129e-01
-1.503329999999999987e-03 4.510000000000000120e-02 4.510000000000000120e-01
3.000000000000000062e-03 4.499999999999999833e-02 4.500000000000000111e-01
7.516669999999999602e-03 4.510000000000000120e-02 4.510000000000000120e-01
1.208000000000000046e-02 4.529999999999999999e-02 4.530000000000000138e-01
1.664670000000000039e-02 4.540000000000000285e-02 4.540000000000000147e-01
2.123330000000000009e-02 4.549999999999999878e-02 4.550000000000000155e-01
2.583999999999999839e-02 4.560000000000000164e-02 4.560000000000000164e-01
3.053329999999999933e-02 4.580000000000000043e-02 4.580000000000000182e-01
3.534330000000000110e-02 4.610000000000000209e-02 4.610000000000000209e-01
4.003999999999999920e-02 4.619999999999999801e-02 4.620000000000000218e-01
4.485329999999999873e-02 4.639999999999999680e-02 4.640000000000000235e-01
4.949329999999999702e-02 4.639999999999999680e-02 4.640000000000000235e-01
5.355000000000000038e-02 4.590000000000000330e-02 4.590000000000000191e-01
-6.026669999999999597e-03 4.972000000000000031e-02 4.520000000000000129e-01
-1.506670000000000101e-03 4.972000000000000031e-02 4.520000000000000129e-01
3.020000000000000115e-03 4.982999999999999929e-02 4.530000000000000138e-01
7.550000000000000287e-03 4.982999999999999929e-02 4.530000000000000138e-01
1.210669999999999975e-02 4.993999999999999828e-02 4.540000000000000147e-01
1.668330000000000160e-02 5.004999999999999727e-02 4.550000000000000155e-01
2.123330000000000009e-02 5.004999999999999727e-02 4.550000000000000155e-01
2.589670000000000166e-02 5.027000000000000218e-02 4.570000000000000173e-01
3.066670000000000160e-02 5.059999999999999915e-02 4.600000000000000200e-01
3.542000000000000010e-02 5.081999999999999712e-02 4.620000000000000218e-01
4.012670000000000126e-02 5.093000000000000305e-02 4.630000000000000226e-01
4.465999999999999831e-02 5.081999999999999712e-02 4.620000000000000218e-01
4.885330000000000228e-02 5.038000000000000117e-02 4.580000000000000182e-01
-1.506670000000000101e-03 5.423999999999999655e-02 4.520000000000000129e-01
3.020000000000000115e-03 5.435999999999999860e-02 4.530000000000000138e-01
7.566670000000000167e-03 5.448000000000000065e-02 4.540000000000000147e-01
1.216000000000000067e-02 5.471999999999999781e-02 4.560000000000000164e-01
1.671999999999999875e-02 5.471999999999999781e-02 4.560000000000000164e-01
2.132670000000000052e-02 5.483999999999999986e-02 4.570000000000000173e-01
2.600999999999999840e-02 5.507999999999999702e-02 4.590000000000000191e-01
3.080000000000000099e-02 5.544000000000000317e-02 4.620000000000000218e-01
3.549669999999999909e-02 5.555999999999999828e-02 4.630000000000000226e-01
4.012670000000000126e-02 5.555999999999999828e-02 4.630000000000000226e-01
4.436999999999999972e-02 5.507999999999999702e-02 4.590000000000000191e-01
7.583330000000000105e-03 5.915000000000000119e-02 4.550000000000000155e-01
1.221329999999999985e-02 5.954000000000000264e-02 4.580000000000000182e-01
1.683000000000000121e-02 5.967000000000000082e-02 4.590000000000000191e-01
2.146669999999999828e-02 5.979999999999999899e-02 4.600000000000000200e-01
2.612329999999999861e-02 5.992999999999999716e-02 4.610000000000000209e-01
3.093330000000000038e-02 6.031999999999999862e-02 4.640000000000000235e-01
3.557330000000000214e-02 6.031999999999999862e-02 4.640000000000000235e-01
3.969330000000000080e-02 5.954000000000000264e-02 4.580000000000000182e-01
1.226670000000000017e-02 6.439999999999999891e-02 4.600000000000000200e-01
1.694000000000000020e-02 6.468000000000000138e-02 4.620000000000000218e-01
2.160669999999999952e-02 6.482000000000000262e-02 4.630000000000000226e-01
2.634999999999999842e-02 6.510000000000000508e-02 4.650000000000000244e-01
3.093330000000000038e-02 6.496000000000000385e-02 4.640000000000000235e-01
3.518999999999999906e-02 6.425999999999999768e-02 4.590000000000000191e-01
