1.664670000000000039e-02 -8.172000000000000097e-02 4.540000000000000147e-01
2.137330000000000133e-02 -8.243999999999999939e-02 4.580000000000000182e-01
2.629329999999999862e-02 -8.351999999999999702e-02 4.640000000000000235e-01
1.650000000000000078e-02 -7.649999999999999856e-02 4.500000000000000111e-01
2.109329999999999886e-02 -7.684000000000000552e-02 4.520000000000000129e-01
2.578329999999999858e-02 -7.735000000000000209e-02 4.550000000000000155e-01
3.066670000000000160e-02 -7.820000000000000562e-02 4.600000000000000200e-01
-4.293330000000000063e-02 -7.359999999999999876e-02 4.600000000000000200e-01
-3.816669999999999785e-02 -7.327999999999999792e-02 4.580000000000000182e-01
-3.329329999999999790e-02 -7.263999999999999624e-02 4.540000000000000147e-01
1.189330000000000075e-02 -7.136000000000000676e-02 4.460000000000000075e-01
1.638999999999999832e-02 -7.152000000000000024e-02 4.470000000000000084e-01
2.086000000000000007e-02 -7.152000000000000024e-02 4.470000000000000084e-01
2.549999999999999836e-02 -7.199999999999999456e-02 4.500000000000000111e-01
3.039999999999999994e-02 -7.295999999999999708e-02 4.560000000000000164e-01
3.549669999999999909e-02 -7.407999999999999308e-02 4.630000000000000226e-01
4.055999999999999883e-02 -7.488000000000000211e-02 4.680000000000000271e-01
-9.760000000000000620e-02 -7.199999999999999456e-02 4.799999999999999822e-01
-9.106000000000000205e-02 -7.065000000000000446e-02 4.709999999999999742e-01
-8.598329999999999862e-02 -7.034999999999999587e-02 4.689999999999999725e-01
-5.747329999999999800e-02 -6.990000000000000380e-02 4.660000000000000253e-01
-5.247330000000000050e-02 -6.944999999999999785e-02 4.630000000000000226e-01
-4.753330000000000055e-02 -6.900000000000000577e-02 4.600000000000000200e-01
-4.246670000000000306e-02 -6.825000000000000511e-02 4.550000000000000155e-01
-3.758330000000000004e-02 -6.765000000000000180e-02 4.510000000000000120e-01
-3.285330000000000195e-02 -6.719999999999999585e-02 4.480000000000000093e-01
-2.824669999999999959e-02 -6.690000000000000113e-02 4.460000000000000075e-01
-2.367999999999999966e-02 -6.660000000000000642e-02 4.440000000000000058e-01
-1.910999999999999852e-02 -6.615000000000000047e-02 4.410000000000000031e-01
-1.460000000000000013e-02 -6.569999999999999452e-02 4.380000000000000004e-01
-1.019669999999999951e-02 -6.554999999999999716e-02 4.369999999999999996e-01
-5.866670000000000045e-03 -6.600000000000000311e-02 4.400000000000000022e-01
-1.469999999999999953e-03 -6.615000000000000047e-02 4.410000000000000031e-01
2.946670000000000192e-03 -6.629999999999999782e-02 4.420000000000000040e-01
7.366669999999999642e-03 -6.629999999999999782e-02 4.420000000000000040e-01
1.178670000000000065e-02 -6.629999999999999782e-02 4.420000000000000040e-01
1.624329999999999871e-02 -6.644999999999999518e-02 4.430000000000000049e-01
2.071999999999999884e-02 -6.660000000000000642e-02 4.440000000000000058e-01
2.527329999999999854e-02 -6.690000000000000113e-02 4.460000000000000075e-01
3.013329999999999828e-02 -6.779999999999999916e-02 4.520000000000000129e-01
3.503669999999999701e-02 -6.854999999999999982e-02 4.570000000000000173e-01
3.978000000000000286e-02 -6.884999999999999454e-02 4.590000000000000191e-01
-1.076470000000000066e-01 -6.747999999999999832e-02 4.819999999999999840e-01
-1.028270000000000017e-01 -6.747999999999999832e-02 4.819999999999999840e-01
-9.739670000000000272e-02 -6.705999999999999461e-02 4.789999999999999813e-01
-9.183330000000000659e-02 -6.650000000000000355e-02 4.749999999999999778e-01
-8.653329999999999356e-02 -6.607999999999999985e-02 4.719999999999999751e-01
-8.146670000000000300e-02 -6.579999999999999738e-02 4.699999999999999734e-01
-7.660329999999999917e-02 -6.565999999999999615e-02 4.689999999999999725e-01
-7.191329999999999945e-02 -6.565999999999999615e-02 4.689999999999999725e-01
-6.722329999999999972e-02 -6.565999999999999615e-02 4.689999999999999725e-01
-6.239999999999999714e-02 -6.551999999999999491e-02 4.680000000000000271e-01
-5.722669999999999840e-02 -6.496000000000000385e-02 4.640000000000000235e-01
-5.190670000000000006e-02 -6.411999999999999644e-02 4.580000000000000182e-01
-4.691329999999999806e-02 -6.356000000000000538e-02 4.540000000000000147e-01
-4.218670000000000059e-02 -6.328000000000000291e-02 4.520000000000000129e-01
-3.741669999999999718e-02 -6.285999999999999921e-02 4.490000000000000102e-01
-3.270669999999999827e-02 -6.244000000000000244e-02 4.460000000000000075e-01
-2.805670000000000039e-02 -6.201999999999999874e-02 4.430000000000000049e-01
-2.357329999999999842e-02 -6.187999999999999751e-02 4.420000000000000040e-01
-1.910999999999999852e-02 -6.174000000000000321e-02 4.410000000000000031e-01
-1.463330000000000013e-02 -6.146000000000000074e-02 4.390000000000000013e-01
-1.021999999999999992e-02 -6.131999999999999951e-02 4.380000000000000004e-01
-5.853330000000000338e-03 -6.146000000000000074e-02 4.390000000000000013e-01
-1.463330000000000099e-03 -6.146000000000000074e-02 4.390000000000000013e-01
2.926670000000000139e-03 -6.146000000000000074e-02 4.390000000000000013e-01
7.316669999999999945e-03 -6.146000000000000074e-02 4.390000000000000013e-01
1.170670000000000044e-02 -6.146000000000000074e-02 4.390000000000000013e-01
1.613329999999999972e-02 -6.160000000000000198e-02 4.400000000000000022e-01
2.058000000000000107e-02 -6.174000000000000321e-02 4.410000000000000031e-01
2.510329999999999853e-02 -6.201999999999999874e-02 4.430000000000000049e-01
2.973330000000000070e-02 -6.244000000000000244e-02 4.460000000000000075e-01
3.434670000000000084e-02 -6.271999999999999797e-02 4.480000000000000093e-01
3.899999999999999994e-02 -6.300000000000000044e-02 4.500000000000000111e-01
4.379000000000000253e-02 -6.342000000000000415e-02 4.530000000000000138e-01
4.842670000000000308e-02 -6.356000000000000538e-02 4.540000000000000147e-01
-1.063069999999999987e-01 -6.187999999999999751e-02 4.759999999999999787e-01
-1.013330000000000064e-01 -6.174999999999999933e-02 4.749999999999999778e-01
-9.617670000000000385e-02 -6.149000000000000299e-02 4.729999999999999760e-01
-9.125329999999999553e-02 -6.135999999999999788e-02 4.719999999999999751e-01
-8.634999999999999620e-02 -6.122999999999999970e-02 4.709999999999999742e-01
-8.129329999999999889e-02 -6.097000000000000336e-02 4.689999999999999725e-01
-7.627670000000000283e-02 -6.071000000000000008e-02 4.670000000000000262e-01
-7.130000000000000226e-02 -6.044999999999999679e-02 4.650000000000000244e-01
-6.650670000000000193e-02 -6.031999999999999862e-02 4.640000000000000235e-01
-6.106670000000000154e-02 -5.954000000000000264e-02 4.580000000000000182e-01
-5.611669999999999853e-02 -5.915000000000000119e-02 4.550000000000000155e-01
-5.133999999999999675e-02 -5.888999999999999790e-02 4.530000000000000138e-01
-4.649999999999999967e-02 -5.850000000000000339e-02 4.500000000000000111e-01
-4.181329999999999769e-02 -5.824000000000000010e-02 4.480000000000000093e-01
-3.708329999999999960e-02 -5.784999999999999865e-02 4.450000000000000067e-01
-3.248670000000000030e-02 -5.759000000000000230e-02 4.430000000000000049e-01
-2.792999999999999997e-02 -5.732999999999999902e-02 4.410000000000000031e-01
-2.341330000000000147e-02 -5.707000000000000267e-02 4.390000000000000013e-01
-1.902329999999999993e-02 -5.707000000000000267e-02 4.390000000000000013e-01
-1.460000000000000013e-02 -5.693999999999999756e-02 4.380000000000000004e-01
-1.019669999999999951e-02 -5.680999999999999939e-02 4.369999999999999996e-01
-5.813330000000000233e-03 -5.668000000000000121e-02 4.359999999999999987e-01
-1.456669999999999970e-03 -5.680999999999999939e-02 4.369999999999999996e-01
2.913329999999999999e-03 -5.680999999999999939e-02 4.369999999999999996e-01
7.266670000000000247e-03 -5.668000000000000121e-02 4.359999999999999987e-01
1.162670000000000023e-02 -5.668000000000000121e-02 4.359999999999999987e-01
1.602330000000000074e-02 -5.680999999999999939e-02 4.369999999999999996e-01
2.039329999999999962e-02 -5.680999999999999939e-02 4.369999999999999996e-01
2.487670000000000159e-02 -5.707000000000000267e-02 4.390000000000000013e-01
-1.049670000000000047e-01 -5.639999999999999875e-02 4.699999999999999734e-01
-1.004799999999999999e-01 -5.652000000000000079e-02 4.709999999999999742e-01
-9.556670000000000442e-02 -5.639999999999999875e-02 4.699999999999999734e-01
-9.067329999999999834e-02 -5.627999999999999670e-02 4.689999999999999725e-01
-8.580000000000000127e-02 -5.616000000000000159e-02 4.680000000000000271e-01
-8.077330000000000620e-02 -5.591999999999999749e-02 4.660000000000000253e-01
-7.578669999999999851e-02 -5.568000000000000033e-02 4.640000000000000235e-01
-7.084000000000000019e-02 -5.544000000000000317e-02 4.620000000000000218e-01
-6.564670000000000227e-02 -5.496000000000000191e-02 4.580000000000000182e-01
-6.066669999999999702e-02 -5.460000000000000270e-02 4.550000000000000155e-01
-5.587000000000000299e-02 -5.435999999999999860e-02 4.530000000000000138e-01
-5.099999999999999672e-02 -5.399999999999999939e-02 4.500000000000000111e-01
-4.619000000000000189e-02 -5.364000000000000018e-02 4.470000000000000084e-01
-4.153330000000000216e-02 -5.340000000000000302e-02 4.450000000000000067e-01
-3.691669999999999674e-02 -5.315999999999999892e-02 4.430000000000000049e-01
-3.226670000000000232e-02 -5.279999999999999971e-02 4.400000000000000022e-01
-2.780329999999999954e-02 -5.267999999999999766e-02 4.390000000000000013e-01
-2.335999999999999882e-02 -5.256000000000000255e-02 4.380000000000000004e-01
-1.898000000000000034e-02 -5.256000000000000255e-02 4.380000000000000004e-01
-1.453330000000000073e-02 -5.231999999999999845e-02 4.359999999999999987e-01
-1.012670000000000063e-02 -5.208000000000000129e-02 4.339999999999999969e-01
-5.786669999999999835e-03 -5.208000000000000129e-02 4.339999999999999969e-01
-1.449999999999999900e-03 -5.220000000000000334e-02 4.349999999999999978e-01
2.899999999999999800e-03 -5.220000000000000334e-02 4.349999999999999978e-01
7.250000000000000368e-03 -5.220000000000000334e-02 4.349999999999999978e-01
1.159999999999999920e-02 -5.220000000000000334e-02 4.349999999999999978e-01
1.594999999999999890e-02 -5.220000000000000334e-02 4.349999999999999978e-01
2.034669999999999881e-02 -5.231999999999999845e-02 4.359999999999999987e-01
-1.000530000000000030e-01 -5.158999999999999697e-02 4.689999999999999725e-01
-9.576999999999999402e-02 -5.181000000000000189e-02 4.709999999999999742e-01
-9.048000000000000487e-02 -5.147999999999999798e-02 4.680000000000000271e-01
-8.525000000000000633e-02 -5.115000000000000102e-02 4.650000000000000244e-01
-8.025329999999999964e-02 -5.093000000000000305e-02 4.630000000000000226e-01
-7.529669999999999419e-02 -5.070999999999999813e-02 4.610000000000000209e-01
-7.022670000000000301e-02 -5.038000000000000117e-02 4.580000000000000182e-01
-6.521670000000000245e-02 -5.004999999999999727e-02 4.550000000000000155e-01
-6.026669999999999944e-02 -4.972000000000000031e-02 4.520000000000000129e-01
-5.550000000000000072e-02 -4.950000000000000233e-02 4.500000000000000111e-01
-5.065999999999999670e-02 -4.916999999999999843e-02 4.470000000000000084e-01
-4.598329999999999779e-02 -4.895000000000000046e-02 4.450000000000000067e-01
-4.125329999999999969e-02 -4.861999999999999655e-02 4.420000000000000040e-01
-3.666670000000000346e-02 -4.839999999999999858e-02 4.400000000000000022e-01
-3.212000000000000272e-02 -4.818000000000000060e-02 4.380000000000000004e-01
-2.774000000000000077e-02 -4.818000000000000060e-02 4.380000000000000004e-01
-2.330669999999999964e-02 -4.807000000000000162e-02 4.369999999999999996e-01
-1.889329999999999829e-02 -4.796000000000000263e-02 4.359999999999999987e-01
-1.450000000000000074e-02 -4.784999999999999670e-02 4.349999999999999978e-01
-1.012670000000000063e-02 -4.773999999999999772e-02 4.339999999999999969e-01
-5.786669999999999835e-03 -4.773999999999999772e-02 4.339999999999999969e-01
-1.446669999999999944e-03 -4.773999999999999772e-02 4.339999999999999969e-01
2.893329999999999947e-03 -4.773999999999999772e-02 4.339999999999999969e-01
7.233329999999999621e-03 -4.773999999999999772e-02 4.339999999999999969e-01
1.157329999999999991e-02 -4.773999999999999772e-02 4.339999999999999969e-01
1.591329999999999828e-02 -4.773999999999999772e-02 4.339999999999999969e-01
-9.983999999999999819e-02 -4.680000000000000132e-02 4.680000000000000271e-01
-9.536329999999999807e-02 -4.689999999999999725e-02 4.689999999999999725e-01
-9.009330000000000116e-02 -4.660000000000000253e-02 4.660000000000000253e-01
-8.488329999999999487e-02 -4.630000000000000088e-02 4.630000000000000226e-01
-8.007999999999999841e-02 -4.619999999999999801e-02 4.620000000000000218e-01
-7.480670000000000375e-02 -4.580000000000000043e-02 4.580000000000000182e-01
-6.991999999999999604e-02 -4.560000000000000164e-02 4.560000000000000164e-01
-6.507330000000000059e-02 -4.540000000000000285e-02 4.540000000000000147e-01
-6.013330000000000064e-02 -4.510000000000000120e-02 4.510000000000000120e-01
-5.537670000000000092e-02 -4.490000000000000241e-02 4.490000000000000102e-01
-5.054669999999999996e-02 -4.460000000000000075e-02 4.460000000000000075e-01
-4.587999999999999717e-02 -4.440000000000000197e-02 4.440000000000000058e-01
-4.106669999999999765e-02 -4.399999999999999745e-02 4.400000000000000022e-01
-3.641670000000000323e-02 -4.370000000000000273e-02 4.369999999999999996e-01
-3.204669999999999741e-02 -4.370000000000000273e-02 4.369999999999999996e-01
-2.767669999999999852e-02 -4.370000000000000273e-02 4.369999999999999996e-01
-2.330669999999999964e-02 -4.370000000000000273e-02 4.369999999999999996e-01
-1.889329999999999829e-02 -4.359999999999999987e-02 4.359999999999999987e-01
-1.446670000000000074e-02 -4.340000000000000108e-02 4.339999999999999969e-01
-1.012670000000000063e-02 -4.340000000000000108e-02 4.339999999999999969e-01
-5.799999999999999600e-03 -4.349999999999999700e-02 4.349999999999999978e-01
-1.449999999999999900e-03 -4.349999999999999700e-02 4.349999999999999978e-01
2.899999999999999800e-03 -4.349999999999999700e-02 4.349999999999999978e-01
7.216669999999999682e-03 -4.329999999999999821e-02 4.329999999999999960e-01
1.154670000000000002e-02 -4.329999999999999821e-02 4.329999999999999960e-01
1.587670000000000053e-02 -4.329999999999999821e-02 4.329999999999999960e-01
-9.454999999999999516e-02 -4.184999999999999831e-02 4.650000000000000244e-01
-8.931999999999999662e-02 -4.157999999999999891e-02 4.620000000000000218e-01
-8.451670000000000016e-02 -4.148999999999999910e-02 4.610000000000000209e-01
-7.956000000000000572e-02 -4.130999999999999950e-02 4.590000000000000191e-01
-7.448000000000000453e-02 -4.104000000000000009e-02 4.560000000000000164e-01
-6.961330000000000295e-02 -4.086000000000000049e-02 4.540000000000000147e-01
-6.493000000000000160e-02 -4.077000000000000068e-02 4.530000000000000138e-01
-6.013330000000000064e-02 -4.059000000000000108e-02 4.510000000000000120e-01
-5.525329999999999825e-02 -4.032000000000000167e-02 4.480000000000000093e-01
-5.043330000000000035e-02 -4.005000000000000226e-02 4.450000000000000067e-01
-4.577669999999999656e-02 -3.987000000000000266e-02 4.430000000000000049e-01
-4.116000000000000214e-02 -3.969000000000000306e-02 4.410000000000000031e-01
-3.658329999999999915e-02 -3.951000000000000345e-02 4.390000000000000013e-01
-3.219330000000000108e-02 -3.951000000000000345e-02 4.390000000000000013e-01
-2.774000000000000077e-02 -3.941999999999999671e-02 4.380000000000000004e-01
-2.330669999999999964e-02 -3.932999999999999691e-02 4.369999999999999996e-01
-1.884999999999999870e-02 -3.914999999999999730e-02 4.349999999999999978e-01
-1.446670000000000074e-02 -3.905999999999999750e-02 4.339999999999999969e-01
2.899999999999999800e-03 -3.914999999999999730e-02 4.349999999999999978e-01
7.216669999999999682e-03 -3.896999999999999770e-02 4.329999999999999960e-01
1.154670000000000002e-02 -3.896999999999999770e-02 4.329999999999999960e-01
1.591329999999999828e-02 -3.905999999999999750e-02 4.339999999999999969e-01
-9.434670000000000556e-02 -3.712000000000000022e-02 4.640000000000000235e-01
-8.912670000000000314e-02 -3.688000000000000306e-02 4.610000000000000209e-01
-8.396670000000000522e-02 -3.663999999999999896e-02 4.580000000000000182e-01
-7.921330000000000038e-02 -3.656000000000000222e-02 4.570000000000000173e-01
-7.448000000000000453e-02 -3.647999999999999854e-02 4.560000000000000164e-01
-6.930669999999999886e-02 -3.615999999999999770e-02 4.520000000000000129e-01
-6.464330000000000076e-02 -3.608000000000000096e-02 4.510000000000000120e-01
-5.999999999999999778e-02 -3.599999999999999728e-02 4.500000000000000111e-01
-5.512999999999999845e-02 -3.576000000000000012e-02 4.470000000000000084e-01
-5.020669999999999994e-02 -3.543999999999999928e-02 4.430000000000000049e-01
-4.567330000000000001e-02 -3.536000000000000254e-02 4.420000000000000040e-01
-4.125329999999999969e-02 -3.536000000000000254e-02 4.420000000000000040e-01
-3.666670000000000346e-02 -3.520000000000000212e-02 4.400000000000000022e-01
-3.226670000000000232e-02 -3.520000000000000212e-02 4.400000000000000022e-01
-2.786670000000000119e-02 -3.520000000000000212e-02 4.400000000000000022e-01
-2.335999999999999882e-02 -3.504000000000000170e-02 4.380000000000000004e-01
7.216669999999999682e-03 -3.463999999999999718e-02 4.329999999999999960e-01
1.154670000000000002e-02 -3.463999999999999718e-02 4.329999999999999960e-01
1.587670000000000053e-02 -3.463999999999999718e-02 4.329999999999999960e-01
-9.414329999999999921e-02 -3.241000000000000131e-02 4.630000000000000226e-01
-8.912670000000000314e-02 -3.227000000000000007e-02 4.610000000000000209e-01
-8.396670000000000522e-02 -3.205999999999999822e-02 4.580000000000000182e-01
-7.903999999999999915e-02 -3.191999999999999699e-02 4.560000000000000164e-01
-7.431669999999999943e-02 -3.185000000000000331e-02 4.550000000000000155e-01
-6.961330000000000295e-02 -3.178000000000000269e-02 4.540000000000000147e-01
-6.464330000000000076e-02 -3.157000000000000084e-02 4.510000000000000120e-01
-5.973330000000000306e-02 -3.135999999999999899e-02 4.480000000000000093e-01
-5.500669999999999865e-02 -3.122000000000000122e-02 4.460000000000000075e-01
-5.020669999999999994e-02 -3.100999999999999937e-02 4.430000000000000049e-01
-4.556999999999999940e-02 -3.087000000000000161e-02 4.410000000000000031e-01
-4.116000000000000214e-02 -3.087000000000000161e-02 4.410000000000000031e-01
-3.658329999999999915e-02 -3.073000000000000037e-02 4.390000000000000013e-01
-3.212000000000000272e-02 -3.065999999999999975e-02 4.380000000000000004e-01
-2.786670000000000119e-02 -3.080000000000000099e-02 4.400000000000000022e-01
-2.335999999999999882e-02 -3.065999999999999975e-02 4.380000000000000004e-01
-1.005670000000000001e-02 -3.016999999999999890e-02 4.309999999999999942e-01
-5.733330000000000023e-03 -3.009999999999999828e-02 4.299999999999999933e-01
7.250000000000000368e-03 -3.045000000000000137e-02 4.349999999999999978e-01
1.157329999999999991e-02 -3.038000000000000075e-02 4.339999999999999969e-01
1.591329999999999828e-02 -3.038000000000000075e-02 4.339999999999999969e-01
-8.893330000000000679e-02 -2.759999999999999953e-02 4.600000000000000200e-01
-8.396670000000000522e-02 -2.748000000000000095e-02 4.580000000000000182e-01
-7.903999999999999915e-02 -2.735999999999999890e-02 4.560000000000000164e-01
-7.431669999999999943e-02 -2.730000000000000135e-02 4.550000000000000155e-01
-6.930669999999999886e-02 -2.711999999999999827e-02 4.520000000000000129e-01
-6.407000000000000195e-02 -2.682000000000000009e-02 4.470000000000000084e-01
-5.960000000000000020e-02 -2.682000000000000009e-02 4.470000000000000084e-01
-5.500669999999999865e-02 -2.675999999999999907e-02 4.460000000000000075e-01
-5.031999999999999668e-02 -2.664000000000000049e-02 4.440000000000000058e-01
-4.567330000000000001e-02 -2.651999999999999844e-02 4.420000000000000040e-01
-4.106669999999999765e-02 -2.639999999999999986e-02 4.400000000000000022e-01
-3.666670000000000346e-02 -2.639999999999999986e-02 4.400000000000000022e-01
-3.204669999999999741e-02 -2.622000000000000025e-02 4.369999999999999996e-01
2.913329999999999999e-03 -2.622000000000000025e-02 4.369999999999999996e-01
7.266670000000000247e-03 -2.615999999999999923e-02 4.359999999999999987e-01
1.154670000000000002e-02 -2.597999999999999962e-02 4.329999999999999960e-01
1.587670000000000053e-02 -2.597999999999999962e-02 4.329999999999999960e-01
2.020670000000000105e-02 -2.597999999999999962e-02 4.329999999999999960e-01
-8.415000000000000258e-02 -2.295000000000000165e-02 4.590000000000000191e-01
-7.921330000000000038e-02 -2.284999999999999878e-02 4.570000000000000173e-01
-7.448000000000000453e-02 -2.280000000000000082e-02 4.560000000000000164e-01
-6.961330000000000295e-02 -2.270000000000000143e-02 4.540000000000000147e-01
-6.435670000000000279e-02 -2.245000000000000120e-02 4.490000000000000102e-01
-5.960000000000000020e-02 -2.234999999999999834e-02 4.470000000000000084e-01
-5.500669999999999865e-02 -2.230000000000000038e-02 4.460000000000000075e-01
-5.031999999999999668e-02 -2.220000000000000098e-02 4.440000000000000058e-01
-4.567330000000000001e-02 -2.210000000000000159e-02 4.420000000000000040e-01
-4.106669999999999765e-02 -2.199999999999999872e-02 4.400000000000000022e-01
-3.674999999999999795e-02 -2.205000000000000016e-02 4.410000000000000031e-01
-1.169000000000000074e-02 -2.504999999999999935e-02 5.010000000000000009e-01
7.250000000000000368e-03 -2.174999999999999850e-02 4.349999999999999978e-01
1.157329999999999991e-02 -2.170000000000000054e-02 4.339999999999999969e-01
1.591329999999999828e-02 -2.170000000000000054e-02 4.339999999999999969e-01
2.016000000000000084e-02 -2.160000000000000114e-02 4.319999999999999951e-01
-8.378330000000000499e-02 -1.828000000000000111e-02 4.570000000000000173e-01
-7.886669999999999792e-02 -1.820000000000000090e-02 4.550000000000000155e-01
-7.415330000000000532e-02 -1.815999999999999906e-02 4.540000000000000147e-01
-6.945999999999999397e-02 -1.812000000000000069e-02 4.530000000000000138e-01
-6.478670000000000262e-02 -1.807999999999999885e-02 4.520000000000000129e-01
-5.986670000000000186e-02 -1.796000000000000027e-02 4.490000000000000102e-01
-5.500669999999999865e-02 -1.784000000000000169e-02 4.460000000000000075e-01
-5.031999999999999668e-02 -1.776000000000000148e-02 4.440000000000000058e-01
-4.567330000000000001e-02 -1.768000000000000127e-02 4.420000000000000040e-01
-4.116000000000000214e-02 -1.763999999999999943e-02 4.410000000000000031e-01
-3.674999999999999795e-02 -1.763999999999999943e-02 4.410000000000000031e-01
-3.219330000000000108e-02 -1.755999999999999922e-02 4.390000000000000013e-01
-2.767669999999999852e-02 -1.747999999999999901e-02 4.369999999999999996e-01
-5.746669999999999730e-03 -1.723999999999999838e-02 4.309999999999999942e-01
-1.436669999999999918e-03 -1.723999999999999838e-02 4.309999999999999942e-01
2.880000000000000181e-03 -1.728000000000000022e-02 4.319999999999999951e-01
7.266670000000000247e-03 -1.744000000000000064e-02 4.359999999999999987e-01
1.157329999999999991e-02 -1.736000000000000043e-02 4.339999999999999969e-01
1.591329999999999828e-02 -1.736000000000000043e-02 4.339999999999999969e-01
2.011330000000000062e-02 -1.723999999999999838e-02 4.309999999999999942e-01
2.436670000000000155e-02 -1.720000000000000001e-02 4.299999999999999933e-01
-7.903999999999999915e-02 -1.367999999999999945e-02 4.560000000000000164e-01
-7.399000000000000021e-02 -1.358999999999999965e-02 4.530000000000000138e-01
-6.930669999999999886e-02 -1.355999999999999914e-02 4.520000000000000129e-01
-6.478670000000000262e-02 -1.355999999999999914e-02 4.520000000000000129e-01
-5.999999999999999778e-02 -1.349999999999999985e-02 4.500000000000000111e-01
-5.525329999999999825e-02 -1.344000000000000056e-02 4.480000000000000093e-01
-3.674999999999999795e-02 -1.323000000000000044e-02 4.410000000000000031e-01
-3.219330000000000108e-02 -1.316999999999999942e-02 4.390000000000000013e-01
-2.767669999999999852e-02 -1.311000000000000013e-02 4.369999999999999996e-01
-2.325330000000000105e-02 -1.307999999999999961e-02 4.359999999999999987e-01
-1.443329999999999960e-02 -1.298999999999999981e-02 4.329999999999999960e-01
-1.012670000000000063e-02 -1.302000000000000032e-02 4.339999999999999969e-01
-5.760000000000000363e-03 -1.295999999999999930e-02 4.319999999999999951e-01
-1.433330000000000021e-03 -1.290000000000000001e-02 4.299999999999999933e-01
1.157329999999999991e-02 -1.302000000000000032e-02 4.339999999999999969e-01
1.583999999999999991e-02 -1.295999999999999930e-02 4.319999999999999951e-01
2.011330000000000062e-02 -1.293000000000000052e-02 4.309999999999999942e-01
2.442329999999999848e-02 -1.293000000000000052e-02 4.309999999999999942e-01
2.893329999999999860e-02 -1.302000000000000032e-02 4.339999999999999969e-01
3.334999999999999770e-02 -1.305000000000000084e-02 4.349999999999999978e-01
-7.415330000000000532e-02 -9.079999999999999530e-03 4.540000000000000147e-01
-6.961330000000000295e-02 -9.079999999999999530e-03 4.540000000000000147e-01
-6.493000000000000160e-02 -9.060000000000000345e-03 4.530000000000000138e-01
-6.026669999999999944e-02 -9.039999999999999425e-03 4.520000000000000129e-01
-5.550000000000000072e-02 -8.999999999999999320e-03 4.500000000000000111e-01
-4.209330000000000016e-02 -9.020000000000000240e-03 4.510000000000000120e-01
-3.708329999999999960e-02 -8.899999999999999925e-03 4.450000000000000067e-01
-3.226670000000000232e-02 -8.800000000000000530e-03 4.400000000000000022e-01
-2.774000000000000077e-02 -8.760000000000000425e-03 4.380000000000000004e-01
-2.330669999999999964e-02 -8.739999999999999505e-03 4.369999999999999996e-01
-1.889329999999999829e-02 -8.720000000000000320e-03 4.359999999999999987e-01
-1.453330000000000073e-02 -8.720000000000000320e-03 4.359999999999999987e-01
-1.012670000000000063e-02 -8.680000000000000215e-03 4.339999999999999969e-01
-5.773330000000000128e-03 -8.659999999999999296e-03 4.329999999999999960e-01
-1.440000000000000091e-03 -8.640000000000000110e-03 4.319999999999999951e-01
2.886669999999999861e-02 -8.659999999999999296e-03 4.329999999999999960e-01
3.319670000000000259e-02 -8.659999999999999296e-03 4.329999999999999960e-01
3.752670000000000311e-02 -8.659999999999999296e-03 4.329999999999999960e-01
5.098330000000000223e-02 -8.739999999999999505e-03 4.369999999999999996e-01
5.510000000000000314e-02 -8.699999999999999400e-03 4.349999999999999978e-01
5.917669999999999875e-02 -8.659999999999999296e-03 4.329999999999999960e-01
-6.976670000000000094e-02 -4.550000000000000225e-03 4.550000000000000155e-01
-6.507330000000000059e-02 -4.539999999999999765e-03 4.540000000000000147e-01
-6.040000000000000230e-02 -4.530000000000000172e-03 4.530000000000000138e-01
-5.562330000000000052e-02 -4.510000000000000120e-03 4.510000000000000120e-01
-5.099999999999999672e-02 -4.499999999999999660e-03 4.500000000000000111e-01
-4.639669999999999905e-02 -4.490000000000000067e-03 4.490000000000000102e-01
-4.162670000000000259e-02 -4.460000000000000422e-03 4.460000000000000075e-01
-3.691669999999999674e-02 -4.429999999999999910e-03 4.430000000000000049e-01
-3.234000000000000069e-02 -4.409999999999999858e-03 4.410000000000000031e-01
-2.786670000000000119e-02 -4.400000000000000265e-03 4.400000000000000022e-01
-2.335999999999999882e-02 -4.380000000000000213e-03 4.380000000000000004e-01
-1.893670000000000075e-02 -4.369999999999999753e-03 4.369999999999999996e-01
-1.456670000000000013e-02 -4.369999999999999753e-03 4.369999999999999996e-01
-1.017329999999999970e-02 -4.360000000000000160e-03 4.359999999999999987e-01
-5.813330000000000233e-03 -4.360000000000000160e-03 4.359999999999999987e-01
-1.443330000000000047e-03 -4.329999999999999648e-03 4.329999999999999960e-01
2.886670000000000035e-03 -4.329999999999999648e-03 4.329999999999999960e-01
7.216669999999999682e-03 -4.329999999999999648e-03 4.329999999999999960e-01
2.879999999999999921e-02 -4.320000000000000055e-03 4.319999999999999951e-01
3.311999999999999666e-02 -4.320000000000000055e-03 4.319999999999999951e-01
3.752670000000000311e-02 -4.329999999999999648e-03 4.329999999999999960e-01
4.185669999999999669e-02 -4.329999999999999648e-03 4.329999999999999960e-01
4.629330000000000250e-02 -4.340000000000000108e-03 4.339999999999999969e-01
5.075000000000000344e-02 -4.349999999999999700e-03 4.349999999999999978e-01
5.510000000000000314e-02 -4.349999999999999700e-03 4.349999999999999978e-01
5.931329999999999936e-02 -4.340000000000000108e-03 4.339999999999999969e-01
-6.079999999999999988e-02 0.000000000000000000e+00 4.560000000000000164e-01
-5.599330000000000279e-02 0.000000000000000000e+00 4.540000000000000147e-01
-5.122670000000000001e-02 0.000000000000000000e+00 4.520000000000000129e-01
-4.649999999999999967e-02 0.000000000000000000e+00 4.500000000000000111e-01
-4.162670000000000259e-02 0.000000000000000000e+00 4.460000000000000075e-01
-3.699999999999999817e-02 0.000000000000000000e+00 4.440000000000000058e-01
-3.241329999999999906e-02 0.000000000000000000e+00 4.420000000000000040e-01
-2.792999999999999997e-02 0.000000000000000000e+00 4.410000000000000031e-01
-2.346670000000000006e-02 0.000000000000000000e+00 4.400000000000000022e-01
-1.902329999999999993e-02 0.000000000000000000e+00 4.390000000000000013e-01
-1.460000000000000013e-02 0.000000000000000000e+00 4.380000000000000004e-01
-1.019669999999999951e-02 0.000000000000000000e+00 4.369999999999999996e-01
-5.826669999999999940e-03 0.000000000000000000e+00 4.369999999999999996e-01
-1.446669999999999944e-03 0.000000000000000000e+00 4.339999999999999969e-01
2.886670000000000035e-03 0.000000000000000000e+00 4.329999999999999960e-01
7.216669999999999682e-03 0.000000000000000000e+00 4.329999999999999960e-01
1.154670000000000002e-02 0.000000000000000000e+00 4.329999999999999960e-01
1.591329999999999828e-02 0.000000000000000000e+00 4.339999999999999969e-01
2.025329999999999839e-02 0.000000000000000000e+00 4.339999999999999969e-01
2.453670000000000156e-02 0.000000000000000000e+00 4.329999999999999960e-01
2.886669999999999861e-02 0.000000000000000000e+00 4.329999999999999960e-01
3.319670000000000259e-02 0.000000000000000000e+00 4.329999999999999960e-01
3.761330000000000229e-02 0.000000000000000000e+00 4.339999999999999969e-01
4.214670000000000222e-02 0.000000000000000000e+00 4.359999999999999987e-01
4.661330000000000334e-02 0.000000000000000000e+00 4.369999999999999996e-01
5.098330000000000223e-02 0.000000000000000000e+00 4.369999999999999996e-01
5.560670000000000196e-02 0.000000000000000000e+00 4.390000000000000013e-01
5.999670000000000003e-02 0.000000000000000000e+00 4.390000000000000013e-01
6.409330000000000582e-02 0.000000000000000000e+00 4.369999999999999996e-01
-5.599330000000000279e-02 4.539999999999999765e-03 4.540000000000000147e-01
-5.133999999999999675e-02 4.530000000000000172e-03 4.530000000000000138e-01
-4.660330000000000028e-02 4.510000000000000120e-03 4.510000000000000120e-01
-4.190669999999999812e-02 4.490000000000000067e-03 4.490000000000000102e-01
-3.724999999999999839e-02 4.470000000000000015e-03 4.470000000000000084e-01
-3.270669999999999827e-02 4.460000000000000422e-03 4.460000000000000075e-01
-2.811999999999999916e-02 4.440000000000000370e-03 4.440000000000000058e-01
-2.357329999999999842e-02 4.420000000000000318e-03 4.420000000000000040e-01
-1.906669999999999893e-02 4.400000000000000265e-03 4.400000000000000022e-01
-1.460000000000000013e-02 4.380000000000000213e-03 4.380000000000000004e-01
-1.019669999999999951e-02 4.369999999999999753e-03 4.369999999999999996e-01
-5.813330000000000233e-03 4.360000000000000160e-03 4.359999999999999987e-01
-1.449999999999999900e-03 4.349999999999999700e-03 4.349999999999999978e-01
2.899999999999999800e-03 4.349999999999999700e-03 4.349999999999999978e-01
7.233329999999999621e-03 4.340000000000000108e-03 4.339999999999999969e-01
1.157329999999999991e-02 4.340000000000000108e-03 4.339999999999999969e-01
1.591329999999999828e-02 4.340000000000000108e-03 4.339999999999999969e-01
2.025329999999999839e-02 4.340000000000000108e-03 4.339999999999999969e-01
2.459329999999999850e-02 4.340000000000000108e-03 4.339999999999999969e-01
2.900000000000000147e-02 4.349999999999999700e-03 4.349999999999999978e-01
3.327329999999999871e-02 4.340000000000000108e-03 4.339999999999999969e-01
3.761330000000000229e-02 4.340000000000000108e-03 4.339999999999999969e-01
4.204999999999999710e-02 4.349999999999999700e-03 4.349999999999999978e-01
4.661330000000000334e-02 4.369999999999999753e-03 4.369999999999999996e-01
5.145000000000000268e-02 4.409999999999999858e-03 4.410000000000000031e-01
5.623999999999999833e-02 4.440000000000000370e-03 4.440000000000000058e-01
6.067999999999999783e-02 4.440000000000000370e-03 4.440000000000000058e-01
6.482670000000000099e-02 4.420000000000000318e-03 4.420000000000000040e-01
-4.691329999999999806e-02 9.079999999999999530e-03 4.540000000000000147e-01
-4.227999999999999814e-02 9.060000000000000345e-03 4.530000000000000138e-01
-3.766669999999999741e-02 9.039999999999999425e-03 4.520000000000000129e-01
-3.285330000000000195e-02 8.959999999999999215e-03 4.480000000000000093e-01
-2.830999999999999836e-02 8.940000000000000030e-03 4.470000000000000084e-01
-2.367999999999999966e-02 8.880000000000000740e-03 4.440000000000000058e-01
-1.915330000000000157e-02 8.840000000000000635e-03 4.420000000000000040e-01
-1.469999999999999953e-02 8.819999999999999715e-03 4.410000000000000031e-01
-1.026670000000000013e-02 8.800000000000000530e-03 4.400000000000000022e-01
-5.839999999999999705e-03 8.760000000000000425e-03 4.380000000000000004e-01
-1.456669999999999970e-03 8.739999999999999505e-03 4.369999999999999996e-01
2.913329999999999999e-03 8.739999999999999505e-03 4.369999999999999996e-01
7.266670000000000247e-03 8.720000000000000320e-03 4.359999999999999987e-01
1.162670000000000023e-02 8.720000000000000320e-03 4.359999999999999987e-01
1.594999999999999890e-02 8.699999999999999400e-03 4.349999999999999978e-01
2.025329999999999839e-02 8.680000000000000215e-03 4.339999999999999969e-01
2.459329999999999850e-02 8.680000000000000215e-03 4.339999999999999969e-01
2.893329999999999860e-02 8.680000000000000215e-03 4.339999999999999969e-01
3.327329999999999871e-02 8.680000000000000215e-03 4.339999999999999969e-01
3.769999999999999740e-02 8.699999999999999400e-03 4.349999999999999978e-01
4.214670000000000222e-02 8.720000000000000320e-03 4.359999999999999987e-01
4.682669999999999888e-02 8.779999999999999610e-03 4.390000000000000013e-01
5.168330000000000146e-02 8.859999999999999820e-03 4.430000000000000049e-01
5.636669999999999875e-02 8.899999999999999925e-03 4.450000000000000067e-01
6.067999999999999783e-02 8.880000000000000740e-03 4.440000000000000058e-01
6.511999999999999733e-02 8.880000000000000740e-03 4.440000000000000058e-01
-4.265329999999999816e-02 1.370999999999999996e-02 4.570000000000000173e-01
-3.783330000000000026e-02 1.362000000000000016e-02 4.540000000000000147e-01
-3.307329999999999992e-02 1.353000000000000036e-02 4.510000000000000120e-01
-2.843669999999999878e-02 1.346999999999999933e-02 4.490000000000000102e-01
-2.389329999999999926e-02 1.344000000000000056e-02 4.480000000000000093e-01
-1.928329999999999975e-02 1.335000000000000075e-02 4.450000000000000067e-01
-1.476670000000000066e-02 1.328999999999999973e-02 4.430000000000000049e-01
-1.031329999999999920e-02 1.325999999999999922e-02 4.420000000000000040e-01
-5.866670000000000045e-03 1.319999999999999993e-02 4.400000000000000022e-01
-1.459999999999999926e-03 1.314000000000000064e-02 4.380000000000000004e-01
2.913329999999999999e-03 1.311000000000000013e-02 4.369999999999999996e-01
7.300000000000000065e-03 1.314000000000000064e-02 4.380000000000000004e-01
1.167999999999999941e-02 1.314000000000000064e-02 4.380000000000000004e-01
1.606000000000000136e-02 1.314000000000000064e-02 4.380000000000000004e-01
2.034669999999999881e-02 1.307999999999999961e-02 4.359999999999999987e-01
2.464999999999999830e-02 1.305000000000000084e-02 4.349999999999999978e-01
2.900000000000000147e-02 1.305000000000000084e-02 4.349999999999999978e-01
3.342669999999999669e-02 1.307999999999999961e-02 4.359999999999999987e-01
3.796000000000000069e-02 1.314000000000000064e-02 4.380000000000000004e-01
4.243670000000000081e-02 1.316999999999999942e-02 4.390000000000000013e-01
4.714669999999999972e-02 1.325999999999999922e-02 4.420000000000000040e-01
5.191670000000000312e-02 1.335000000000000075e-02 4.450000000000000067e-01
5.636669999999999875e-02 1.335000000000000075e-02 4.450000000000000067e-01
6.095330000000000192e-02 1.337999999999999953e-02 4.460000000000000075e-01
6.541329999999999367e-02 1.337999999999999953e-02 4.460000000000000075e-01
-4.293330000000000063e-02 1.839999999999999969e-02 4.600000000000000200e-01
-3.841669999999999807e-02 1.844000000000000153e-02 4.610000000000000209e-01
-3.366000000000000242e-02 1.836000000000000132e-02 4.590000000000000191e-01
-2.881670000000000065e-02 1.820000000000000090e-02 4.550000000000000155e-01
-2.405329999999999968e-02 1.804000000000000048e-02 4.510000000000000120e-01
-1.941330000000000139e-02 1.791999999999999843e-02 4.480000000000000093e-01
-1.483330000000000065e-02 1.779999999999999985e-02 4.450000000000000067e-01
-1.038329999999999982e-02 1.779999999999999985e-02 4.450000000000000067e-01
-5.906670000000000149e-03 1.771999999999999964e-02 4.430000000000000049e-01
-1.469999999999999953e-03 1.763999999999999943e-02 4.410000000000000031e-01
2.933330000000000052e-03 1.760000000000000106e-02 4.400000000000000022e-01
7.333329999999999883e-03 1.760000000000000106e-02 4.400000000000000022e-01
1.167999999999999941e-02 1.752000000000000085e-02 4.380000000000000004e-01
1.613329999999999972e-02 1.760000000000000106e-02 4.400000000000000022e-01
2.048670000000000005e-02 1.755999999999999922e-02 4.390000000000000013e-01
2.493329999999999852e-02 1.760000000000000106e-02 4.400000000000000022e-01
2.939999999999999905e-02 1.763999999999999943e-02 4.410000000000000031e-01
3.373330000000000078e-02 1.760000000000000106e-02 4.400000000000000022e-01
3.821999999999999703e-02 1.763999999999999943e-02 4.410000000000000031e-01
4.282330000000000164e-02 1.771999999999999964e-02 4.430000000000000049e-01
4.746670000000000056e-02 1.779999999999999985e-02 4.450000000000000067e-01
5.203329999999999761e-02 1.784000000000000169e-02 4.460000000000000075e-01
5.661999999999999672e-02 1.788000000000000006e-02 4.470000000000000084e-01
6.149999999999999911e-02 1.799999999999999864e-02 4.500000000000000111e-01
6.614670000000000272e-02 1.804000000000000048e-02 4.510000000000000120e-01
-3.824999999999999928e-02 2.295000000000000165e-02 4.590000000000000191e-01
-3.373330000000000078e-02 2.299999999999999961e-02 4.600000000000000200e-01
-2.913330000000000086e-02 2.299999999999999961e-02 4.600000000000000200e-01
-2.432000000000000134e-02 2.280000000000000082e-02 4.560000000000000164e-01
-1.958669999999999856e-02 2.259999999999999856e-02 4.520000000000000129e-01
-1.499999999999999944e-02 2.249999999999999917e-02 4.500000000000000111e-01
-1.045330000000000044e-02 2.239999999999999977e-02 4.480000000000000093e-01
-5.960000000000000020e-03 2.234999999999999834e-02 4.470000000000000084e-01
-1.483329999999999935e-03 2.224999999999999895e-02 4.450000000000000067e-01
2.953330000000000104e-03 2.214999999999999955e-02 4.430000000000000049e-01
7.383329999999999581e-03 2.214999999999999955e-02 4.430000000000000049e-01
1.181330000000000054e-02 2.214999999999999955e-02 4.430000000000000049e-01
1.627999999999999933e-02 2.220000000000000098e-02 4.440000000000000058e-01
2.067329999999999862e-02 2.214999999999999955e-02 4.430000000000000049e-01
2.515999999999999834e-02 2.220000000000000098e-02 4.440000000000000058e-01
2.960000000000000131e-02 2.220000000000000098e-02 4.440000000000000058e-01
3.404000000000000081e-02 2.220000000000000098e-02 4.440000000000000058e-01
3.848000000000000032e-02 2.220000000000000098e-02 4.440000000000000058e-01
4.311330000000000023e-02 2.230000000000000038e-02 4.460000000000000075e-01
4.778670000000000140e-02 2.239999999999999977e-02 4.480000000000000093e-01
5.249999999999999806e-02 2.249999999999999917e-02 4.500000000000000111e-01
5.775999999999999884e-02 2.280000000000000082e-02 4.560000000000000164e-01
6.314000000000000168e-02 2.309999999999999901e-02 4.620000000000000218e-01
-3.351330000000000281e-02 2.741999999999999993e-02 4.570000000000000173e-01
-2.894330000000000166e-02 2.741999999999999993e-02 4.570000000000000173e-01
-2.437330000000000052e-02 2.741999999999999993e-02 4.570000000000000173e-01
-1.980329999999999938e-02 2.741999999999999993e-02 4.570000000000000173e-01
-1.516669999999999997e-02 2.730000000000000135e-02 4.550000000000000155e-01
-1.059329999999999994e-02 2.724000000000000032e-02 4.540000000000000147e-01
-6.000000000000000125e-03 2.699999999999999969e-02 4.500000000000000111e-01
-1.496670000000000075e-03 2.693999999999999867e-02 4.490000000000000102e-01
2.980000000000000010e-03 2.682000000000000009e-02 4.470000000000000084e-01
7.450000000000000025e-03 2.682000000000000009e-02 4.470000000000000084e-01
1.192000000000000004e-02 2.682000000000000009e-02 4.470000000000000084e-01
1.638999999999999832e-02 2.682000000000000009e-02 4.470000000000000084e-01
2.086000000000000007e-02 2.682000000000000009e-02 4.470000000000000084e-01
2.527329999999999854e-02 2.675999999999999907e-02 4.460000000000000075e-01
2.980000000000000010e-02 2.682000000000000009e-02 4.470000000000000084e-01
3.434670000000000084e-02 2.688000000000000111e-02 4.480000000000000093e-01
3.882669999999999871e-02 2.688000000000000111e-02 4.480000000000000093e-01
4.349999999999999700e-02 2.699999999999999969e-02 4.500000000000000111e-01
4.842670000000000308e-02 2.724000000000000032e-02 4.540000000000000147e-01
5.331670000000000159e-02 2.741999999999999993e-02 4.570000000000000173e-01
5.890000000000000097e-02 2.790000000000000119e-02 4.650000000000000244e-01
6.368669999999999887e-02 2.795999999999999874e-02 4.660000000000000253e-01
-2.881670000000000065e-02 3.185000000000000331e-02 4.550000000000000155e-01
-2.437330000000000052e-02 3.198999999999999760e-02 4.570000000000000173e-01
-1.984669999999999837e-02 3.205999999999999822e-02 4.580000000000000182e-01
-1.523329999999999997e-02 3.198999999999999760e-02 4.570000000000000173e-01
-1.066330000000000056e-02 3.198999999999999760e-02 4.570000000000000173e-01
-6.093330000000000100e-03 3.198999999999999760e-02 4.570000000000000173e-01
-1.516669999999999911e-03 3.185000000000000331e-02 4.550000000000000155e-01
3.026669999999999968e-03 3.178000000000000269e-02 4.540000000000000147e-01
7.566670000000000167e-03 3.178000000000000269e-02 4.540000000000000147e-01
1.205329999999999943e-02 3.164000000000000146e-02 4.520000000000000129e-01
1.653670000000000140e-02 3.157000000000000084e-02 4.510000000000000120e-01
2.100000000000000130e-02 3.150000000000000022e-02 4.500000000000000111e-01
2.549999999999999836e-02 3.150000000000000022e-02 4.500000000000000111e-01
3.006669999999999829e-02 3.157000000000000084e-02 4.510000000000000120e-01
3.465329999999999799e-02 3.164000000000000146e-02 4.520000000000000129e-01
3.934669999999999834e-02 3.178000000000000269e-02 4.540000000000000147e-01
4.417669999999999930e-02 3.198999999999999760e-02 4.570000000000000173e-01
4.917330000000000312e-02 3.227000000000000007e-02 4.610000000000000209e-01
5.448329999999999840e-02 3.268999999999999684e-02 4.670000000000000262e-01
5.940669999999999978e-02 3.282999999999999807e-02 4.689999999999999725e-01
-1.967330000000000120e-02 3.631999999999999812e-02 4.540000000000000147e-01
-1.519999999999999997e-02 3.647999999999999854e-02 4.560000000000000164e-01
-1.064000000000000015e-02 3.647999999999999854e-02 4.560000000000000164e-01
-6.106669999999999807e-03 3.663999999999999896e-02 4.580000000000000182e-01
-1.529999999999999893e-03 3.672000000000000264e-02 4.590000000000000191e-01
3.053329999999999933e-03 3.663999999999999896e-02 4.580000000000000182e-01
7.649999999999999682e-03 3.672000000000000264e-02 4.590000000000000191e-01
1.231999999999999935e-02 3.695999999999999980e-02 4.620000000000000218e-01
1.694000000000000020e-02 3.695999999999999980e-02 4.620000000000000218e-01
2.155999999999999930e-02 3.695999999999999980e-02 4.620000000000000218e-01
2.617999999999999841e-02 3.695999999999999980e-02 4.620000000000000218e-01
3.086670000000000039e-02 3.703999999999999654e-02 4.630000000000000226e-01
3.549669999999999909e-02 3.703999999999999654e-02 4.630000000000000226e-01
4.021330000000000043e-02 3.712000000000000022e-02 4.640000000000000235e-01
4.504670000000000202e-02 3.728000000000000064e-02 4.660000000000000253e-01
5.013329999999999870e-02 3.760000000000000148e-02 4.699999999999999734e-01
5.518329999999999763e-02 3.783999999999999864e-02 4.729999999999999760e-01
5.839330000000000215e-02 3.688000000000000306e-02 4.610000000000000209e-01
-1.954329999999999956e-02 4.059000000000000108e-02 4.510000000000000120e-01
-1.513330000000000057e-02 4.086000000000000049e-02 4.540000000000000147e-01
-1.061669999999999975e-02 4.095000000000000029e-02 4.550000000000000155e-01
-6.080000000000000335e-03 4.104000000000000009e-02 4.560000000000000164e-01
-1.520000000000000084e-03 4.104000000000000009e-02 4.560000000000000164e-01
3.046670000000000020e-03 4.112999999999999989e-02 4.570000000000000173e-01
7.649999999999999682e-03 4.130999999999999950e-02 4.590000000000000191e-01
1.229330000000000006e-02 4.148999999999999910e-02 4.610000000000000209e-01
1.697670000000000082e-02 4.166999999999999871e-02 4.630000000000000226e-01
2.165330000000000032e-02 4.175999999999999851e-02 4.640000000000000235e-01
2.634999999999999842e-02 4.184999999999999831e-02 4.650000000000000244e-01
3.106669999999999918e-02 4.193999999999999811e-02 4.660000000000000253e-01
3.580330000000000318e-02 4.202999999999999792e-02 4.670000000000000262e-01
4.064670000000000089e-02 4.220999999999999752e-02 4.689999999999999725e-01
4.553000000000000103e-02 4.238999999999999713e-02 4.709999999999999742e-01
5.045329999999999954e-02 4.256999999999999673e-02 4.729999999999999760e-01
5.460000000000000270e-02 4.211999999999999772e-02 4.680000000000000271e-01
-1.059329999999999994e-02 4.540000000000000285e-02 4.540000000000000147e-01
-6.053329999999999995e-03 4.540000000000000285e-02 4.540000000000000147e-01
-1.520000000000000084e-03 4.560000000000000164e-02 4.560000000000000164e-01
3.040000000000000167e-03 4.560000000000000164e-02 4.560000000000000164e-01
7.616669999999999864e-03 4.569999999999999757e-02 4.570000000000000173e-01
1.218669999999999996e-02 4.569999999999999757e-02 4.570000000000000173e-01
1.683000000000000121e-02 4.590000000000000330e-02 4.590000000000000191e-01
2.146669999999999828e-02 4.599999999999999922e-02 4.600000000000000200e-01
2.617999999999999841e-02 4.619999999999999801e-02 4.620000000000000218e-01
3.099999999999999978e-02 4.649999999999999967e-02 4.650000000000000244e-01
3.580330000000000318e-02 4.669999999999999846e-02 4.670000000000000262e-01
4.055999999999999883e-02 4.680000000000000132e-02 4.680000000000000271e-01
4.533670000000000061e-02 4.689999999999999725e-02 4.689999999999999725e-01
4.981329999999999786e-02 4.669999999999999846e-02 4.670000000000000262e-01
5.366669999999999774e-02 4.599999999999999922e-02 4.600000000000000200e-01
-6.080000000000000335e-03 5.016000000000000320e-02 4.560000000000000164e-01
-1.516669999999999911e-03 5.004999999999999727e-02 4.550000000000000155e-01
3.033329999999999881e-03 5.004999999999999727e-02 4.550000000000000155e-01
7.583330000000000105e-03 5.004999999999999727e-02 4.550000000000000155e-01
1.216000000000000067e-02 5.016000000000000320e-02 4.560000000000000164e-01
1.671999999999999875e-02 5.016000000000000320e-02 4.560000000000000164e-01
2.137330000000000133e-02 5.038000000000000117e-02 4.580000000000000182e-01
2.612329999999999861e-02 5.070999999999999813e-02 4.610000000000000209e-01
3.086670000000000039e-02 5.093000000000000305e-02 4.630000000000000226e-01
3.572670000000000012e-02 5.126000000000000001e-02 4.660000000000000253e-01
4.038669999999999760e-02 5.126000000000000001e-02 4.660000000000000253e-01
4.456330000000000013e-02 5.070999999999999813e-02 4.610000000000000209e-01
4.864000000000000268e-02 5.016000000000000320e-02 4.560000000000000164e-01
-1.513330000000000014e-03 5.448000000000000065e-02 4.540000000000000147e-01
3.033329999999999881e-03 5.460000000000000270e-02 4.550000000000000155e-01
7.583330000000000105e-03 5.460000000000000270e-02 4.550000000000000155e-01
1.213329999999999964e-02 5.460000000000000270e-02 4.550000000000000155e-01
1.671999999999999875e-02 5.471999999999999781e-02 4.560000000000000164e-01
2.142000000000000154e-02 5.507999999999999702e-02 4.590000000000000191e-01
2.606670000000000167e-02 5.519999999999999907e-02 4.600000000000000200e-01
3.073330000000000159e-02 5.532000000000000112e-02 4.610000000000000209e-01
3.542000000000000010e-02 5.544000000000000317e-02 4.620000000000000218e-01
3.986669999999999797e-02 5.519999999999999907e-02 4.600000000000000200e-01
4.408000000000000113e-02 5.471999999999999781e-02 4.560000000000000164e-01
7.566670000000000167e-03 5.902000000000000302e-02 4.540000000000000147e-01
1.213329999999999964e-02 5.915000000000000119e-02 4.550000000000000155e-01
1.668330000000000160e-02 5.915000000000000119e-02 4.550000000000000155e-01
2.132670000000000052e-02 5.940999999999999753e-02 4.570000000000000173e-01
2.595329999999999859e-02 5.954000000000000264e-02 4.580000000000000182e-01
3.053329999999999933e-02 5.954000000000000264e-02 4.580000000000000182e-01
3.488329999999999903e-02 5.915000000000000119e-02 4.550000000000000155e-01
3.926000000000000323e-02 5.888999999999999790e-02 4.530000000000000138e-01
7.450000000000000025e-03 6.257999999999999674e-02 4.470000000000000084e-01
1.205329999999999943e-02 6.328000000000000291e-02 4.520000000000000129e-01
1.668330000000000160e-02 6.370000000000000662e-02 4.550000000000000155e-01
2.137330000000000133e-02 6.411999999999999644e-02 4.580000000000000182e-01
2.600999999999999840e-02 6.425999999999999768e-02 4.590000000000000191e-01
3.046669999999999934e-02 6.397999999999999521e-02 4.570000000000000173e-01
3.480670000000000291e-02 6.356000000000000538e-02 4.540000000000000147e-01
1.181330000000000054e-02 6.644999999999999518e-02 4.430000000000000049e-01
2.123330000000000009e-02 6.825000000000000511e-02 4.550000000000000155e-01
3.046669999999999934e-02 6.854999999999999982e-02 4.570000000000000173e-01
