-0.097686 -0.069600 0.477294 
-0.098298 -0.065149 0.475825 
-0.097632 -0.060004 0.475965 
-0.089676 -0.068936 0.470885 
-0.091856 -0.071619 0.475413 
-0.085801 -0.070066 0.469580 
-0.085801 -0.073593 0.473650 
-0.089663 -0.056739 0.463393 
-0.084465 -0.063514 0.462859 
-0.082825 -0.054960 0.456861 
-0.085996 -0.058201 0.460775 
-0.091301 -0.065149 0.469290 
-0.094827 -0.065149 0.472299 
-0.091517 -0.058692 0.467028 
-0.095064 -0.057830 0.474053 
-0.086410 -0.065579 0.465744 
-0.089166 -0.061441 0.464256 
-0.101940 -0.064698 0.481716 
-0.098824 -0.058870 0.481764 
-0.095499 -0.055344 0.481764 
-0.089663 -0.053602 0.463393 
-0.082741 -0.051043 0.456876 
-0.086063 -0.051168 0.460868 
-0.082346 -0.047437 0.457027 
-0.083071 -0.047019 0.460606 
-0.090353 -0.052958 0.467659 
-0.091260 -0.052858 0.474711 
-0.086839 -0.049432 0.467659 
-0.085331 -0.048978 0.475220 
-0.083313 -0.046913 0.467659 
-0.040596 -0.083051 0.463868 
-0.036432 -0.084309 0.462666 
-0.027022 -0.083456 0.456583 
-0.029587 -0.086353 0.460457 
-0.061675 -0.047740 0.449948 
-0.062470 -0.043991 0.449597 
-0.057590 -0.048837 0.449570 
-0.057590 -0.043991 0.448359 
-0.062192 -0.036938 0.449565 
-0.061305 -0.033087 0.449906 
-0.057590 -0.036938 0.447672 
-0.057832 -0.030396 0.447956 
-0.048011 -0.055243 0.449828 
-0.043485 -0.056789 0.449370 
-0.026725 -0.069206 0.449821 
-0.035175 -0.063051 0.449497 
-0.037088 -0.058762 0.448565 
-0.029198 -0.065301 0.448938 
-0.029380 -0.058096 0.446614 
-0.050432 -0.051260 0.449035 
-0.050538 -0.043991 0.446929 
-0.043485 -0.051043 0.447784 
-0.043485 -0.043991 0.445994 
-0.050538 -0.036938 0.445288 
-0.048695 -0.028330 0.442454 
-0.050842 -0.030363 0.443864 
-0.041897 -0.033635 0.442904 
-0.043943 -0.036367 0.443905 
-0.043943 -0.030363 0.442162 
-0.046599 -0.033032 0.443086 
-0.036432 -0.051043 0.446566 
-0.036432 -0.043991 0.445334 
-0.029380 -0.051043 0.445240 
-0.029380 -0.043991 0.444507 
-0.036432 -0.033800 0.442852 
-0.036432 -0.037327 0.443838 
-0.036432 -0.029885 0.441689 
-0.029380 -0.034390 0.442730 
-0.029380 -0.037916 0.443561 
-0.029380 -0.029885 0.441529 
-0.076680 -0.069144 0.463768 
-0.071696 -0.069929 0.463281 
-0.076077 -0.076149 0.470656 
-0.078729 -0.072058 0.467650 
-0.080778 -0.074971 0.472125 
-0.071696 -0.077178 0.469671 
-0.071696 -0.073455 0.466145 
-0.078918 -0.065579 0.462031 
-0.078748 -0.056006 0.456282 
-0.078748 -0.059533 0.458253 
-0.071696 -0.065149 0.460295 
-0.071696 -0.057192 0.455545 
-0.071696 -0.060718 0.457621 
-0.081382 -0.068216 0.464643 
-0.064643 -0.071078 0.462596 
-0.055366 -0.076261 0.463787 
-0.057667 -0.072697 0.462041 
-0.064643 -0.078606 0.468491 
-0.064643 -0.074604 0.464965 
-0.058202 -0.079508 0.467446 
-0.060068 -0.075379 0.464381 
-0.062230 -0.062159 0.456770 
-0.064606 -0.064765 0.458813 
-0.064606 -0.058573 0.455245 
-0.066932 -0.061243 0.457314 
-0.057590 -0.063179 0.456154 
-0.057590 -0.066705 0.458250 
-0.057590 -0.058096 0.453431 
-0.078748 -0.051043 0.455294 
-0.078748 -0.046161 0.456092 
-0.078748 -0.044663 0.460606 
-0.071696 -0.051043 0.453186 
-0.071670 -0.043659 0.454236 
-0.071670 -0.041625 0.460825 
-0.069302 -0.039900 0.455486 
-0.064273 -0.050472 0.451481 
-0.065997 -0.043991 0.450947 
-0.057590 -0.052363 0.450830 
-0.064185 -0.036945 0.453602 
-0.050538 -0.077345 0.462895 
-0.048038 -0.069351 0.456663 
-0.050448 -0.071901 0.459203 
-0.043162 -0.079522 0.461827 
-0.043485 -0.070850 0.455799 
-0.043485 -0.074376 0.457923 
-0.050538 -0.080871 0.465932 
-0.045298 -0.082052 0.464855 
-0.050448 -0.065367 0.455279 
-0.052740 -0.067863 0.457567 
-0.050432 -0.057795 0.451459 
-0.043485 -0.065149 0.452806 
-0.043485 -0.060316 0.450560 
-0.035064 -0.077296 0.456109 
-0.037022 -0.079490 0.458774 
-0.037022 -0.072830 0.454524 
-0.039766 -0.075601 0.457158 
-0.029376 -0.079490 0.455213 
-0.031724 -0.081998 0.457739 
-0.029198 -0.071814 0.451491 
-0.037088 -0.065301 0.450887 
-0.039877 -0.061558 0.450046 
-0.031427 -0.067753 0.450380 
-0.052713 -0.053755 0.450295 
-0.056381 -0.022833 0.446827 
-0.054196 -0.014518 0.442825 
-0.055059 -0.016434 0.445802 
-0.054196 -0.011912 0.442825 
-0.054176 -0.011985 0.446501 
-0.050023 -0.022833 0.441876 
-0.053549 -0.022833 0.443300 
-0.051232 -0.016434 0.441613 
-0.054045 -0.019220 0.442985 
-0.043485 -0.022833 0.440367 
-0.043485 -0.015780 0.439480 
-0.050384 -0.009228 0.441694 
-0.047931 -0.003167 0.442165 
-0.043485 -0.008727 0.439559 
-0.044132 -0.001160 0.441220 
-0.036432 -0.022833 0.439972 
-0.036432 -0.015780 0.439228 
-0.029380 -0.022833 0.439925 
-0.029380 -0.015780 0.439065 
-0.036432 -0.008727 0.439125 
-0.036432 -0.001675 0.439747 
-0.029380 -0.008727 0.438744 
-0.029380 -0.001675 0.439250 
-0.042212 0.002589 0.442139 
-0.036432 0.003531 0.441690 
-0.036610 0.006127 0.446273 
-0.035595 0.012431 0.448213 
-0.028905 0.005574 0.441645 
-0.030939 0.008056 0.443771 
-0.026237 0.009070 0.442831 
-0.028905 0.011824 0.444788 
-0.034796 0.019483 0.449292 
-0.033314 0.023343 0.449911 
-0.029380 0.019483 0.447542 
-0.029380 0.024402 0.449398 
-0.041077 0.013902 0.454851 
-0.042161 0.019483 0.454217 
-0.042290 0.026536 0.455186 
-0.039104 0.011903 0.452921 
-0.038323 0.019483 0.450691 
-0.035972 0.026030 0.451731 
-0.029380 0.027929 0.450819 
-0.041249 0.032204 0.456142 
-0.041270 0.034106 0.460053 
-0.037001 0.034168 0.455024 
-0.039786 0.036927 0.460053 
-0.035029 0.038462 0.456278 
-0.036289 0.040071 0.460052 
-0.029380 0.033588 0.453002 
-0.029380 0.039404 0.455736 
-0.030450 0.043274 0.460100 
-0.029222 0.045075 0.461611 
0.007081 -0.083343 0.449664 
0.012936 -0.083752 0.449271 
0.019989 -0.084004 0.448887 
0.027041 -0.083924 0.448917 
-0.022327 -0.084324 0.456059 
-0.022327 -0.087851 0.458746 
-0.015275 -0.085334 0.455510 
-0.015275 -0.088860 0.457912 
-0.005832 -0.090154 0.456798 
-0.008199 -0.092847 0.459688 
-0.008199 -0.086814 0.455090 
-0.010534 -0.089504 0.457361 
-0.001169 -0.090813 0.456228 
-0.001169 -0.094339 0.459304 
-0.001169 -0.086306 0.453113 
0.005883 -0.091450 0.455588 
0.005883 -0.094977 0.458880 
0.005191 -0.085939 0.451657 
0.012936 -0.091458 0.455495 
0.012936 -0.094985 0.459027 
0.012936 -0.087278 0.451969 
0.019989 -0.091269 0.455660 
0.019989 -0.094795 0.459249 
0.019989 -0.087531 0.452134 
0.027041 -0.091072 0.455891 
0.027041 -0.094598 0.459624 
0.027041 -0.087450 0.452365 
-0.022327 -0.070222 0.449379 
-0.011750 -0.075728 0.450027 
-0.014570 -0.072415 0.449021 
-0.022327 -0.065149 0.447331 
-0.022327 -0.058096 0.445031 
-0.015275 -0.065149 0.445872 
-0.013653 -0.056604 0.442407 
-0.015712 -0.058611 0.443557 
-0.008222 -0.076741 0.449482 
-0.008222 -0.072201 0.447386 
-0.001169 -0.078498 0.448401 
0.001760 -0.069007 0.442827 
-0.000822 -0.071695 0.444840 
-0.006393 -0.062649 0.442493 
-0.008535 -0.065060 0.444202 
-0.008535 -0.058611 0.441640 
-0.011094 -0.061306 0.443113 
-0.000822 -0.065060 0.441975 
-0.002942 -0.067351 0.443550 
-0.001169 -0.058096 0.439700 
-0.019465 -0.049419 0.442782 
-0.022021 -0.051479 0.443694 
-0.020439 -0.043991 0.442456 
-0.023965 -0.043991 0.443500 
-0.015712 -0.051479 0.441956 
-0.018355 -0.054121 0.443107 
-0.015275 -0.043991 0.440823 
-0.022534 -0.036838 0.442031 
-0.025022 -0.039123 0.443247 
-0.022327 -0.029885 0.440749 
-0.015275 -0.036938 0.439949 
-0.015275 -0.029885 0.439340 
-0.008222 -0.051043 0.439859 
-0.008222 -0.043991 0.438934 
-0.001169 -0.051043 0.438375 
-0.001169 -0.043991 0.437726 
-0.008222 -0.036938 0.438272 
-0.008222 -0.029885 0.438042 
-0.001169 -0.036938 0.437320 
-0.001169 -0.029885 0.437386 
0.005191 -0.079955 0.447772 
0.005883 -0.070153 0.442318 
0.005883 -0.073679 0.443954 
0.016253 -0.075769 0.442944 
0.013516 -0.078574 0.445429 
0.013516 -0.072479 0.441785 
0.011552 -0.075015 0.443371 
0.014996 -0.055495 0.435792 
0.005883 -0.065149 0.440356 
0.005883 -0.058096 0.438134 
0.012936 -0.065149 0.438839 
0.012761 -0.057946 0.436716 
0.019989 -0.076040 0.442751 
0.019989 -0.079566 0.445360 
0.019989 -0.072201 0.440800 
0.027041 -0.076173 0.442659 
0.027041 -0.079700 0.445390 
0.027041 -0.072201 0.440730 
0.019989 -0.056240 0.435738 
0.024570 -0.055870 0.435807 
0.019989 -0.065149 0.437972 
0.019989 -0.059766 0.436396 
0.027041 -0.065149 0.438158 
0.026969 -0.058171 0.436620 
0.014996 -0.052959 0.435792 
0.005883 -0.051043 0.437187 
0.005883 -0.043991 0.437159 
0.012761 -0.050782 0.436272 
0.012936 -0.043991 0.437041 
0.005883 -0.036938 0.437128 
0.005883 -0.029885 0.437387 
0.012936 -0.036938 0.437593 
0.012936 -0.029885 0.437855 
0.019989 -0.052465 0.435738 
0.024570 -0.053374 0.435807 
0.019989 -0.048939 0.436351 
0.019989 -0.043991 0.437931 
0.026969 -0.051031 0.436912 
0.027543 -0.043429 0.440425 
0.030229 -0.040704 0.443113 
0.019989 -0.036938 0.439357 
0.019989 -0.029885 0.439576 
0.025668 -0.036938 0.441865 
0.029194 -0.036938 0.443813 
0.025097 -0.029885 0.441958 
0.028624 -0.029885 0.444255 
-0.022327 -0.079254 0.453325 
-0.022327 -0.073749 0.450820 
-0.014570 -0.078549 0.451802 
-0.016452 -0.074909 0.450376 
-0.008222 -0.080268 0.451277 
-0.001169 -0.082024 0.450438 
0.002379 -0.082773 0.450032 
0.034094 -0.083269 0.449554 
0.037676 -0.082807 0.450001 
0.034094 -0.086795 0.453022 
0.031478 -0.075948 0.442821 
0.033935 -0.078681 0.445695 
0.033935 -0.072400 0.441833 
0.036180 -0.074883 0.443438 
0.040475 -0.079071 0.448545 
0.038904 -0.070182 0.442422 
0.041212 -0.072400 0.444692 
0.034094 -0.065149 0.439458 
0.034094 -0.058096 0.438346 
0.040227 -0.065149 0.441678 
0.043753 -0.065149 0.443505 
0.041715 -0.057506 0.441554 
0.044536 -0.057506 0.443067 
0.045576 -0.076598 0.449470 
0.047015 -0.072201 0.448300 
0.048826 -0.065432 0.447469 
0.047494 -0.057506 0.445557 
0.052108 -0.058096 0.449613 
0.034094 -0.051043 0.439150 
0.034094 -0.045484 0.441572 
0.034094 -0.041957 0.444116 
0.039981 -0.051043 0.441782 
0.043507 -0.051043 0.443611 
0.038486 -0.046917 0.442576 
0.041168 -0.043981 0.446416 
0.034467 -0.036899 0.447296 
0.033445 -0.029885 0.447781 
0.039149 -0.039223 0.449059 
0.048416 -0.051254 0.447547 
0.046209 -0.045746 0.448474 
0.051961 -0.053746 0.449745 
0.043851 -0.041044 0.450667 
0.037066 -0.034522 0.450466 
0.036972 -0.029885 0.450548 
0.041777 -0.036654 0.452918 
0.044406 -0.034086 0.457409 
0.040597 -0.029885 0.454074 
0.044123 -0.029885 0.457801 
0.050911 -0.049044 0.450918 
0.048551 -0.043522 0.453144 
0.050893 -0.041299 0.458117 
0.046192 -0.038787 0.455369 
0.048539 -0.036717 0.460114 
0.046788 -0.029885 0.461327 
-0.022327 -0.022833 0.439454 
-0.022327 -0.015780 0.438361 
-0.015275 -0.022833 0.438528 
-0.015275 -0.015780 0.437472 
-0.022327 -0.008727 0.437860 
-0.022327 -0.001675 0.438485 
-0.015275 -0.008727 0.437155 
-0.015275 -0.001675 0.438278 
-0.008222 -0.022833 0.437772 
-0.008222 -0.015780 0.437095 
-0.001169 -0.022833 0.438109 
-0.001169 -0.015780 0.437937 
-0.008222 -0.008727 0.437026 
-0.008222 -0.001675 0.438561 
-0.001169 -0.008727 0.437472 
-0.001169 -0.001675 0.438990 
-0.022327 0.005378 0.440509 
-0.022327 0.010229 0.442396 
-0.022327 0.013755 0.443793 
-0.015275 0.005378 0.440417 
-0.015275 0.010847 0.442263 
-0.015275 0.014373 0.443636 
-0.022327 0.019483 0.446114 
-0.022327 0.025550 0.448821 
-0.015275 0.019483 0.445823 
-0.015275 0.025960 0.448687 
-0.008222 0.005378 0.441060 
-0.008222 0.009823 0.442665 
-0.008222 0.013349 0.443992 
-0.001195 0.005872 0.441821 
0.001139 0.008553 0.443120 
-0.003562 0.009140 0.442883 
-0.001195 0.011867 0.444229 
-0.008222 0.019483 0.446416 
-0.008222 0.025604 0.448925 
-0.001169 0.019483 0.447343 
-0.001169 0.024511 0.449410 
0.005883 -0.022833 0.438812 
0.005883 -0.015780 0.439127 
0.012936 -0.022833 0.438835 
0.012936 -0.015780 0.439466 
0.005883 -0.008727 0.438486 
0.005883 -0.001675 0.439807 
0.012936 -0.008727 0.439531 
0.012936 -0.001675 0.440803 
0.019989 -0.022833 0.439791 
0.019989 -0.015780 0.440315 
0.025635 -0.022833 0.441912 
0.029161 -0.022833 0.443858 
0.025714 -0.015780 0.442090 
0.029241 -0.015780 0.443666 
0.019989 -0.008727 0.440818 
0.020148 -0.001728 0.442089 
0.022604 0.000587 0.443383 
0.025116 -0.008727 0.442339 
0.028642 -0.008727 0.444020 
0.024292 -0.004115 0.442652 
0.026802 -0.001728 0.444654 
0.005883 0.004297 0.441963 
0.005883 0.007823 0.443420 
0.005883 0.012431 0.445323 
0.012936 0.003167 0.442433 
0.012936 0.006694 0.443884 
0.012936 0.012431 0.446245 
0.006441 0.020140 0.448575 
0.004462 0.023622 0.449772 
0.012936 0.018787 0.448862 
0.017903 0.002345 0.442771 
0.020148 0.004969 0.444402 
0.019989 0.012431 0.447299 
0.027041 0.005378 0.446971 
0.026796 0.011913 0.449104 
0.019989 0.017634 0.449347 
0.024281 0.016690 0.449739 
-0.022327 0.029077 0.450494 
-0.015275 0.029487 0.450306 
-0.008222 0.029130 0.450493 
-0.001169 0.028037 0.450931 
0.009163 0.022929 0.450060 
0.006441 0.026198 0.451083 
0.012936 0.022313 0.450313 
0.012936 0.026536 0.452050 
0.028983 0.013919 0.450726 
0.019989 0.021160 0.450778 
0.019989 0.026536 0.452977 
0.026796 0.019218 0.451740 
0.027041 0.026536 0.454591 
-0.022327 0.033588 0.452495 
-0.022327 0.039848 0.455554 
-0.022327 0.043375 0.457509 
-0.015275 0.033588 0.452325 
-0.015275 0.040111 0.455573 
-0.015275 0.043637 0.457366 
-0.021695 0.047714 0.461613 
-0.018922 0.051293 0.464063 
-0.015275 0.047694 0.460151 
-0.015275 0.052130 0.463391 
-0.018922 0.051293 0.466447 
-0.015311 0.054178 0.468206 
-0.008222 0.033588 0.452786 
-0.008222 0.039706 0.455846 
-0.008222 0.043232 0.457503 
-0.001169 0.033588 0.453533 
-0.001169 0.039037 0.456156 
-0.001169 0.042564 0.457718 
-0.008222 0.047694 0.459586 
-0.008222 0.053457 0.462689 
-0.001169 0.047694 0.459718 
-0.001169 0.054211 0.462606 
-0.008222 0.056983 0.465282 
-0.001169 0.057737 0.464511 
-0.011847 0.058342 0.469965 
-0.008222 0.059050 0.468808 
-0.001169 0.060257 0.468037 
0.005883 0.033588 0.454154 
0.005883 0.038657 0.456385 
0.005883 0.042183 0.457755 
0.012936 0.033588 0.454956 
0.012936 0.037915 0.456746 
0.012936 0.041441 0.458084 
0.005883 0.047694 0.459656 
0.005652 0.055329 0.462707 
0.012936 0.047694 0.460186 
0.012936 0.054746 0.462509 
0.003147 0.058068 0.464235 
0.019615 0.033954 0.455975 
0.021718 0.036549 0.457312 
0.017016 0.037289 0.457008 
0.019615 0.040040 0.458469 
0.027041 0.031490 0.456499 
0.027041 0.035016 0.457828 
0.027041 0.040641 0.459944 
0.019989 0.047694 0.461302 
0.019564 0.054861 0.463406 
0.027727 0.048382 0.462769 
0.021631 0.057288 0.464415 
0.030536 0.051193 0.464139 
0.007849 0.058681 0.463924 
0.012936 0.058671 0.463934 
0.005652 0.060908 0.467015 
0.016930 0.058395 0.464077 
0.019564 0.061167 0.466021 
0.034613 -0.022710 0.447823 
0.034094 -0.015780 0.446970 
0.037797 -0.020278 0.449878 
0.037889 -0.015780 0.449805 
0.034544 -0.009018 0.447954 
0.033058 -0.001675 0.448294 
0.037802 -0.011562 0.449880 
0.031796 0.005378 0.449285 
0.030811 0.009217 0.449920 
0.037310 -0.024980 0.450282 
0.040119 -0.022710 0.453001 
0.044138 -0.022833 0.457810 
0.041025 -0.015780 0.453553 
0.044283 -0.015780 0.457618 
0.037195 -0.006861 0.450379 
0.036584 -0.001675 0.450883 
0.040229 -0.009018 0.453059 
0.044271 -0.008727 0.457661 
0.040790 -0.001675 0.454409 
0.044316 -0.001675 0.457527 
0.046547 -0.022833 0.461336 
0.046361 -0.015780 0.461145 
0.050073 -0.022833 0.467276 
0.049887 -0.015780 0.467341 
0.046408 -0.008727 0.461188 
0.046695 -0.001675 0.461053 
0.049934 -0.008727 0.466884 
0.050221 -0.001675 0.466404 
0.052227 -0.008727 0.470411 
0.052470 -0.001675 0.469930 
0.035322 0.005378 0.451390 
0.033534 0.011913 0.452103 
0.040693 0.005378 0.454916 
0.044220 0.005378 0.457465 
0.039958 0.012431 0.455625 
0.043484 0.012431 0.457886 
0.034542 0.019860 0.455210 
0.037192 0.022461 0.457267 
0.032078 0.026536 0.456414 
0.035605 0.026536 0.457965 
0.038779 0.017760 0.456462 
0.041136 0.019860 0.458511 
0.041147 0.026536 0.460690 
0.046798 0.005378 0.460991 
0.046732 0.012431 0.461412 
0.050324 0.005378 0.466396 
0.050259 0.012431 0.466629 
0.052335 0.005378 0.469922 
0.054428 0.005378 0.474711 
0.052159 0.012431 0.470155 
0.053770 0.012431 0.474711 
0.046531 0.019483 0.462254 
0.045688 0.026536 0.463332 
0.050057 0.019483 0.466944 
0.049655 0.026705 0.468154 
0.051622 0.029169 0.471399 
0.052053 0.019483 0.470470 
0.053413 0.019483 0.474711 
0.051894 0.024467 0.470836 
0.052926 0.026705 0.474134 
0.030660 0.030180 0.457039 
0.033444 0.032954 0.459213 
0.034455 0.040906 0.462413 
0.041209 0.033151 0.462891 
0.038899 0.038732 0.463579 
0.037046 0.043433 0.464379 
0.043601 0.035211 0.464799 
0.041209 0.040906 0.465537 
0.032345 0.046491 0.463406 
0.034455 0.048382 0.464758 
0.044904 0.030509 0.463976 
0.047222 0.033151 0.467354 
0.051212 0.033588 0.472221 
0.046867 0.040641 0.469229 
0.052792 0.033588 0.475747 
