-1.449999999999999900e-03 -1.131000000000000061e-01 4.349999999999999978e-01
2.880000000000000181e-03 -1.123200000000000032e-01 4.319999999999999951e-01
-5.813330000000000233e-03 -1.089999999999999997e-01 4.359999999999999987e-01
-1.476670000000000023e-03 -1.107500000000000012e-01 4.430000000000000049e-01
2.993330000000000209e-03 -1.122500000000000026e-01 4.490000000000000102e-01
-5.960000000000000020e-03 -1.072800000000000004e-01 4.470000000000000084e-01
-1.520000000000000084e-03 -1.094399999999999956e-01 4.560000000000000164e-01
3.073329999999999985e-03 -1.106400000000000022e-01 4.610000000000000209e-01
7.666670000000000429e-03 -1.103999999999999981e-01 4.600000000000000200e-01
1.210669999999999975e-02 -1.089600000000000013e-01 4.540000000000000147e-01
-3.699999999999999817e-02 -1.021200000000000024e-01 4.440000000000000058e-01
-3.263329999999999703e-02 -1.023499999999999965e-01 4.450000000000000067e-01
-1.506670000000000058e-02 -1.039599999999999969e-01 4.520000000000000129e-01
-1.064000000000000015e-02 -1.048800000000000010e-01 4.560000000000000164e-01
-6.106669999999999807e-03 -1.053400000000000031e-01 4.580000000000000182e-01
-1.529999999999999893e-03 -1.055699999999999972e-01 4.590000000000000191e-01
3.053329999999999933e-03 -1.053400000000000031e-01 4.580000000000000182e-01
7.599999999999999985e-03 -1.048800000000000010e-01 4.560000000000000164e-01
1.216000000000000067e-02 -1.048800000000000010e-01 4.560000000000000164e-01
1.668330000000000160e-02 -1.046500000000000069e-01 4.550000000000000155e-01
-4.639669999999999905e-02 -9.878000000000000669e-02 4.490000000000000102e-01
-4.200000000000000261e-02 -9.900000000000000466e-02 4.500000000000000111e-01
-3.758330000000000004e-02 -9.922000000000000264e-02 4.510000000000000120e-01
-3.321999999999999953e-02 -9.965999999999999859e-02 4.530000000000000138e-01
-2.869000000000000022e-02 -9.965999999999999859e-02 4.530000000000000138e-01
-2.421330000000000010e-02 -9.987999999999999656e-02 4.540000000000000147e-01
-1.971670000000000020e-02 -1.000999999999999945e-01 4.550000000000000155e-01
-1.523329999999999997e-02 -1.005400000000000044e-01 4.570000000000000173e-01
-1.066330000000000056e-02 -1.005400000000000044e-01 4.570000000000000173e-01
-6.093330000000000100e-03 -1.005400000000000044e-01 4.570000000000000173e-01
-1.520000000000000084e-03 -1.003200000000000064e-01 4.560000000000000164e-01
3.040000000000000167e-03 -1.003200000000000064e-01 4.560000000000000164e-01
7.583330000000000105e-03 -1.000999999999999945e-01 4.550000000000000155e-01
1.216000000000000067e-02 -1.003200000000000064e-01 4.560000000000000164e-01
1.675669999999999937e-02 -1.005400000000000044e-01 4.570000000000000173e-01
2.123330000000000009e-02 -1.000999999999999945e-01 4.550000000000000155e-01
2.566999999999999837e-02 -9.965999999999999859e-02 4.530000000000000138e-01
-5.179330000000000045e-02 -9.596999999999999975e-02 4.570000000000000173e-01
-4.722330000000000277e-02 -9.596999999999999975e-02 4.570000000000000173e-01
-4.274669999999999859e-02 -9.618000000000000160e-02 4.580000000000000182e-01
-3.808330000000000048e-02 -9.596999999999999975e-02 4.570000000000000173e-01
-3.351330000000000281e-02 -9.596999999999999975e-02 4.570000000000000173e-01
-2.894330000000000166e-02 -9.596999999999999975e-02 4.570000000000000173e-01
-2.432000000000000134e-02 -9.575999999999999790e-02 4.560000000000000164e-01
-1.971670000000000020e-02 -9.554999999999999605e-02 4.550000000000000155e-01
-1.513330000000000057e-02 -9.533999999999999420e-02 4.540000000000000147e-01
-1.059329999999999994e-02 -9.533999999999999420e-02 4.540000000000000147e-01
-6.053329999999999995e-03 -9.533999999999999420e-02 4.540000000000000147e-01
-1.510000000000000057e-03 -9.513000000000000622e-02 4.530000000000000138e-01
3.020000000000000115e-03 -9.513000000000000622e-02 4.530000000000000138e-01
7.566670000000000167e-03 -9.533999999999999420e-02 4.540000000000000147e-01
1.210669999999999975e-02 -9.533999999999999420e-02 4.540000000000000147e-01
1.664670000000000039e-02 -9.533999999999999420e-02 4.540000000000000147e-01
2.118669999999999928e-02 -9.533999999999999420e-02 4.540000000000000147e-01
2.561329999999999857e-02 -9.492000000000000437e-02 4.520000000000000129e-01
2.999999999999999889e-02 -9.450000000000000067e-02 4.500000000000000111e-01
-6.593330000000000024e-02 -9.199999999999999845e-02 4.600000000000000200e-01
-6.146669999999999912e-02 -9.220000000000000417e-02 4.610000000000000209e-01
-5.685670000000000307e-02 -9.220000000000000417e-02 4.610000000000000209e-01
-5.224670000000000009e-02 -9.220000000000000417e-02 4.610000000000000209e-01
-4.753330000000000055e-02 -9.199999999999999845e-02 4.600000000000000200e-01
-4.274669999999999859e-02 -9.160000000000000087e-02 4.580000000000000182e-01
-3.799999999999999906e-02 -9.120000000000000329e-02 4.560000000000000164e-01
-3.343999999999999750e-02 -9.120000000000000329e-02 4.560000000000000164e-01
-2.881670000000000065e-02 -9.099999999999999756e-02 4.550000000000000155e-01
-2.426669999999999869e-02 -9.099999999999999756e-02 4.550000000000000155e-01
-1.963000000000000161e-02 -9.059999999999999998e-02 4.530000000000000138e-01
-1.503329999999999944e-02 -9.020000000000000240e-02 4.510000000000000120e-01
-1.052329999999999932e-02 -9.020000000000000240e-02 4.510000000000000120e-01
-6.026669999999999597e-03 -9.039999999999999425e-02 4.520000000000000129e-01
-1.503329999999999987e-03 -9.020000000000000240e-02 4.510000000000000120e-01
3.000000000000000062e-03 -8.999999999999999667e-02 4.500000000000000111e-01
7.516669999999999602e-03 -9.020000000000000240e-02 4.510000000000000120e-01
1.202669999999999954e-02 -9.020000000000000240e-02 4.510000000000000120e-01
1.653670000000000140e-02 -9.020000000000000240e-02 4.510000000000000120e-01
2.104670000000000152e-02 -9.020000000000000240e-02 4.510000000000000120e-01
2.549999999999999836e-02 -8.999999999999999667e-02 4.500000000000000111e-01
2.993329999999999949e-02 -8.980000000000000482e-02 4.490000000000000102e-01
3.427000000000000185e-02 -8.939999999999999336e-02 4.470000000000000084e-01
-7.145329999999999737e-02 -8.853999999999999371e-02 4.660000000000000253e-01
-6.650670000000000193e-02 -8.816000000000000225e-02 4.640000000000000235e-01
-6.146669999999999912e-02 -8.759000000000000119e-02 4.610000000000000209e-01
-5.673330000000000040e-02 -8.740000000000000546e-02 4.600000000000000200e-01
-5.179330000000000045e-02 -8.683000000000000440e-02 4.570000000000000173e-01
-4.701670000000000155e-02 -8.644999999999999907e-02 4.550000000000000155e-01
-4.237330000000000263e-02 -8.626000000000000334e-02 4.540000000000000147e-01
-3.783330000000000026e-02 -8.626000000000000334e-02 4.540000000000000147e-01
-3.336669999999999914e-02 -8.644999999999999907e-02 4.550000000000000155e-01
-2.881670000000000065e-02 -8.644999999999999907e-02 4.550000000000000155e-01
-2.416000000000000092e-02 -8.606999999999999373e-02 4.530000000000000138e-01
-1.958669999999999856e-02 -8.587999999999999801e-02 4.520000000000000129e-01
-1.506670000000000058e-02 -8.587999999999999801e-02 4.520000000000000129e-01
-1.050000000000000065e-02 -8.550000000000000655e-02 4.500000000000000111e-01
-5.986670000000000359e-03 -8.530999999999999694e-02 4.490000000000000102e-01
-1.493329999999999961e-03 -8.512000000000000122e-02 4.480000000000000093e-01
2.986669999999999863e-03 -8.512000000000000122e-02 4.480000000000000093e-01
7.483329999999999843e-03 -8.530999999999999694e-02 4.490000000000000102e-01
1.200000000000000025e-02 -8.550000000000000655e-02 4.500000000000000111e-01
1.653670000000000140e-02 -8.569000000000000228e-02 4.510000000000000120e-01
2.104670000000000152e-02 -8.569000000000000228e-02 4.510000000000000120e-01
2.549999999999999836e-02 -8.550000000000000655e-02 4.500000000000000111e-01
2.999999999999999889e-02 -8.550000000000000655e-02 4.500000000000000111e-01
3.427000000000000185e-02 -8.493000000000000549e-02 4.470000000000000084e-01
3.830669999999999908e-02 -8.397999999999999909e-02 4.420000000000000040e-01
-8.146670000000000300e-02 -8.459999999999999465e-02 4.699999999999999734e-01
-7.660329999999999917e-02 -8.441999999999999504e-02 4.689999999999999725e-01
-7.114669999999999328e-02 -8.351999999999999702e-02 4.640000000000000235e-01
-6.593330000000000024e-02 -8.279999999999999860e-02 4.600000000000000200e-01
-6.106670000000000154e-02 -8.243999999999999939e-02 4.580000000000000182e-01
-5.611669999999999853e-02 -8.190000000000000058e-02 4.550000000000000155e-01
-5.145330000000000042e-02 -8.172000000000000097e-02 4.540000000000000147e-01
-4.660330000000000028e-02 -8.118000000000000216e-02 4.510000000000000120e-01
-4.200000000000000261e-02 -8.100000000000000255e-02 4.500000000000000111e-01
-3.766669999999999741e-02 -8.136000000000000176e-02 4.520000000000000129e-01
-3.329329999999999790e-02 -8.172000000000000097e-02 4.540000000000000147e-01
-2.875329999999999900e-02 -8.172000000000000097e-02 4.540000000000000147e-01
-2.394670000000000132e-02 -8.082000000000000295e-02 4.490000000000000102e-01
-1.932669999999999874e-02 -8.028000000000000413e-02 4.460000000000000075e-01
-1.483330000000000065e-02 -8.010000000000000453e-02 4.450000000000000067e-01
-1.038329999999999982e-02 -8.010000000000000453e-02 4.450000000000000067e-01
-5.960000000000000020e-03 -8.046000000000000374e-02 4.470000000000000084e-01
-1.490000000000000005e-03 -8.046000000000000374e-02 4.470000000000000084e-01
2.980000000000000010e-03 -8.046000000000000374e-02 4.470000000000000084e-01
7.450000000000000025e-03 -8.046000000000000374e-02 4.470000000000000084e-01
1.197329999999999922e-02 -8.082000000000000295e-02 4.490000000000000102e-01
1.650000000000000078e-02 -8.100000000000000255e-02 4.500000000000000111e-01
2.104670000000000152e-02 -8.118000000000000216e-02 4.510000000000000120e-01
2.549999999999999836e-02 -8.100000000000000255e-02 4.500000000000000111e-01
2.999999999999999889e-02 -8.100000000000000255e-02 4.500000000000000111e-01
3.434670000000000084e-02 -8.064000000000000334e-02 4.480000000000000093e-01
3.848000000000000032e-02 -7.992000000000000492e-02 4.440000000000000058e-01
4.272669999999999940e-02 -7.956000000000000572e-02 4.420000000000000040e-01
-9.739670000000000272e-02 -8.143000000000000238e-02 4.789999999999999813e-01
-9.183330000000000659e-02 -8.075000000000000233e-02 4.749999999999999778e-01
-8.616669999999999885e-02 -7.989999999999999880e-02 4.699999999999999734e-01
-8.060000000000000497e-02 -7.904999999999999527e-02 4.650000000000000244e-01
-7.529669999999999419e-02 -7.836999999999999522e-02 4.610000000000000209e-01
-6.976670000000000094e-02 -7.735000000000000209e-02 4.550000000000000155e-01
-6.493000000000000160e-02 -7.700999999999999512e-02 4.530000000000000138e-01
-6.040000000000000230e-02 -7.700999999999999512e-02 4.530000000000000138e-01
-5.562330000000000052e-02 -7.667000000000000204e-02 4.510000000000000120e-01
-5.099999999999999672e-02 -7.649999999999999856e-02 4.500000000000000111e-01
-4.639669999999999905e-02 -7.632999999999999508e-02 4.490000000000000102e-01
-4.190669999999999812e-02 -7.632999999999999508e-02 4.490000000000000102e-01
-3.749999999999999861e-02 -7.649999999999999856e-02 4.500000000000000111e-01
-3.314670000000000116e-02 -7.684000000000000552e-02 4.520000000000000129e-01
-2.856329999999999980e-02 -7.667000000000000204e-02 4.510000000000000120e-01
-2.394670000000000132e-02 -7.632999999999999508e-02 4.490000000000000102e-01
-1.941330000000000139e-02 -7.616000000000000547e-02 4.480000000000000093e-01
-1.490000000000000005e-02 -7.599000000000000199e-02 4.470000000000000084e-01
-1.043000000000000003e-02 -7.599000000000000199e-02 4.470000000000000084e-01
-5.960000000000000020e-03 -7.599000000000000199e-02 4.470000000000000084e-01
-1.486670000000000049e-03 -7.581999999999999851e-02 4.460000000000000075e-01
2.973330000000000157e-03 -7.581999999999999851e-02 4.460000000000000075e-01
7.433330000000000146e-03 -7.581999999999999851e-02 4.460000000000000075e-01
1.189330000000000075e-02 -7.581999999999999851e-02 4.460000000000000075e-01
1.638999999999999832e-02 -7.599000000000000199e-02 4.470000000000000084e-01
2.086000000000000007e-02 -7.599000000000000199e-02 4.470000000000000084e-01
2.544329999999999856e-02 -7.632999999999999508e-02 4.490000000000000102e-01
3.006669999999999829e-02 -7.667000000000000204e-02 4.510000000000000120e-01
3.457670000000000188e-02 -7.667000000000000204e-02 4.510000000000000120e-01
3.891329999999999789e-02 -7.632999999999999508e-02 4.490000000000000102e-01
4.320999999999999841e-02 -7.599000000000000199e-02 4.470000000000000084e-01
4.714669999999999972e-02 -7.513999999999999846e-02 4.420000000000000040e-01
-1.155830000000000052e-01 -7.599999999999999811e-02 4.749999999999999778e-01
-1.115329999999999933e-01 -7.648000000000000631e-02 4.779999999999999805e-01
-1.067530000000000007e-01 -7.648000000000000631e-02 4.779999999999999805e-01
-1.019729999999999942e-01 -7.648000000000000631e-02 4.779999999999999805e-01
-9.719329999999999636e-02 -7.648000000000000631e-02 4.779999999999999805e-01
-9.125329999999999553e-02 -7.552000000000000379e-02 4.719999999999999751e-01
-8.506669999999999510e-02 -7.424000000000000044e-02 4.640000000000000235e-01
-7.938670000000000448e-02 -7.327999999999999792e-02 4.580000000000000182e-01
-7.415330000000000532e-02 -7.263999999999999624e-02 4.540000000000000147e-01
-6.915330000000000088e-02 -7.216000000000000192e-02 4.510000000000000120e-01
-6.450000000000000178e-02 -7.199999999999999456e-02 4.500000000000000111e-01
-5.973330000000000306e-02 -7.167999999999999372e-02 4.480000000000000093e-01
-5.512999999999999845e-02 -7.152000000000000024e-02 4.470000000000000084e-01
-5.054669999999999996e-02 -7.136000000000000676e-02 4.460000000000000075e-01
-4.608670000000000128e-02 -7.136000000000000676e-02 4.460000000000000075e-01
-4.172000000000000014e-02 -7.152000000000000024e-02 4.470000000000000084e-01
-3.749999999999999861e-02 -7.199999999999999456e-02 4.500000000000000111e-01
-3.300000000000000155e-02 -7.199999999999999456e-02 4.500000000000000111e-01
-2.830999999999999836e-02 -7.152000000000000024e-02 4.470000000000000084e-01
-2.384000000000000008e-02 -7.152000000000000024e-02 4.470000000000000084e-01
-1.936999999999999833e-02 -7.152000000000000024e-02 4.470000000000000084e-01
-1.486670000000000005e-02 -7.136000000000000676e-02 4.460000000000000075e-01
-1.040669999999999963e-02 -7.136000000000000676e-02 4.460000000000000075e-01
-5.933329999999999681e-03 -7.119999999999999940e-02 4.450000000000000067e-01
-1.483329999999999935e-03 -7.119999999999999940e-02 4.450000000000000067e-01
2.966669999999999811e-03 -7.119999999999999940e-02 4.450000000000000067e-01
7.416670000000000207e-03 -7.119999999999999940e-02 4.450000000000000067e-01
1.186670000000000086e-02 -7.119999999999999940e-02 4.450000000000000067e-01
1.631669999999999995e-02 -7.119999999999999940e-02 4.450000000000000067e-01
2.081329999999999986e-02 -7.136000000000000676e-02 4.460000000000000075e-01
2.527329999999999854e-02 -7.136000000000000676e-02 4.460000000000000075e-01
2.993329999999999949e-02 -7.184000000000000108e-02 4.490000000000000102e-01
3.450000000000000289e-02 -7.199999999999999456e-02 4.500000000000000111e-01
3.908670000000000200e-02 -7.216000000000000192e-02 4.510000000000000120e-01
4.340329999999999883e-02 -7.184000000000000108e-02 4.490000000000000102e-01
4.714669999999999972e-02 -7.072000000000000508e-02 4.420000000000000040e-01
-1.110669999999999991e-01 -7.140000000000000513e-02 4.759999999999999787e-01
-1.060829999999999967e-01 -7.124999999999999389e-02 4.749999999999999778e-01
-1.002669999999999950e-01 -7.049999999999999323e-02 4.699999999999999734e-01
-9.454999999999999516e-02 -6.975000000000000644e-02 4.650000000000000244e-01
-8.816000000000000225e-02 -6.840000000000000246e-02 4.560000000000000164e-01
-8.323329999999999618e-02 -6.809999999999999387e-02 4.540000000000000147e-01
-7.799999999999999989e-02 -6.750000000000000444e-02 4.500000000000000111e-01
-7.317329999999999668e-02 -6.719999999999999585e-02 4.480000000000000093e-01
-6.869329999999999881e-02 -6.719999999999999585e-02 4.480000000000000093e-01
-6.407000000000000195e-02 -6.704999999999999849e-02 4.470000000000000084e-01
-5.933329999999999854e-02 -6.675000000000000377e-02 4.450000000000000067e-01
-5.488330000000000292e-02 -6.675000000000000377e-02 4.450000000000000067e-01
-5.043330000000000035e-02 -6.675000000000000377e-02 4.450000000000000067e-01
-4.608670000000000128e-02 -6.690000000000000113e-02 4.460000000000000075e-01
-4.172000000000000014e-02 -6.704999999999999849e-02 4.470000000000000084e-01
-3.285330000000000195e-02 -6.719999999999999585e-02 4.480000000000000093e-01
-2.818330000000000141e-02 -6.675000000000000377e-02 4.450000000000000067e-01
-2.373329999999999884e-02 -6.675000000000000377e-02 4.450000000000000067e-01
-1.928329999999999975e-02 -6.675000000000000377e-02 4.450000000000000067e-01
-1.483330000000000065e-02 -6.675000000000000377e-02 4.450000000000000067e-01
-1.038329999999999982e-02 -6.675000000000000377e-02 4.450000000000000067e-01
-5.933329999999999681e-03 -6.675000000000000377e-02 4.450000000000000067e-01
-1.483329999999999935e-03 -6.675000000000000377e-02 4.450000000000000067e-01
2.959999999999999958e-03 -6.660000000000000642e-02 4.440000000000000058e-01
7.400000000000000328e-03 -6.660000000000000642e-02 4.440000000000000058e-01
1.186670000000000086e-02 -6.675000000000000377e-02 4.450000000000000067e-01
1.631669999999999995e-02 -6.675000000000000377e-02 4.450000000000000067e-01
2.076669999999999905e-02 -6.675000000000000377e-02 4.450000000000000067e-01
2.521670000000000161e-02 -6.675000000000000377e-02 4.450000000000000067e-01
2.980000000000000010e-02 -6.704999999999999849e-02 4.470000000000000084e-01
3.442329999999999696e-02 -6.734999999999999321e-02 4.490000000000000102e-01
3.891329999999999789e-02 -6.734999999999999321e-02 4.490000000000000102e-01
4.349999999999999700e-02 -6.750000000000000444e-02 4.500000000000000111e-01
4.768000000000000016e-02 -6.704999999999999849e-02 4.470000000000000084e-01
-1.101329999999999948e-01 -6.607999999999999985e-02 4.719999999999999751e-01
-1.042970000000000008e-01 -6.537999999999999368e-02 4.670000000000000262e-01
-9.877329999999999444e-02 -6.482000000000000262e-02 4.630000000000000226e-01
-9.271999999999999686e-02 -6.383999999999999397e-02 4.560000000000000164e-01
-8.699999999999999400e-02 -6.300000000000000044e-02 4.500000000000000111e-01
-8.194999999999999507e-02 -6.257999999999999674e-02 4.470000000000000084e-01
-7.696000000000000063e-02 -6.215999999999999998e-02 4.440000000000000058e-01
-7.235669999999999602e-02 -6.201999999999999874e-02 4.430000000000000049e-01
-6.792670000000000652e-02 -6.201999999999999874e-02 4.430000000000000049e-01
-6.364000000000000212e-02 -6.215999999999999998e-02 4.440000000000000058e-01
-5.920000000000000262e-02 -6.215999999999999998e-02 4.440000000000000058e-01
-5.463670000000000332e-02 -6.201999999999999874e-02 4.430000000000000049e-01
-5.009330000000000033e-02 -6.187999999999999751e-02 4.420000000000000040e-01
-3.708329999999999960e-02 -6.230000000000000121e-02 4.450000000000000067e-01
-3.248670000000000030e-02 -6.201999999999999874e-02 4.430000000000000049e-01
-2.805670000000000039e-02 -6.201999999999999874e-02 4.430000000000000049e-01
-2.362670000000000048e-02 -6.201999999999999874e-02 4.430000000000000049e-01
-1.919670000000000057e-02 -6.201999999999999874e-02 4.430000000000000049e-01
-1.476670000000000066e-02 -6.201999999999999874e-02 4.430000000000000049e-01
-1.033670000000000075e-02 -6.201999999999999874e-02 4.430000000000000049e-01
-5.906670000000000149e-03 -6.201999999999999874e-02 4.430000000000000049e-01
-1.479999999999999979e-03 -6.215999999999999998e-02 4.440000000000000058e-01
2.953330000000000104e-03 -6.201999999999999874e-02 4.430000000000000049e-01
7.400000000000000328e-03 -6.215999999999999998e-02 4.440000000000000058e-01
1.186670000000000086e-02 -6.230000000000000121e-02 4.450000000000000067e-01
1.631669999999999995e-02 -6.230000000000000121e-02 4.450000000000000067e-01
2.076669999999999905e-02 -6.230000000000000121e-02 4.450000000000000067e-01
2.521670000000000161e-02 -6.230000000000000121e-02 4.450000000000000067e-01
2.966670000000000071e-02 -6.230000000000000121e-02 4.450000000000000067e-01
3.427000000000000185e-02 -6.257999999999999674e-02 4.470000000000000084e-01
3.873999999999999666e-02 -6.257999999999999674e-02 4.470000000000000084e-01
4.340329999999999883e-02 -6.285999999999999921e-02 4.490000000000000102e-01
4.800000000000000100e-02 -6.300000000000000044e-02 4.500000000000000111e-01
-1.087329999999999963e-01 -6.058000000000000190e-02 4.660000000000000253e-01
-1.029570000000000068e-01 -5.992999999999999716e-02 4.610000000000000209e-01
-9.706670000000000575e-02 -5.915000000000000119e-02 4.550000000000000155e-01
-9.170330000000000148e-02 -5.863000000000000156e-02 4.510000000000000120e-01
-8.641999999999999682e-02 -5.811000000000000193e-02 4.470000000000000084e-01
-8.121670000000000278e-02 -5.759000000000000230e-02 4.430000000000000049e-01
-7.661329999999999529e-02 -5.745999999999999719e-02 4.420000000000000040e-01
-7.202999999999999681e-02 -5.732999999999999902e-02 4.410000000000000031e-01
-6.777329999999999466e-02 -5.745999999999999719e-02 4.420000000000000040e-01
-6.349670000000000314e-02 -5.759000000000000230e-02 4.430000000000000049e-01
-5.920000000000000262e-02 -5.772000000000000047e-02 4.440000000000000058e-01
-5.451330000000000064e-02 -5.745999999999999719e-02 4.420000000000000040e-01
-4.997999999999999665e-02 -5.732999999999999902e-02 4.410000000000000031e-01
-4.587999999999999717e-02 -5.772000000000000047e-02 4.440000000000000058e-01
-4.125329999999999969e-02 -5.745999999999999719e-02 4.420000000000000040e-01
-3.674999999999999795e-02 -5.732999999999999902e-02 4.410000000000000031e-01
-3.234000000000000069e-02 -5.732999999999999902e-02 4.410000000000000031e-01
-2.792999999999999997e-02 -5.732999999999999902e-02 4.410000000000000031e-01
-2.357329999999999842e-02 -5.745999999999999719e-02 4.420000000000000040e-01
-1.910999999999999852e-02 -5.732999999999999902e-02 4.410000000000000031e-01
-1.469999999999999953e-02 -5.732999999999999902e-02 4.410000000000000031e-01
-1.026670000000000013e-02 -5.720000000000000084e-02 4.400000000000000022e-01
-5.866670000000000045e-03 -5.720000000000000084e-02 4.400000000000000022e-01
-1.469999999999999953e-03 -5.732999999999999902e-02 4.410000000000000031e-01
2.953330000000000104e-03 -5.759000000000000230e-02 4.430000000000000049e-01
7.400000000000000328e-03 -5.772000000000000047e-02 4.440000000000000058e-01
1.183999999999999983e-02 -5.772000000000000047e-02 4.440000000000000058e-01
1.627999999999999933e-02 -5.772000000000000047e-02 4.440000000000000058e-01
2.076669999999999905e-02 -5.784999999999999865e-02 4.450000000000000067e-01
2.521670000000000161e-02 -5.784999999999999865e-02 4.450000000000000067e-01
2.973330000000000070e-02 -5.797999999999999682e-02 4.460000000000000075e-01
3.419330000000000286e-02 -5.797999999999999682e-02 4.460000000000000075e-01
4.800000000000000100e-02 -5.850000000000000339e-02 4.500000000000000111e-01
-1.016169999999999990e-01 -5.460000000000000270e-02 4.550000000000000155e-01
-9.600000000000000200e-02 -5.399999999999999939e-02 4.500000000000000111e-01
-9.068669999999999509e-02 -5.351999999999999813e-02 4.460000000000000075e-01
-8.564670000000000616e-02 -5.315999999999999892e-02 4.430000000000000049e-01
-8.066669999999999396e-02 -5.279999999999999971e-02 4.400000000000000022e-01
-7.609330000000000260e-02 -5.267999999999999766e-02 4.390000000000000013e-01
-7.154000000000000636e-02 -5.256000000000000255e-02 4.380000000000000004e-01
-6.731330000000000646e-02 -5.267999999999999766e-02 4.390000000000000013e-01
-6.292330000000000145e-02 -5.267999999999999766e-02 4.390000000000000013e-01
-5.879999999999999810e-02 -5.292000000000000176e-02 4.410000000000000031e-01
-5.439000000000000085e-02 -5.292000000000000176e-02 4.410000000000000031e-01
-4.975330000000000030e-02 -5.267999999999999766e-02 4.390000000000000013e-01
-4.546669999999999878e-02 -5.279999999999999971e-02 4.400000000000000022e-01
-4.106669999999999765e-02 -5.279999999999999971e-02 4.400000000000000022e-01
-3.658329999999999915e-02 -5.267999999999999766e-02 4.390000000000000013e-01
-3.219330000000000108e-02 -5.267999999999999766e-02 4.390000000000000013e-01
-2.786670000000000119e-02 -5.279999999999999971e-02 4.400000000000000022e-01
-2.351999999999999924e-02 -5.292000000000000176e-02 4.410000000000000031e-01
-1.902329999999999993e-02 -5.267999999999999766e-02 4.390000000000000013e-01
-1.460000000000000013e-02 -5.256000000000000255e-02 4.380000000000000004e-01
-1.024330000000000032e-02 -5.267999999999999766e-02 4.390000000000000013e-01
-5.879999999999999810e-03 -5.292000000000000176e-02 4.410000000000000031e-01
-1.469999999999999953e-03 -5.292000000000000176e-02 4.410000000000000031e-01
2.946670000000000192e-03 -5.303999999999999687e-02 4.420000000000000040e-01
7.383329999999999581e-03 -5.315999999999999892e-02 4.430000000000000049e-01
1.183999999999999983e-02 -5.328000000000000097e-02 4.440000000000000058e-01
1.624329999999999871e-02 -5.315999999999999892e-02 4.430000000000000049e-01
2.071999999999999884e-02 -5.328000000000000097e-02 4.440000000000000058e-01
2.521670000000000161e-02 -5.340000000000000302e-02 4.450000000000000067e-01
2.973330000000000070e-02 -5.351999999999999813e-02 4.460000000000000075e-01
-1.009469999999999951e-01 -4.972000000000000031e-02 4.520000000000000129e-01
-9.557329999999999992e-02 -4.927999999999999742e-02 4.480000000000000093e-01
-9.027999999999999914e-02 -4.884000000000000147e-02 4.440000000000000058e-01
-8.526000000000000245e-02 -4.850999999999999757e-02 4.410000000000000031e-01
-8.048329999999999373e-02 -4.828999999999999959e-02 4.390000000000000013e-01
-7.574670000000000014e-02 -4.807000000000000162e-02 4.369999999999999996e-01
-7.137670000000000126e-02 -4.807000000000000162e-02 4.369999999999999996e-01
-6.700670000000000237e-02 -4.807000000000000162e-02 4.369999999999999996e-01
-6.263670000000000349e-02 -4.807000000000000162e-02 4.369999999999999996e-01
-5.840000000000000052e-02 -4.818000000000000060e-02 4.380000000000000004e-01
-5.401999999999999857e-02 -4.818000000000000060e-02 4.380000000000000004e-01
-4.952669999999999989e-02 -4.807000000000000162e-02 4.369999999999999996e-01
-4.526000000000000162e-02 -4.818000000000000060e-02 4.380000000000000004e-01
-4.087999999999999967e-02 -4.818000000000000060e-02 4.380000000000000004e-01
-3.658329999999999915e-02 -4.828999999999999959e-02 4.390000000000000013e-01
-3.226670000000000232e-02 -4.839999999999999858e-02 4.400000000000000022e-01
-2.799329999999999874e-02 -4.861999999999999655e-02 4.420000000000000040e-01
-2.351999999999999924e-02 -4.850999999999999757e-02 4.410000000000000031e-01
-1.898000000000000034e-02 -4.818000000000000060e-02 4.380000000000000004e-01
-1.453330000000000073e-02 -4.796000000000000263e-02 4.359999999999999987e-01
-1.019669999999999951e-02 -4.807000000000000162e-02 4.369999999999999996e-01
-5.893329999999999576e-03 -4.861999999999999655e-02 4.420000000000000040e-01
-1.469999999999999953e-03 -4.850999999999999757e-02 4.410000000000000031e-01
2.939999999999999905e-03 -4.850999999999999757e-02 4.410000000000000031e-01
7.383329999999999581e-03 -4.873000000000000248e-02 4.430000000000000049e-01
1.183999999999999983e-02 -4.884000000000000147e-02 4.440000000000000058e-01
1.627999999999999933e-02 -4.884000000000000147e-02 4.440000000000000058e-01
2.071999999999999884e-02 -4.884000000000000147e-02 4.440000000000000058e-01
2.515999999999999834e-02 -4.884000000000000147e-02 4.440000000000000058e-01
-1.011699999999999960e-01 -4.529999999999999999e-02 4.530000000000000138e-01
-9.600000000000000200e-02 -4.499999999999999833e-02 4.500000000000000111e-01
-9.048330000000000262e-02 -4.449999999999999789e-02 4.450000000000000067e-01
-8.526000000000000245e-02 -4.410000000000000031e-02 4.410000000000000031e-01
-8.029999999999999638e-02 -4.379999999999999866e-02 4.380000000000000004e-01
-7.522669999999999357e-02 -4.340000000000000108e-02 4.339999999999999969e-01
-7.105000000000000204e-02 -4.349999999999999700e-02 4.349999999999999978e-01
-6.685330000000000439e-02 -4.359999999999999987e-02 4.359999999999999987e-01
-6.249330000000000163e-02 -4.359999999999999987e-02 4.359999999999999987e-01
-5.800000000000000294e-02 -4.349999999999999700e-02 4.349999999999999978e-01
-5.365000000000000324e-02 -4.349999999999999700e-02 4.349999999999999978e-01
-4.941330000000000028e-02 -4.359999999999999987e-02 4.359999999999999987e-01
-4.515670000000000101e-02 -4.370000000000000273e-02 4.369999999999999996e-01
-4.078670000000000212e-02 -4.370000000000000273e-02 4.369999999999999996e-01
-3.649999999999999772e-02 -4.379999999999999866e-02 4.380000000000000004e-01
-3.241329999999999906e-02 -4.420000000000000318e-02 4.420000000000000040e-01
-2.805670000000000039e-02 -4.429999999999999910e-02 4.430000000000000049e-01
-2.351999999999999924e-02 -4.410000000000000031e-02 4.410000000000000031e-01
-1.902329999999999993e-02 -4.390000000000000152e-02 4.390000000000000013e-01
-1.460000000000000013e-02 -4.379999999999999866e-02 4.380000000000000004e-01
-1.019669999999999951e-02 -4.370000000000000273e-02 4.369999999999999996e-01
-5.853330000000000338e-03 -4.390000000000000152e-02 4.390000000000000013e-01
-1.466669999999999996e-03 -4.399999999999999745e-02 4.400000000000000022e-01
2.939999999999999905e-03 -4.410000000000000031e-02 4.410000000000000031e-01
7.383329999999999581e-03 -4.429999999999999910e-02 4.430000000000000049e-01
1.183999999999999983e-02 -4.440000000000000197e-02 4.440000000000000058e-01
1.627999999999999933e-02 -4.440000000000000197e-02 4.440000000000000058e-01
2.071999999999999884e-02 -4.440000000000000197e-02 4.440000000000000058e-01
5.308329999999999993e-02 -4.549999999999999878e-02 4.550000000000000155e-01
-9.312670000000000670e-02 -4.121999999999999970e-02 4.580000000000000182e-01
-8.835329999999999573e-02 -4.112999999999999989e-02 4.570000000000000173e-01
-8.029999999999999638e-02 -3.941999999999999671e-02 4.380000000000000004e-01
-7.505330000000000334e-02 -3.896999999999999770e-02 4.329999999999999960e-01
-7.072330000000000283e-02 -3.896999999999999770e-02 4.329999999999999960e-01
-6.654670000000000030e-02 -3.905999999999999750e-02 4.339999999999999969e-01
-6.206330000000000180e-02 -3.896999999999999770e-02 4.329999999999999960e-01
-5.773330000000000128e-02 -3.896999999999999770e-02 4.329999999999999960e-01
-5.352670000000000344e-02 -3.905999999999999750e-02 4.339999999999999969e-01
-4.929999999999999660e-02 -3.914999999999999730e-02 4.349999999999999978e-01
-4.505329999999999752e-02 -3.923999999999999710e-02 4.359999999999999987e-01
-4.069330000000000169e-02 -3.923999999999999710e-02 4.359999999999999987e-01
-3.641670000000000323e-02 -3.932999999999999691e-02 4.369999999999999996e-01
-3.226670000000000232e-02 -3.960000000000000325e-02 4.400000000000000022e-01
-2.799329999999999874e-02 -3.978000000000000286e-02 4.420000000000000040e-01
-2.351999999999999924e-02 -3.969000000000000306e-02 4.410000000000000031e-01
-1.910999999999999852e-02 -3.969000000000000306e-02 4.410000000000000031e-01
-1.466669999999999953e-02 -3.960000000000000325e-02 4.400000000000000022e-01
-1.024330000000000032e-02 -3.951000000000000345e-02 4.390000000000000013e-01
-5.853330000000000338e-03 -3.951000000000000345e-02 4.390000000000000013e-01
-1.466669999999999996e-03 -3.960000000000000325e-02 4.400000000000000022e-01
2.946670000000000192e-03 -3.978000000000000286e-02 4.420000000000000040e-01
7.400000000000000328e-03 -3.996000000000000246e-02 4.440000000000000058e-01
1.186670000000000086e-02 -4.005000000000000226e-02 4.450000000000000067e-01
1.627999999999999933e-02 -3.996000000000000246e-02 4.440000000000000058e-01
2.076669999999999905e-02 -4.005000000000000226e-02 4.450000000000000067e-01
2.532999999999999835e-02 -4.023000000000000187e-02 4.470000000000000084e-01
-8.989999999999999380e-02 -3.719999999999999696e-02 4.650000000000000244e-01
-7.557329999999999603e-02 -3.488000000000000128e-02 4.359999999999999987e-01
-7.105000000000000204e-02 -3.479999999999999760e-02 4.349999999999999978e-01
-6.654670000000000030e-02 -3.472000000000000086e-02 4.339999999999999969e-01
-6.192000000000000282e-02 -3.456000000000000044e-02 4.319999999999999951e-01
-5.773330000000000128e-02 -3.463999999999999718e-02 4.329999999999999960e-01
-5.365000000000000324e-02 -3.479999999999999760e-02 4.349999999999999978e-01
-4.941330000000000028e-02 -3.488000000000000128e-02 4.359999999999999987e-01
-4.505329999999999752e-02 -3.488000000000000128e-02 4.359999999999999987e-01
-4.069330000000000169e-02 -3.488000000000000128e-02 4.359999999999999987e-01
-3.649999999999999772e-02 -3.504000000000000170e-02 4.380000000000000004e-01
-3.226670000000000232e-02 -3.520000000000000212e-02 4.400000000000000022e-01
-2.799329999999999874e-02 -3.536000000000000254e-02 4.420000000000000040e-01
-2.357329999999999842e-02 -3.536000000000000254e-02 4.420000000000000040e-01
-1.910999999999999852e-02 -3.527999999999999886e-02 4.410000000000000031e-01
-1.463330000000000013e-02 -3.511999999999999844e-02 4.390000000000000013e-01
-1.026670000000000013e-02 -3.520000000000000212e-02 4.400000000000000022e-01
-5.866670000000000045e-03 -3.520000000000000212e-02 4.400000000000000022e-01
-1.469999999999999953e-03 -3.527999999999999886e-02 4.410000000000000031e-01
2.946670000000000192e-03 -3.536000000000000254e-02 4.420000000000000040e-01
7.400000000000000328e-03 -3.552000000000000296e-02 4.440000000000000058e-01
1.186670000000000086e-02 -3.559999999999999970e-02 4.450000000000000067e-01
1.627999999999999933e-02 -3.552000000000000296e-02 4.440000000000000058e-01
2.076669999999999905e-02 -3.559999999999999970e-02 4.450000000000000067e-01
2.532999999999999835e-02 -3.576000000000000012e-02 4.470000000000000084e-01
2.993329999999999949e-02 -3.592000000000000054e-02 4.490000000000000102e-01
-9.009330000000000116e-02 -3.262000000000000316e-02 4.660000000000000253e-01
-8.488329999999999487e-02 -3.241000000000000131e-02 4.630000000000000226e-01
-7.105000000000000204e-02 -3.045000000000000137e-02 4.349999999999999978e-01
-6.639330000000000231e-02 -3.031000000000000014e-02 4.329999999999999960e-01
-6.206330000000000180e-02 -3.031000000000000014e-02 4.329999999999999960e-01
-5.786670000000000008e-02 -3.038000000000000075e-02 4.339999999999999969e-01
-5.352670000000000344e-02 -3.038000000000000075e-02 4.339999999999999969e-01
-4.929999999999999660e-02 -3.045000000000000137e-02 4.349999999999999978e-01
-4.505329999999999752e-02 -3.051999999999999852e-02 4.359999999999999987e-01
-4.069330000000000169e-02 -3.051999999999999852e-02 4.359999999999999987e-01
-3.649999999999999772e-02 -3.065999999999999975e-02 4.380000000000000004e-01
-3.226670000000000232e-02 -3.080000000000000099e-02 4.400000000000000022e-01
-2.805670000000000039e-02 -3.100999999999999937e-02 4.430000000000000049e-01
-2.362670000000000048e-02 -3.100999999999999937e-02 4.430000000000000049e-01
-1.919670000000000057e-02 -3.100999999999999937e-02 4.430000000000000049e-01
-1.469999999999999953e-02 -3.087000000000000161e-02 4.410000000000000031e-01
-1.033670000000000075e-02 -3.100999999999999937e-02 4.430000000000000049e-01
-5.879999999999999810e-03 -3.087000000000000161e-02 4.410000000000000031e-01
-1.476670000000000023e-03 -3.100999999999999937e-02 4.430000000000000049e-01
2.953330000000000104e-03 -3.100999999999999937e-02 4.430000000000000049e-01
7.383329999999999581e-03 -3.100999999999999937e-02 4.430000000000000049e-01
1.183999999999999983e-02 -3.107999999999999999e-02 4.440000000000000058e-01
1.631669999999999995e-02 -3.115000000000000061e-02 4.450000000000000067e-01
2.081329999999999986e-02 -3.122000000000000122e-02 4.460000000000000075e-01
2.532999999999999835e-02 -3.128999999999999837e-02 4.470000000000000084e-01
2.993329999999999949e-02 -3.142999999999999960e-02 4.490000000000000102e-01
3.926000000000000323e-02 -3.171000000000000207e-02 4.530000000000000138e-01
4.408000000000000113e-02 -3.191999999999999699e-02 4.560000000000000164e-01
4.874669999999999698e-02 -3.198999999999999760e-02 4.570000000000000173e-01
5.331670000000000159e-02 -3.198999999999999760e-02 4.570000000000000173e-01
-5.377330000000000304e-02 -2.615999999999999923e-02 4.359999999999999987e-01
-4.952669999999999989e-02 -2.622000000000000025e-02 4.369999999999999996e-01
-4.526000000000000162e-02 -2.628000000000000128e-02 4.380000000000000004e-01
-4.087999999999999967e-02 -2.628000000000000128e-02 4.380000000000000004e-01
-3.658329999999999915e-02 -2.633999999999999883e-02 4.390000000000000013e-01
-3.226670000000000232e-02 -2.639999999999999986e-02 4.400000000000000022e-01
-2.792999999999999997e-02 -2.646000000000000088e-02 4.410000000000000031e-01
-2.351999999999999924e-02 -2.646000000000000088e-02 4.410000000000000031e-01
-1.915330000000000157e-02 -2.651999999999999844e-02 4.420000000000000040e-01
-1.473329999999999952e-02 -2.651999999999999844e-02 4.420000000000000040e-01
-1.033670000000000075e-02 -2.657999999999999946e-02 4.430000000000000049e-01
-5.879999999999999810e-03 -2.646000000000000088e-02 4.410000000000000031e-01
-1.469999999999999953e-03 -2.646000000000000088e-02 4.410000000000000031e-01
2.953330000000000104e-03 -2.657999999999999946e-02 4.430000000000000049e-01
7.383329999999999581e-03 -2.657999999999999946e-02 4.430000000000000049e-01
1.183999999999999983e-02 -2.664000000000000049e-02 4.440000000000000058e-01
1.638999999999999832e-02 -2.682000000000000009e-02 4.470000000000000084e-01
2.090670000000000028e-02 -2.688000000000000111e-02 4.480000000000000093e-01
2.538670000000000163e-02 -2.688000000000000111e-02 4.480000000000000093e-01
2.999999999999999889e-02 -2.699999999999999969e-02 4.500000000000000111e-01
3.457670000000000188e-02 -2.706000000000000072e-02 4.510000000000000120e-01
3.934669999999999834e-02 -2.724000000000000032e-02 4.540000000000000147e-01
4.417669999999999930e-02 -2.741999999999999993e-02 4.570000000000000173e-01
4.885330000000000228e-02 -2.748000000000000095e-02 4.580000000000000182e-01
5.331670000000000159e-02 -2.741999999999999993e-02 4.570000000000000173e-01
-5.414329999999999837e-02 -2.195000000000000076e-02 4.390000000000000013e-01
-4.986669999999999991e-02 -2.199999999999999872e-02 4.400000000000000022e-01
-4.546669999999999878e-02 -2.199999999999999872e-02 4.400000000000000022e-01
-4.116000000000000214e-02 -2.205000000000000016e-02 4.410000000000000031e-01
-3.674999999999999795e-02 -2.205000000000000016e-02 4.410000000000000031e-01
-3.226670000000000232e-02 -2.199999999999999872e-02 4.400000000000000022e-01
-2.786670000000000119e-02 -2.199999999999999872e-02 4.400000000000000022e-01
-2.351999999999999924e-02 -2.205000000000000016e-02 4.410000000000000031e-01
-1.910999999999999852e-02 -2.205000000000000016e-02 4.410000000000000031e-01
-1.469999999999999953e-02 -2.205000000000000016e-02 4.410000000000000031e-01
-1.031329999999999920e-02 -2.210000000000000159e-02 4.420000000000000040e-01
-5.893329999999999576e-03 -2.210000000000000159e-02 4.420000000000000040e-01
-1.476670000000000023e-03 -2.214999999999999955e-02 4.430000000000000049e-01
2.959999999999999958e-03 -2.220000000000000098e-02 4.440000000000000058e-01
7.400000000000000328e-03 -2.220000000000000098e-02 4.440000000000000058e-01
1.189330000000000075e-02 -2.230000000000000038e-02 4.460000000000000075e-01
1.638999999999999832e-02 -2.234999999999999834e-02 4.470000000000000084e-01
2.090670000000000028e-02 -2.239999999999999977e-02 4.480000000000000093e-01
2.544329999999999856e-02 -2.245000000000000120e-02 4.490000000000000102e-01
3.006669999999999829e-02 -2.255000000000000060e-02 4.510000000000000120e-01
3.465329999999999799e-02 -2.259999999999999856e-02 4.520000000000000129e-01
3.934669999999999834e-02 -2.270000000000000143e-02 4.540000000000000147e-01
4.398330000000000295e-02 -2.274999999999999939e-02 4.550000000000000155e-01
4.853330000000000144e-02 -2.274999999999999939e-02 4.550000000000000155e-01
5.261670000000000236e-02 -2.255000000000000060e-02 4.510000000000000120e-01
-4.997999999999999665e-02 -1.763999999999999943e-02 4.410000000000000031e-01
-4.556999999999999940e-02 -1.763999999999999943e-02 4.410000000000000031e-01
-3.683329999999999937e-02 -1.768000000000000127e-02 4.420000000000000040e-01
-2.792999999999999997e-02 -1.763999999999999943e-02 4.410000000000000031e-01
-2.357329999999999842e-02 -1.768000000000000127e-02 4.420000000000000040e-01
-1.910999999999999852e-02 -1.763999999999999943e-02 4.410000000000000031e-01
-1.469999999999999953e-02 -1.763999999999999943e-02 4.410000000000000031e-01
-1.031329999999999920e-02 -1.768000000000000127e-02 4.420000000000000040e-01
-5.893329999999999576e-03 -1.768000000000000127e-02 4.420000000000000040e-01
-1.479999999999999979e-03 -1.776000000000000148e-02 4.440000000000000058e-01
2.953330000000000104e-03 -1.771999999999999964e-02 4.430000000000000049e-01
7.383329999999999581e-03 -1.771999999999999964e-02 4.430000000000000049e-01
1.186670000000000086e-02 -1.779999999999999985e-02 4.450000000000000067e-01
1.638999999999999832e-02 -1.788000000000000006e-02 4.470000000000000084e-01
2.090670000000000028e-02 -1.791999999999999843e-02 4.480000000000000093e-01
2.544329999999999856e-02 -1.796000000000000027e-02 4.490000000000000102e-01
3.006669999999999829e-02 -1.804000000000000048e-02 4.510000000000000120e-01
3.472999999999999698e-02 -1.812000000000000069e-02 4.530000000000000138e-01
3.934669999999999834e-02 -1.815999999999999906e-02 4.540000000000000147e-01
4.398330000000000295e-02 -1.820000000000000090e-02 4.550000000000000155e-01
4.778670000000000140e-02 -1.791999999999999843e-02 4.480000000000000093e-01
-3.683329999999999937e-02 -1.325999999999999922e-02 4.420000000000000040e-01
-2.818330000000000141e-02 -1.335000000000000075e-02 4.450000000000000067e-01
-2.362670000000000048e-02 -1.328999999999999973e-02 4.430000000000000049e-01
-1.915330000000000157e-02 -1.325999999999999922e-02 4.420000000000000040e-01
-1.473329999999999952e-02 -1.325999999999999922e-02 4.420000000000000040e-01
-1.029000000000000054e-02 -1.323000000000000044e-02 4.410000000000000031e-01
-5.893329999999999576e-03 -1.325999999999999922e-02 4.420000000000000040e-01
-1.476670000000000023e-03 -1.328999999999999973e-02 4.430000000000000049e-01
2.959999999999999958e-03 -1.332000000000000024e-02 4.440000000000000058e-01
7.383329999999999581e-03 -1.328999999999999973e-02 4.430000000000000049e-01
1.183999999999999983e-02 -1.332000000000000024e-02 4.440000000000000058e-01
1.631669999999999995e-02 -1.335000000000000075e-02 4.450000000000000067e-01
2.086000000000000007e-02 -1.341000000000000004e-02 4.470000000000000084e-01
2.544329999999999856e-02 -1.346999999999999933e-02 4.490000000000000102e-01
3.006669999999999829e-02 -1.353000000000000036e-02 4.510000000000000120e-01
3.480670000000000291e-02 -1.362000000000000016e-02 4.540000000000000147e-01
3.934669999999999834e-02 -1.362000000000000016e-02 4.540000000000000147e-01
4.408000000000000113e-02 -1.367999999999999945e-02 4.560000000000000164e-01
4.853330000000000144e-02 -1.365000000000000067e-02 4.550000000000000155e-01
5.238330000000000070e-02 -1.346999999999999933e-02 4.490000000000000102e-01
-2.362670000000000048e-02 -8.859999999999999820e-03 4.430000000000000049e-01
-1.915330000000000157e-02 -8.840000000000000635e-03 4.420000000000000040e-01
-1.473329999999999952e-02 -8.840000000000000635e-03 4.420000000000000040e-01
-1.029000000000000054e-02 -8.819999999999999715e-03 4.410000000000000031e-01
-5.893329999999999576e-03 -8.840000000000000635e-03 4.420000000000000040e-01
-1.476670000000000023e-03 -8.859999999999999820e-03 4.430000000000000049e-01
2.953330000000000104e-03 -8.859999999999999820e-03 4.430000000000000049e-01
7.383329999999999581e-03 -8.859999999999999820e-03 4.430000000000000049e-01
1.183999999999999983e-02 -8.880000000000000740e-03 4.440000000000000058e-01
1.631669999999999995e-02 -8.899999999999999925e-03 4.450000000000000067e-01
2.090670000000000028e-02 -8.959999999999999215e-03 4.480000000000000093e-01
2.544329999999999856e-02 -8.980000000000000135e-03 4.490000000000000102e-01
3.006669999999999829e-02 -9.020000000000000240e-03 4.510000000000000120e-01
3.480670000000000291e-02 -9.079999999999999530e-03 4.540000000000000147e-01
3.943329999999999752e-02 -9.100000000000000450e-03 4.550000000000000155e-01
4.417669999999999930e-02 -9.140000000000000555e-03 4.570000000000000173e-01
4.885330000000000228e-02 -9.159999999999999740e-03 4.580000000000000182e-01
5.308329999999999993e-02 -9.100000000000000450e-03 4.550000000000000155e-01
5.649330000000000324e-02 -8.920000000000000845e-03 4.460000000000000075e-01
5.985999999999999654e-02 -8.760000000000000425e-03 4.380000000000000004e-01
-1.910999999999999852e-02 -4.409999999999999858e-03 4.410000000000000031e-01
-1.473329999999999952e-02 -4.420000000000000318e-03 4.420000000000000040e-01
-1.029000000000000054e-02 -4.409999999999999858e-03 4.410000000000000031e-01
-5.879999999999999810e-03 -4.409999999999999858e-03 4.410000000000000031e-01
-1.469999999999999953e-03 -4.409999999999999858e-03 4.410000000000000031e-01
2.939999999999999905e-03 -4.409999999999999858e-03 4.410000000000000031e-01
7.383329999999999581e-03 -4.429999999999999910e-03 4.430000000000000049e-01
1.186670000000000086e-02 -4.449999999999999963e-03 4.450000000000000067e-01
1.635330000000000117e-02 -4.460000000000000422e-03 4.460000000000000075e-01
2.086000000000000007e-02 -4.470000000000000015e-03 4.470000000000000084e-01
2.544329999999999856e-02 -4.490000000000000067e-03 4.490000000000000102e-01
3.006669999999999829e-02 -4.510000000000000120e-03 4.510000000000000120e-01
3.480670000000000291e-02 -4.539999999999999765e-03 4.540000000000000147e-01
3.960670000000000163e-02 -4.570000000000000277e-03 4.570000000000000173e-01
4.446669999999999789e-02 -4.599999999999999922e-03 4.600000000000000200e-01
4.917330000000000312e-02 -4.610000000000000382e-03 4.610000000000000209e-01
5.331670000000000159e-02 -4.570000000000000277e-03 4.570000000000000173e-01
5.674669999999999714e-02 -4.479999999999999608e-03 4.480000000000000093e-01
6.054330000000000128e-02 -4.429999999999999910e-03 4.430000000000000049e-01
-2.362670000000000048e-02 0.000000000000000000e+00 4.430000000000000049e-01
-1.906669999999999893e-02 0.000000000000000000e+00 4.400000000000000022e-01
-1.466669999999999953e-02 0.000000000000000000e+00 4.400000000000000022e-01
-1.026670000000000013e-02 0.000000000000000000e+00 4.400000000000000022e-01
-5.866670000000000045e-03 0.000000000000000000e+00 4.400000000000000022e-01
-1.469999999999999953e-03 0.000000000000000000e+00 4.410000000000000031e-01
2.939999999999999905e-03 0.000000000000000000e+00 4.410000000000000031e-01
7.383329999999999581e-03 0.000000000000000000e+00 4.430000000000000049e-01
1.183999999999999983e-02 0.000000000000000000e+00 4.440000000000000058e-01
1.631669999999999995e-02 0.000000000000000000e+00 4.450000000000000067e-01
2.086000000000000007e-02 0.000000000000000000e+00 4.470000000000000084e-01
2.544329999999999856e-02 0.000000000000000000e+00 4.490000000000000102e-01
3.006669999999999829e-02 0.000000000000000000e+00 4.510000000000000120e-01
3.465329999999999799e-02 0.000000000000000000e+00 4.520000000000000129e-01
3.951999999999999957e-02 0.000000000000000000e+00 4.560000000000000164e-01
4.446669999999999789e-02 0.000000000000000000e+00 4.600000000000000200e-01
4.927999999999999742e-02 0.000000000000000000e+00 4.620000000000000218e-01
5.390000000000000346e-02 0.000000000000000000e+00 4.620000000000000218e-01
5.852000000000000257e-02 0.000000000000000000e+00 4.620000000000000218e-01
-2.856329999999999980e-02 4.510000000000000120e-03 4.510000000000000120e-01
-2.389329999999999926e-02 4.479999999999999608e-03 4.480000000000000093e-01
-1.919670000000000057e-02 4.429999999999999910e-03 4.430000000000000049e-01
-1.469999999999999953e-02 4.409999999999999858e-03 4.410000000000000031e-01
-1.026670000000000013e-02 4.400000000000000265e-03 4.400000000000000022e-01
-5.866670000000000045e-03 4.400000000000000265e-03 4.400000000000000022e-01
-1.469999999999999953e-03 4.409999999999999858e-03 4.410000000000000031e-01
2.946670000000000192e-03 4.420000000000000318e-03 4.420000000000000040e-01
7.366669999999999642e-03 4.420000000000000318e-03 4.420000000000000040e-01
1.178670000000000065e-02 4.420000000000000318e-03 4.420000000000000040e-01
1.624329999999999871e-02 4.429999999999999910e-03 4.430000000000000049e-01
2.081329999999999986e-02 4.460000000000000422e-03 4.460000000000000075e-01
2.544329999999999856e-02 4.490000000000000067e-03 4.490000000000000102e-01
2.999999999999999889e-02 4.499999999999999660e-03 4.500000000000000111e-01
3.465329999999999799e-02 4.519999999999999712e-03 4.520000000000000129e-01
3.951999999999999957e-02 4.559999999999999817e-03 4.560000000000000164e-01
4.427330000000000154e-02 4.579999999999999870e-03 4.580000000000000182e-01
4.927999999999999742e-02 4.619999999999999975e-03 4.620000000000000218e-01
5.401670000000000083e-02 4.629999999999999567e-03 4.630000000000000226e-01
5.915329999999999894e-02 4.669999999999999672e-03 4.670000000000000262e-01
6.396000000000000296e-02 4.680000000000000132e-03 4.680000000000000271e-01
-2.389329999999999926e-02 8.959999999999999215e-03 4.480000000000000093e-01
-1.924000000000000016e-02 8.880000000000000740e-03 4.440000000000000058e-01
-1.473329999999999952e-02 8.840000000000000635e-03 4.420000000000000040e-01
-1.031329999999999920e-02 8.840000000000000635e-03 4.420000000000000040e-01
-5.879999999999999810e-03 8.819999999999999715e-03 4.410000000000000031e-01
-1.466669999999999996e-03 8.800000000000000530e-03 4.400000000000000022e-01
2.939999999999999905e-03 8.819999999999999715e-03 4.410000000000000031e-01
7.349999999999999763e-03 8.819999999999999715e-03 4.410000000000000031e-01
1.175999999999999962e-02 8.819999999999999715e-03 4.410000000000000031e-01
1.620670000000000097e-02 8.840000000000000635e-03 4.420000000000000040e-01
2.076669999999999905e-02 8.899999999999999925e-03 4.450000000000000067e-01
2.532999999999999835e-02 8.940000000000000030e-03 4.470000000000000084e-01
2.999999999999999889e-02 8.999999999999999320e-03 4.500000000000000111e-01
3.465329999999999799e-02 9.039999999999999425e-03 4.520000000000000129e-01
3.943329999999999752e-02 9.100000000000000450e-03 4.550000000000000155e-01
4.417669999999999930e-02 9.140000000000000555e-03 4.570000000000000173e-01
4.927999999999999742e-02 9.239999999999999949e-03 4.620000000000000218e-01
5.424999999999999961e-02 9.299999999999999239e-03 4.650000000000000244e-01
5.915329999999999894e-02 9.339999999999999344e-03 4.670000000000000262e-01
6.409670000000000645e-02 9.379999999999999449e-03 4.689999999999999725e-01
6.893330000000000291e-02 9.400000000000000369e-03 4.699999999999999734e-01
-1.033670000000000075e-02 1.328999999999999973e-02 4.430000000000000049e-01
-5.906670000000000149e-03 1.328999999999999973e-02 4.430000000000000049e-01
-1.473329999999999909e-03 1.325999999999999922e-02 4.420000000000000040e-01
2.939999999999999905e-03 1.323000000000000044e-02 4.410000000000000031e-01
7.333329999999999883e-03 1.319999999999999993e-02 4.400000000000000022e-01
1.175999999999999962e-02 1.323000000000000044e-02 4.410000000000000031e-01
1.624329999999999871e-02 1.328999999999999973e-02 4.430000000000000049e-01
2.081329999999999986e-02 1.337999999999999953e-02 4.460000000000000075e-01
2.532999999999999835e-02 1.341000000000000004e-02 4.470000000000000084e-01
3.013329999999999828e-02 1.355999999999999914e-02 4.520000000000000129e-01
3.480670000000000291e-02 1.362000000000000016e-02 4.540000000000000147e-01
3.943329999999999752e-02 1.365000000000000067e-02 4.550000000000000155e-01
4.417669999999999930e-02 1.370999999999999996e-02 4.570000000000000173e-01
4.927999999999999742e-02 1.386000000000000079e-02 4.620000000000000218e-01
5.436669999999999697e-02 1.397999999999999937e-02 4.660000000000000253e-01
5.940669999999999978e-02 1.406999999999999917e-02 4.689999999999999725e-01
6.450670000000000015e-02 1.416000000000000071e-02 4.719999999999999751e-01
6.951999999999999846e-02 1.422000000000000000e-02 4.739999999999999769e-01
-1.040669999999999963e-02 1.784000000000000169e-02 4.460000000000000075e-01
-5.933329999999999681e-03 1.779999999999999985e-02 4.450000000000000067e-01
-1.473329999999999909e-03 1.768000000000000127e-02 4.420000000000000040e-01
2.939999999999999905e-03 1.763999999999999943e-02 4.410000000000000031e-01
7.349999999999999763e-03 1.763999999999999943e-02 4.410000000000000031e-01
1.178670000000000065e-02 1.768000000000000127e-02 4.420000000000000040e-01
1.624329999999999871e-02 1.771999999999999964e-02 4.430000000000000049e-01
2.071999999999999884e-02 1.776000000000000148e-02 4.440000000000000058e-01
2.527329999999999854e-02 1.784000000000000169e-02 4.460000000000000075e-01
2.993329999999999949e-02 1.796000000000000027e-02 4.490000000000000102e-01
3.457670000000000188e-02 1.804000000000000048e-02 4.510000000000000120e-01
3.934669999999999834e-02 1.815999999999999906e-02 4.540000000000000147e-01
4.427330000000000154e-02 1.831999999999999948e-02 4.580000000000000182e-01
4.927999999999999742e-02 1.847999999999999990e-02 4.620000000000000218e-01
5.413330000000000225e-02 1.856000000000000011e-02 4.640000000000000235e-01
5.940669999999999978e-02 1.875999999999999890e-02 4.689999999999999725e-01
6.450670000000000015e-02 1.888000000000000095e-02 4.719999999999999751e-01
6.937329999999999885e-02 1.891999999999999932e-02 4.729999999999999760e-01
-1.496669999999999945e-02 2.245000000000000120e-02 4.490000000000000102e-01
-1.043000000000000003e-02 2.234999999999999834e-02 4.470000000000000084e-01
-5.933329999999999681e-03 2.224999999999999895e-02 4.450000000000000067e-01
-1.473329999999999909e-03 2.210000000000000159e-02 4.420000000000000040e-01
2.933330000000000052e-03 2.199999999999999872e-02 4.400000000000000022e-01
7.333329999999999883e-03 2.199999999999999872e-02 4.400000000000000022e-01
1.178670000000000065e-02 2.210000000000000159e-02 4.420000000000000040e-01
1.624329999999999871e-02 2.214999999999999955e-02 4.430000000000000049e-01
2.071999999999999884e-02 2.220000000000000098e-02 4.440000000000000058e-01
2.532999999999999835e-02 2.234999999999999834e-02 4.470000000000000084e-01
2.993329999999999949e-02 2.245000000000000120e-02 4.490000000000000102e-01
3.457670000000000188e-02 2.255000000000000060e-02 4.510000000000000120e-01
3.934669999999999834e-02 2.270000000000000143e-02 4.540000000000000147e-01
4.427330000000000154e-02 2.290000000000000022e-02 4.580000000000000182e-01
4.927999999999999742e-02 2.309999999999999901e-02 4.620000000000000218e-01
5.413330000000000225e-02 2.319999999999999840e-02 4.640000000000000235e-01
5.927999999999999936e-02 2.340000000000000066e-02 4.680000000000000271e-01
6.450670000000000015e-02 2.359999999999999945e-02 4.719999999999999751e-01
-1.932669999999999874e-02 2.675999999999999907e-02 4.460000000000000075e-01
-1.496669999999999945e-02 2.693999999999999867e-02 4.490000000000000102e-01
-1.043000000000000003e-02 2.682000000000000009e-02 4.470000000000000084e-01
-5.919999999999999915e-03 2.664000000000000049e-02 4.440000000000000058e-01
-1.473329999999999909e-03 2.651999999999999844e-02 4.420000000000000040e-01
2.926670000000000139e-03 2.633999999999999883e-02 4.390000000000000013e-01
7.316669999999999945e-03 2.633999999999999883e-02 4.390000000000000013e-01
1.178670000000000065e-02 2.651999999999999844e-02 4.420000000000000040e-01
1.620670000000000097e-02 2.651999999999999844e-02 4.420000000000000040e-01
2.062670000000000128e-02 2.651999999999999844e-02 4.420000000000000040e-01
2.532999999999999835e-02 2.682000000000000009e-02 4.470000000000000084e-01
2.999999999999999889e-02 2.699999999999999969e-02 4.500000000000000111e-01
3.465329999999999799e-02 2.711999999999999827e-02 4.520000000000000129e-01
3.943329999999999752e-02 2.730000000000000135e-02 4.550000000000000155e-01
4.436999999999999972e-02 2.753999999999999851e-02 4.590000000000000191e-01
4.927999999999999742e-02 2.772000000000000158e-02 4.620000000000000218e-01
5.413330000000000225e-02 2.784000000000000016e-02 4.640000000000000235e-01
5.890000000000000097e-02 2.790000000000000119e-02 4.650000000000000244e-01
6.341330000000000577e-02 2.784000000000000016e-02 4.640000000000000235e-01
-1.928329999999999975e-02 3.115000000000000061e-02 4.450000000000000067e-01
-1.486670000000000005e-02 3.122000000000000122e-02 4.460000000000000075e-01
-1.038329999999999982e-02 3.115000000000000061e-02 4.450000000000000067e-01
-5.919999999999999915e-03 3.107999999999999999e-02 4.440000000000000058e-01
-1.473329999999999909e-03 3.093999999999999875e-02 4.420000000000000040e-01
2.933330000000000052e-03 3.080000000000000099e-02 4.400000000000000022e-01
7.316669999999999945e-03 3.073000000000000037e-02 4.390000000000000013e-01
1.181330000000000054e-02 3.100999999999999937e-02 4.430000000000000049e-01
1.624329999999999871e-02 3.100999999999999937e-02 4.430000000000000049e-01
2.067329999999999862e-02 3.100999999999999937e-02 4.430000000000000049e-01
2.532999999999999835e-02 3.128999999999999837e-02 4.470000000000000084e-01
2.999999999999999889e-02 3.150000000000000022e-02 4.500000000000000111e-01
3.465329999999999799e-02 3.164000000000000146e-02 4.520000000000000129e-01
3.943329999999999752e-02 3.185000000000000331e-02 4.550000000000000155e-01
4.427330000000000154e-02 3.205999999999999822e-02 4.580000000000000182e-01
4.927999999999999742e-02 3.234000000000000069e-02 4.620000000000000218e-01
5.401670000000000083e-02 3.241000000000000131e-02 4.630000000000000226e-01
5.852000000000000257e-02 3.234000000000000069e-02 4.620000000000000218e-01
-1.928329999999999975e-02 3.559999999999999970e-02 4.450000000000000067e-01
-1.480000000000000066e-02 3.552000000000000296e-02 4.440000000000000058e-01
-1.033670000000000075e-02 3.543999999999999928e-02 4.430000000000000049e-01
-5.906670000000000149e-03 3.543999999999999928e-02 4.430000000000000049e-01
-1.469999999999999953e-03 3.527999999999999886e-02 4.410000000000000031e-01
2.933330000000000052e-03 3.520000000000000212e-02 4.400000000000000022e-01
7.333329999999999883e-03 3.520000000000000212e-02 4.400000000000000022e-01
1.178670000000000065e-02 3.536000000000000254e-02 4.420000000000000040e-01
1.624329999999999871e-02 3.543999999999999928e-02 4.430000000000000049e-01
2.081329999999999986e-02 3.568000000000000338e-02 4.460000000000000075e-01
2.544329999999999856e-02 3.592000000000000054e-02 4.490000000000000102e-01
2.999999999999999889e-02 3.599999999999999728e-02 4.500000000000000111e-01
3.465329999999999799e-02 3.615999999999999770e-02 4.520000000000000129e-01
3.951999999999999957e-02 3.647999999999999854e-02 4.560000000000000164e-01
4.417669999999999930e-02 3.656000000000000222e-02 4.570000000000000173e-01
4.917330000000000312e-02 3.688000000000000306e-02 4.610000000000000209e-01
5.390000000000000346e-02 3.695999999999999980e-02 4.620000000000000218e-01
5.813999999999999724e-02 3.672000000000000264e-02 4.590000000000000191e-01
-1.932669999999999874e-02 4.014000000000000207e-02 4.460000000000000075e-01
-1.483330000000000065e-02 4.005000000000000226e-02 4.450000000000000067e-01
-1.033670000000000075e-02 3.987000000000000266e-02 4.430000000000000049e-01
-5.906670000000000149e-03 3.987000000000000266e-02 4.430000000000000049e-01
-1.476670000000000023e-03 3.987000000000000266e-02 4.430000000000000049e-01
2.953330000000000104e-03 3.987000000000000266e-02 4.430000000000000049e-01
7.383329999999999581e-03 3.987000000000000266e-02 4.430000000000000049e-01
1.181330000000000054e-02 3.987000000000000266e-02 4.430000000000000049e-01
1.627999999999999933e-02 3.996000000000000246e-02 4.440000000000000058e-01
2.086000000000000007e-02 4.023000000000000187e-02 4.470000000000000084e-01
2.544329999999999856e-02 4.041000000000000147e-02 4.490000000000000102e-01
2.999999999999999889e-02 4.050000000000000128e-02 4.500000000000000111e-01
3.472999999999999698e-02 4.077000000000000068e-02 4.530000000000000138e-01
3.951999999999999957e-02 4.104000000000000009e-02 4.560000000000000164e-01
4.427330000000000154e-02 4.121999999999999970e-02 4.580000000000000182e-01
4.917330000000000312e-02 4.148999999999999910e-02 4.610000000000000209e-01
5.366669999999999774e-02 4.139999999999999930e-02 4.600000000000000200e-01
5.788669999999999927e-02 4.112999999999999989e-02 4.570000000000000173e-01
-1.035999999999999942e-02 4.440000000000000197e-02 4.440000000000000058e-01
-5.919999999999999915e-03 4.440000000000000197e-02 4.440000000000000058e-01
-1.479999999999999979e-03 4.440000000000000197e-02 4.440000000000000058e-01
2.959999999999999958e-03 4.440000000000000197e-02 4.440000000000000058e-01
7.400000000000000328e-03 4.440000000000000197e-02 4.440000000000000058e-01
1.186670000000000086e-02 4.449999999999999789e-02 4.450000000000000067e-01
1.638999999999999832e-02 4.469999999999999668e-02 4.470000000000000084e-01
2.090670000000000028e-02 4.479999999999999954e-02 4.480000000000000093e-01
2.549999999999999836e-02 4.499999999999999833e-02 4.500000000000000111e-01
3.013329999999999828e-02 4.519999999999999712e-02 4.520000000000000129e-01
3.480670000000000291e-02 4.540000000000000285e-02 4.540000000000000147e-01
3.951999999999999957e-02 4.560000000000000164e-02 4.560000000000000164e-01
4.427330000000000154e-02 4.580000000000000043e-02 4.580000000000000182e-01
4.906669999999999782e-02 4.599999999999999922e-02 4.600000000000000200e-01
5.343330000000000302e-02 4.580000000000000043e-02 4.580000000000000182e-01
-5.933329999999999681e-03 4.895000000000000046e-02 4.450000000000000067e-01
-1.479999999999999979e-03 4.884000000000000147e-02 4.440000000000000058e-01
2.966669999999999811e-03 4.895000000000000046e-02 4.450000000000000067e-01
7.433330000000000146e-03 4.905999999999999944e-02 4.460000000000000075e-01
1.192000000000000004e-02 4.916999999999999843e-02 4.470000000000000084e-01
1.642669999999999894e-02 4.927999999999999742e-02 4.480000000000000093e-01
2.095330000000000109e-02 4.939000000000000334e-02 4.490000000000000102e-01
2.549999999999999836e-02 4.950000000000000233e-02 4.500000000000000111e-01
3.013329999999999828e-02 4.972000000000000031e-02 4.520000000000000129e-01
3.480670000000000291e-02 4.993999999999999828e-02 4.540000000000000147e-01
3.951999999999999957e-02 5.016000000000000320e-02 4.560000000000000164e-01
4.417669999999999930e-02 5.027000000000000218e-02 4.570000000000000173e-01
4.874669999999999698e-02 5.027000000000000218e-02 4.570000000000000173e-01
-1.479999999999999979e-03 5.328000000000000097e-02 4.440000000000000058e-01
2.973330000000000157e-03 5.351999999999999813e-02 4.460000000000000075e-01
7.450000000000000025e-03 5.364000000000000018e-02 4.470000000000000084e-01
1.194669999999999933e-02 5.376000000000000223e-02 4.480000000000000093e-01
1.646330000000000016e-02 5.387999999999999734e-02 4.490000000000000102e-01
2.100000000000000130e-02 5.399999999999999939e-02 4.500000000000000111e-01
2.561329999999999857e-02 5.423999999999999655e-02 4.520000000000000129e-01
3.026670000000000055e-02 5.448000000000000065e-02 4.540000000000000147e-01
3.488329999999999903e-02 5.460000000000000270e-02 4.550000000000000155e-01
3.951999999999999957e-02 5.471999999999999781e-02 4.560000000000000164e-01
4.417669999999999930e-02 5.483999999999999986e-02 4.570000000000000173e-01
7.466669999999999904e-03 5.824000000000000010e-02 4.480000000000000093e-01
1.197329999999999922e-02 5.836999999999999827e-02 4.490000000000000102e-01
1.650000000000000078e-02 5.850000000000000339e-02 4.500000000000000111e-01
2.104670000000000152e-02 5.863000000000000156e-02 4.510000000000000120e-01
2.572670000000000165e-02 5.902000000000000302e-02 4.540000000000000147e-01
3.033330000000000054e-02 5.915000000000000119e-02 4.550000000000000155e-01
3.503669999999999701e-02 5.940999999999999753e-02 4.570000000000000173e-01
3.951999999999999957e-02 5.927999999999999936e-02 4.560000000000000164e-01
1.194669999999999933e-02 6.271999999999999797e-02 4.480000000000000093e-01
1.653670000000000140e-02 6.314000000000000168e-02 4.510000000000000120e-01
2.118669999999999928e-02 6.356000000000000538e-02 4.540000000000000147e-01
2.583999999999999839e-02 6.383999999999999397e-02 4.560000000000000164e-01
3.039999999999999994e-02 6.383999999999999397e-02 4.560000000000000164e-01
3.480670000000000291e-02 6.356000000000000538e-02 4.540000000000000147e-01
2.142000000000000154e-02 6.884999999999999454e-02 4.590000000000000191e-01
