-1.453330000000000073e-03 -1.133600000000000024e-01 4.359999999999999987e-01
2.893329999999999947e-03 -1.128399999999999959e-01 4.339999999999999969e-01
-5.813330000000000233e-03 -1.089999999999999997e-01 4.359999999999999987e-01
-1.479999999999999979e-03 -1.110000000000000014e-01 4.440000000000000058e-01
2.980000000000000010e-03 -1.117500000000000021e-01 4.470000000000000084e-01
-5.986670000000000359e-03 -1.077599999999999947e-01 4.490000000000000102e-01
-1.520000000000000084e-03 -1.094399999999999956e-01 4.560000000000000164e-01
3.066670000000000073e-03 -1.103999999999999981e-01 4.600000000000000200e-01
7.666670000000000429e-03 -1.103999999999999981e-01 4.600000000000000200e-01
1.210669999999999975e-02 -1.089600000000000013e-01 4.540000000000000147e-01
-3.708329999999999960e-02 -1.023499999999999965e-01 4.450000000000000067e-01
-3.270669999999999827e-02 -1.025800000000000045e-01 4.460000000000000075e-01
-1.506670000000000058e-02 -1.039599999999999969e-01 4.520000000000000129e-01
-1.066330000000000056e-02 -1.051099999999999951e-01 4.570000000000000173e-01
-6.133330000000000205e-03 -1.058000000000000052e-01 4.600000000000000200e-01
-1.543330000000000092e-03 -1.064900000000000013e-01 4.630000000000000226e-01
3.093330000000000038e-03 -1.067199999999999954e-01 4.640000000000000235e-01
7.683330000000000368e-03 -1.060299999999999992e-01 4.610000000000000209e-01
1.218669999999999996e-02 -1.051099999999999951e-01 4.570000000000000173e-01
1.668330000000000160e-02 -1.046500000000000069e-01 4.550000000000000155e-01
-4.649999999999999967e-02 -9.900000000000000466e-02 4.500000000000000111e-01
-4.209330000000000016e-02 -9.922000000000000264e-02 4.510000000000000120e-01
-3.774999999999999883e-02 -9.965999999999999859e-02 4.530000000000000138e-01
-3.321999999999999953e-02 -9.965999999999999859e-02 4.530000000000000138e-01
-2.875329999999999900e-02 -9.987999999999999656e-02 4.540000000000000147e-01
-2.432000000000000134e-02 -1.003200000000000064e-01 4.560000000000000164e-01
-1.984669999999999837e-02 -1.007600000000000023e-01 4.580000000000000182e-01
-1.529999999999999936e-02 -1.009800000000000003e-01 4.590000000000000191e-01
-1.073329999999999944e-02 -1.011999999999999983e-01 4.600000000000000200e-01
-6.133330000000000205e-03 -1.011999999999999983e-01 4.600000000000000200e-01
-1.529999999999999893e-03 -1.009800000000000003e-01 4.590000000000000191e-01
3.066670000000000073e-03 -1.011999999999999983e-01 4.600000000000000200e-01
7.683330000000000368e-03 -1.014199999999999963e-01 4.610000000000000209e-01
1.229330000000000006e-02 -1.014199999999999963e-01 4.610000000000000209e-01
1.686669999999999836e-02 -1.011999999999999983e-01 4.600000000000000200e-01
2.132670000000000052e-02 -1.005400000000000044e-01 4.570000000000000173e-01
2.589670000000000166e-02 -1.005400000000000044e-01 4.570000000000000173e-01
-5.190670000000000006e-02 -9.618000000000000160e-02 4.580000000000000182e-01
-4.753330000000000055e-02 -9.660000000000000531e-02 4.600000000000000200e-01
-4.293330000000000063e-02 -9.660000000000000531e-02 4.600000000000000200e-01
-3.833330000000000071e-02 -9.660000000000000531e-02 4.600000000000000200e-01
-3.373330000000000078e-02 -9.660000000000000531e-02 4.600000000000000200e-01
-2.906999999999999862e-02 -9.639000000000000346e-02 4.590000000000000191e-01
-2.442669999999999911e-02 -9.618000000000000160e-02 4.580000000000000182e-01
-1.989000000000000143e-02 -9.639000000000000346e-02 4.590000000000000191e-01
-1.526669999999999937e-02 -9.618000000000000160e-02 4.580000000000000182e-01
-1.068670000000000037e-02 -9.618000000000000160e-02 4.580000000000000182e-01
-6.093330000000000100e-03 -9.596999999999999975e-02 4.570000000000000173e-01
-1.523330000000000040e-03 -9.596999999999999975e-02 4.570000000000000173e-01
3.046670000000000020e-03 -9.596999999999999975e-02 4.570000000000000173e-01
7.633329999999999803e-03 -9.618000000000000160e-02 4.580000000000000182e-01
1.221329999999999985e-02 -9.618000000000000160e-02 4.580000000000000182e-01
1.679330000000000059e-02 -9.618000000000000160e-02 4.580000000000000182e-01
2.137330000000000133e-02 -9.618000000000000160e-02 4.580000000000000182e-01
2.589670000000000166e-02 -9.596999999999999975e-02 4.570000000000000173e-01
3.026670000000000055e-02 -9.533999999999999420e-02 4.540000000000000147e-01
-6.622000000000000108e-02 -9.239999999999999603e-02 4.620000000000000218e-01
-6.160000000000000198e-02 -9.239999999999999603e-02 4.620000000000000218e-01
-5.710330000000000267e-02 -9.260000000000000175e-02 4.630000000000000226e-01
-5.247330000000000050e-02 -9.260000000000000175e-02 4.630000000000000226e-01
-4.773999999999999772e-02 -9.239999999999999603e-02 4.620000000000000218e-01
-4.302670000000000106e-02 -9.220000000000000417e-02 4.610000000000000209e-01
-3.824999999999999928e-02 -9.180000000000000659e-02 4.590000000000000191e-01
-3.358669999999999711e-02 -9.160000000000000087e-02 4.580000000000000182e-01
-2.900669999999999984e-02 -9.160000000000000087e-02 4.580000000000000182e-01
-2.432000000000000134e-02 -9.120000000000000329e-02 4.560000000000000164e-01
-1.975999999999999979e-02 -9.120000000000000329e-02 4.560000000000000164e-01
-1.519999999999999997e-02 -9.120000000000000329e-02 4.560000000000000164e-01
-1.064000000000000015e-02 -9.120000000000000329e-02 4.560000000000000164e-01
-6.080000000000000335e-03 -9.120000000000000329e-02 4.560000000000000164e-01
-1.520000000000000084e-03 -9.120000000000000329e-02 4.560000000000000164e-01
3.033329999999999881e-03 -9.099999999999999756e-02 4.550000000000000155e-01
7.599999999999999985e-03 -9.120000000000000329e-02 4.560000000000000164e-01
1.216000000000000067e-02 -9.120000000000000329e-02 4.560000000000000164e-01
1.671999999999999875e-02 -9.120000000000000329e-02 4.560000000000000164e-01
2.128000000000000030e-02 -9.120000000000000329e-02 4.560000000000000164e-01
2.583999999999999839e-02 -9.120000000000000329e-02 4.560000000000000164e-01
3.026670000000000055e-02 -9.080000000000000571e-02 4.540000000000000147e-01
3.450000000000000289e-02 -8.999999999999999667e-02 4.500000000000000111e-01
-7.145329999999999737e-02 -8.853999999999999371e-02 4.660000000000000253e-01
-6.665000000000000091e-02 -8.834999999999999798e-02 4.650000000000000244e-01
-6.186669999999999670e-02 -8.816000000000000225e-02 4.640000000000000235e-01
-5.698000000000000287e-02 -8.777999999999999692e-02 4.620000000000000218e-01
-5.201999999999999680e-02 -8.720999999999999586e-02 4.590000000000000191e-01
-4.732669999999999932e-02 -8.702000000000000013e-02 4.580000000000000182e-01
-4.274669999999999859e-02 -8.702000000000000013e-02 4.580000000000000182e-01
-3.808330000000000048e-02 -8.683000000000000440e-02 4.570000000000000173e-01
-3.343999999999999750e-02 -8.663999999999999480e-02 4.560000000000000164e-01
-2.887999999999999942e-02 -8.663999999999999480e-02 4.560000000000000164e-01
-2.426669999999999869e-02 -8.644999999999999907e-02 4.550000000000000155e-01
-1.967330000000000120e-02 -8.626000000000000334e-02 4.540000000000000147e-01
-1.516669999999999997e-02 -8.644999999999999907e-02 4.550000000000000155e-01
-1.059329999999999994e-02 -8.626000000000000334e-02 4.540000000000000147e-01
-6.053329999999999995e-03 -8.626000000000000334e-02 4.540000000000000147e-01
-1.513330000000000014e-03 -8.626000000000000334e-02 4.540000000000000147e-01
3.026669999999999968e-03 -8.626000000000000334e-02 4.540000000000000147e-01
7.566670000000000167e-03 -8.626000000000000334e-02 4.540000000000000147e-01
1.210669999999999975e-02 -8.626000000000000334e-02 4.540000000000000147e-01
1.668330000000000160e-02 -8.644999999999999907e-02 4.550000000000000155e-01
2.123330000000000009e-02 -8.644999999999999907e-02 4.550000000000000155e-01
2.578329999999999858e-02 -8.644999999999999907e-02 4.550000000000000155e-01
3.033330000000000054e-02 -8.644999999999999907e-02 4.550000000000000155e-01
3.457670000000000188e-02 -8.569000000000000228e-02 4.510000000000000120e-01
3.839329999999999826e-02 -8.416999999999999482e-02 4.430000000000000049e-01
-8.164000000000000423e-02 -8.477999999999999425e-02 4.709999999999999742e-01
-7.676669999999999328e-02 -8.459999999999999465e-02 4.699999999999999734e-01
-7.176000000000000434e-02 -8.423999999999999544e-02 4.680000000000000271e-01
-6.650670000000000193e-02 -8.351999999999999702e-02 4.640000000000000235e-01
-6.160000000000000198e-02 -8.315999999999999781e-02 4.620000000000000218e-01
-5.648670000000000080e-02 -8.243999999999999939e-02 4.580000000000000182e-01
-5.167999999999999677e-02 -8.208000000000000018e-02 4.560000000000000164e-01
-4.701670000000000155e-02 -8.190000000000000058e-02 4.550000000000000155e-01
-4.246670000000000306e-02 -8.190000000000000058e-02 4.550000000000000155e-01
-3.783330000000000026e-02 -8.172000000000000097e-02 4.540000000000000147e-01
-3.329329999999999790e-02 -8.172000000000000097e-02 4.540000000000000147e-01
-2.869000000000000022e-02 -8.154000000000000137e-02 4.530000000000000138e-01
-2.416000000000000092e-02 -8.154000000000000137e-02 4.530000000000000138e-01
-1.963000000000000161e-02 -8.154000000000000137e-02 4.530000000000000138e-01
-1.510000000000000057e-02 -8.154000000000000137e-02 4.530000000000000138e-01
-1.059329999999999994e-02 -8.172000000000000097e-02 4.540000000000000147e-01
-6.053329999999999995e-03 -8.172000000000000097e-02 4.540000000000000147e-01
-1.510000000000000057e-03 -8.154000000000000137e-02 4.530000000000000138e-01
3.013329999999999828e-03 -8.136000000000000176e-02 4.520000000000000129e-01
7.533330000000000408e-03 -8.136000000000000176e-02 4.520000000000000129e-01
1.205329999999999943e-02 -8.136000000000000176e-02 4.520000000000000129e-01
1.660999999999999976e-02 -8.154000000000000137e-02 4.530000000000000138e-01
2.118669999999999928e-02 -8.172000000000000097e-02 4.540000000000000147e-01
2.572670000000000165e-02 -8.172000000000000097e-02 4.540000000000000147e-01
3.033330000000000054e-02 -8.190000000000000058e-02 4.550000000000000155e-01
3.480670000000000291e-02 -8.172000000000000097e-02 4.540000000000000147e-01
3.865330000000000155e-02 -8.028000000000000413e-02 4.460000000000000075e-01
4.263000000000000123e-02 -7.938000000000000611e-02 4.410000000000000031e-01
-9.719329999999999636e-02 -8.125999999999999890e-02 4.779999999999999805e-01
-8.671669999999999379e-02 -8.040999999999999537e-02 4.729999999999999760e-01
-8.111999999999999766e-02 -7.956000000000000572e-02 4.680000000000000271e-01
-7.611329999999999485e-02 -7.921999999999999875e-02 4.660000000000000253e-01
-7.114669999999999328e-02 -7.888000000000000567e-02 4.640000000000000235e-01
-6.622000000000000108e-02 -7.853999999999999870e-02 4.620000000000000218e-01
-6.133330000000000032e-02 -7.820000000000000562e-02 4.600000000000000200e-01
-5.623999999999999833e-02 -7.752000000000000557e-02 4.560000000000000164e-01
-5.145330000000000042e-02 -7.717999999999999861e-02 4.540000000000000147e-01
-4.680999999999999744e-02 -7.700999999999999512e-02 4.530000000000000138e-01
-4.227999999999999814e-02 -7.700999999999999512e-02 4.530000000000000138e-01
-3.783330000000000026e-02 -7.717999999999999861e-02 4.540000000000000147e-01
-3.329329999999999790e-02 -7.717999999999999861e-02 4.540000000000000147e-01
-2.856329999999999980e-02 -7.667000000000000204e-02 4.510000000000000120e-01
-2.400000000000000050e-02 -7.649999999999999856e-02 4.500000000000000111e-01
-1.949999999999999997e-02 -7.649999999999999856e-02 4.500000000000000111e-01
-1.499999999999999944e-02 -7.649999999999999856e-02 4.500000000000000111e-01
-1.052329999999999932e-02 -7.667000000000000204e-02 4.510000000000000120e-01
-6.026669999999999597e-03 -7.684000000000000552e-02 4.520000000000000129e-01
-1.503329999999999987e-03 -7.667000000000000204e-02 4.510000000000000120e-01
3.006669999999999916e-03 -7.667000000000000204e-02 4.510000000000000120e-01
7.516669999999999602e-03 -7.667000000000000204e-02 4.510000000000000120e-01
1.202669999999999954e-02 -7.667000000000000204e-02 4.510000000000000120e-01
1.653670000000000140e-02 -7.667000000000000204e-02 4.510000000000000120e-01
2.109329999999999886e-02 -7.684000000000000552e-02 4.520000000000000129e-01
2.566999999999999837e-02 -7.700999999999999512e-02 4.530000000000000138e-01
3.033330000000000054e-02 -7.735000000000000209e-02 4.550000000000000155e-01
3.495999999999999802e-02 -7.752000000000000557e-02 4.560000000000000164e-01
3.934669999999999834e-02 -7.717999999999999861e-02 4.540000000000000147e-01
4.369329999999999742e-02 -7.684000000000000552e-02 4.520000000000000129e-01
-1.158269999999999994e-01 -7.616000000000000547e-02 4.759999999999999787e-01
-1.122329999999999994e-01 -7.696000000000000063e-02 4.809999999999999831e-01
-1.078699999999999937e-01 -7.728000000000000147e-02 4.829999999999999849e-01
-9.719329999999999636e-02 -7.648000000000000631e-02 4.779999999999999805e-01
-9.144670000000000576e-02 -7.567999999999999727e-02 4.729999999999999760e-01
-8.506669999999999510e-02 -7.424000000000000044e-02 4.640000000000000235e-01
-8.007999999999999841e-02 -7.391999999999999960e-02 4.620000000000000218e-01
-7.529669999999999419e-02 -7.376000000000000612e-02 4.610000000000000209e-01
-7.053329999999999322e-02 -7.359999999999999876e-02 4.600000000000000200e-01
-6.607670000000000210e-02 -7.376000000000000612e-02 4.610000000000000209e-01
-6.119999999999999746e-02 -7.344000000000000528e-02 4.590000000000000191e-01
-5.599330000000000279e-02 -7.263999999999999624e-02 4.540000000000000147e-01
-5.111330000000000040e-02 -7.216000000000000192e-02 4.510000000000000120e-01
-4.660330000000000028e-02 -7.216000000000000192e-02 4.510000000000000120e-01
-4.209330000000000016e-02 -7.216000000000000192e-02 4.510000000000000120e-01
-3.766669999999999741e-02 -7.231999999999999540e-02 4.520000000000000129e-01
-3.314670000000000116e-02 -7.231999999999999540e-02 4.520000000000000129e-01
-2.862670000000000145e-02 -7.231999999999999540e-02 4.520000000000000129e-01
-2.400000000000000050e-02 -7.199999999999999456e-02 4.500000000000000111e-01
-1.945670000000000038e-02 -7.184000000000000108e-02 4.490000000000000102e-01
-1.496669999999999945e-02 -7.184000000000000108e-02 4.490000000000000102e-01
-1.047670000000000025e-02 -7.184000000000000108e-02 4.490000000000000102e-01
-6.000000000000000125e-03 -7.199999999999999456e-02 4.500000000000000111e-01
-1.503329999999999987e-03 -7.216000000000000192e-02 4.510000000000000120e-01
3.006669999999999916e-03 -7.216000000000000192e-02 4.510000000000000120e-01
7.516669999999999602e-03 -7.216000000000000192e-02 4.510000000000000120e-01
1.202669999999999954e-02 -7.216000000000000192e-02 4.510000000000000120e-01
1.653670000000000140e-02 -7.216000000000000192e-02 4.510000000000000120e-01
2.104670000000000152e-02 -7.216000000000000192e-02 4.510000000000000120e-01
2.561329999999999857e-02 -7.231999999999999540e-02 4.520000000000000129e-01
3.026670000000000055e-02 -7.263999999999999624e-02 4.540000000000000147e-01
3.495999999999999802e-02 -7.295999999999999708e-02 4.560000000000000164e-01
3.960670000000000163e-02 -7.312000000000000444e-02 4.570000000000000173e-01
4.417669999999999930e-02 -7.312000000000000444e-02 4.570000000000000173e-01
4.682669999999999888e-02 -7.023999999999999688e-02 4.390000000000000013e-01
-1.120000000000000023e-01 -7.199999999999999456e-02 4.799999999999999822e-01
-1.072000000000000036e-01 -7.199999999999999456e-02 4.799999999999999822e-01
-1.017600000000000032e-01 -7.155000000000000249e-02 4.769999999999999796e-01
-9.597329999999999750e-02 -7.080000000000000182e-02 4.719999999999999751e-01
-8.970670000000000033e-02 -6.959999999999999520e-02 4.640000000000000235e-01
-8.396670000000000522e-02 -6.869999999999999718e-02 4.580000000000000182e-01
-7.921330000000000038e-02 -6.854999999999999982e-02 4.570000000000000173e-01
-7.431669999999999943e-02 -6.825000000000000511e-02 4.550000000000000155e-01
-6.961330000000000295e-02 -6.809999999999999387e-02 4.540000000000000147e-01
-6.507330000000000059e-02 -6.809999999999999387e-02 4.540000000000000147e-01
-6.026669999999999944e-02 -6.779999999999999916e-02 4.520000000000000129e-01
-5.537670000000000092e-02 -6.734999999999999321e-02 4.490000000000000102e-01
-5.088669999999999999e-02 -6.734999999999999321e-02 4.490000000000000102e-01
-4.629330000000000250e-02 -6.719999999999999585e-02 4.480000000000000093e-01
-4.190669999999999812e-02 -6.734999999999999321e-02 4.490000000000000102e-01
-3.766669999999999741e-02 -6.779999999999999916e-02 4.520000000000000129e-01
-3.314670000000000116e-02 -6.779999999999999916e-02 4.520000000000000129e-01
-2.850000000000000103e-02 -6.750000000000000444e-02 4.500000000000000111e-01
-2.400000000000000050e-02 -6.750000000000000444e-02 4.500000000000000111e-01
-1.949999999999999997e-02 -6.750000000000000444e-02 4.500000000000000111e-01
-1.499999999999999944e-02 -6.750000000000000444e-02 4.500000000000000111e-01
-1.047670000000000025e-02 -6.734999999999999321e-02 4.490000000000000102e-01
-5.986670000000000359e-03 -6.734999999999999321e-02 4.490000000000000102e-01
-1.500000000000000031e-03 -6.750000000000000444e-02 4.500000000000000111e-01
3.000000000000000062e-03 -6.750000000000000444e-02 4.500000000000000111e-01
7.483329999999999843e-03 -6.734999999999999321e-02 4.490000000000000102e-01
1.202669999999999954e-02 -6.765000000000000180e-02 4.510000000000000120e-01
1.653670000000000140e-02 -6.765000000000000180e-02 4.510000000000000120e-01
2.100000000000000130e-02 -6.750000000000000444e-02 4.500000000000000111e-01
2.555670000000000164e-02 -6.765000000000000180e-02 4.510000000000000120e-01
3.020000000000000115e-02 -6.794999999999999651e-02 4.530000000000000138e-01
3.472999999999999698e-02 -6.794999999999999651e-02 4.530000000000000138e-01
3.943329999999999752e-02 -6.825000000000000511e-02 4.550000000000000155e-01
4.398330000000000295e-02 -6.825000000000000511e-02 4.550000000000000155e-01
4.789329999999999976e-02 -6.734999999999999321e-02 4.490000000000000102e-01
-1.108330000000000010e-01 -6.650000000000000355e-02 4.749999999999999778e-01
-1.056369999999999948e-01 -6.622000000000000108e-02 4.729999999999999760e-01
-1.000530000000000030e-01 -6.565999999999999615e-02 4.689999999999999725e-01
-9.414329999999999921e-02 -6.482000000000000262e-02 4.630000000000000226e-01
-8.835329999999999573e-02 -6.397999999999999521e-02 4.570000000000000173e-01
-8.304999999999999882e-02 -6.342000000000000415e-02 4.530000000000000138e-01
-7.834670000000000523e-02 -6.328000000000000291e-02 4.520000000000000129e-01
-7.349999999999999589e-02 -6.300000000000000044e-02 4.500000000000000111e-01
-6.869329999999999881e-02 -6.271999999999999797e-02 4.480000000000000093e-01
-6.407000000000000195e-02 -6.257999999999999674e-02 4.470000000000000084e-01
-5.960000000000000020e-02 -6.257999999999999674e-02 4.470000000000000084e-01
-5.512999999999999845e-02 -6.257999999999999674e-02 4.470000000000000084e-01
-5.065999999999999670e-02 -6.257999999999999674e-02 4.470000000000000084e-01
-4.619000000000000189e-02 -6.257999999999999674e-02 4.470000000000000084e-01
-4.190669999999999812e-02 -6.285999999999999921e-02 4.490000000000000102e-01
-3.741669999999999718e-02 -6.285999999999999921e-02 4.490000000000000102e-01
-3.277999999999999664e-02 -6.257999999999999674e-02 4.470000000000000084e-01
-2.830999999999999836e-02 -6.257999999999999674e-02 4.470000000000000084e-01
-2.384000000000000008e-02 -6.257999999999999674e-02 4.470000000000000084e-01
-1.941330000000000139e-02 -6.271999999999999797e-02 4.480000000000000093e-01
-1.496669999999999945e-02 -6.285999999999999921e-02 4.490000000000000102e-01
-1.045330000000000044e-02 -6.271999999999999797e-02 4.480000000000000093e-01
-5.960000000000000020e-03 -6.257999999999999674e-02 4.470000000000000084e-01
-1.490000000000000005e-03 -6.257999999999999674e-02 4.470000000000000084e-01
2.986669999999999863e-03 -6.271999999999999797e-02 4.480000000000000093e-01
7.466669999999999904e-03 -6.271999999999999797e-02 4.480000000000000093e-01
1.200000000000000025e-02 -6.300000000000000044e-02 4.500000000000000111e-01
1.650000000000000078e-02 -6.300000000000000044e-02 4.500000000000000111e-01
2.095330000000000109e-02 -6.285999999999999921e-02 4.490000000000000102e-01
2.549999999999999836e-02 -6.300000000000000044e-02 4.500000000000000111e-01
3.006669999999999829e-02 -6.314000000000000168e-02 4.510000000000000120e-01
3.465329999999999799e-02 -6.328000000000000291e-02 4.520000000000000129e-01
3.917330000000000118e-02 -6.328000000000000291e-02 4.520000000000000129e-01
4.369329999999999742e-02 -6.328000000000000291e-02 4.520000000000000129e-01
4.832000000000000184e-02 -6.342000000000000415e-02 4.530000000000000138e-01
-1.042970000000000008e-01 -6.071000000000000008e-02 4.670000000000000262e-01
-9.855999999999999484e-02 -6.006000000000000227e-02 4.620000000000000218e-01
-9.312670000000000670e-02 -5.954000000000000264e-02 4.580000000000000182e-01
-8.796669999999999490e-02 -5.915000000000000119e-02 4.550000000000000155e-01
-8.286670000000000147e-02 -5.875999999999999973e-02 4.520000000000000129e-01
-7.765329999999999455e-02 -5.824000000000000010e-02 4.480000000000000093e-01
-7.284670000000000034e-02 -5.797999999999999682e-02 4.460000000000000075e-01
-6.823329999999999673e-02 -5.784999999999999865e-02 4.450000000000000067e-01
-6.364000000000000212e-02 -5.772000000000000047e-02 4.440000000000000058e-01
-5.920000000000000262e-02 -5.772000000000000047e-02 4.440000000000000058e-01
-5.476000000000000312e-02 -5.772000000000000047e-02 4.440000000000000058e-01
-5.054669999999999996e-02 -5.797999999999999682e-02 4.460000000000000075e-01
-4.629330000000000250e-02 -5.824000000000000010e-02 4.480000000000000093e-01
-4.181329999999999769e-02 -5.824000000000000010e-02 4.480000000000000093e-01
-3.733329999999999982e-02 -5.824000000000000010e-02 4.480000000000000093e-01
-3.277999999999999664e-02 -5.811000000000000193e-02 4.470000000000000084e-01
-2.824669999999999959e-02 -5.797999999999999682e-02 4.460000000000000075e-01
-2.384000000000000008e-02 -5.811000000000000193e-02 4.470000000000000084e-01
-1.936999999999999833e-02 -5.811000000000000193e-02 4.470000000000000084e-01
-1.493330000000000005e-02 -5.824000000000000010e-02 4.480000000000000093e-01
-1.043000000000000003e-02 -5.811000000000000193e-02 4.470000000000000084e-01
-5.946670000000000254e-03 -5.797999999999999682e-02 4.460000000000000075e-01
-1.486670000000000049e-03 -5.797999999999999682e-02 4.460000000000000075e-01
2.980000000000000010e-03 -5.811000000000000193e-02 4.470000000000000084e-01
7.466669999999999904e-03 -5.824000000000000010e-02 4.480000000000000093e-01
1.197329999999999922e-02 -5.836999999999999827e-02 4.490000000000000102e-01
1.650000000000000078e-02 -5.850000000000000339e-02 4.500000000000000111e-01
2.100000000000000130e-02 -5.850000000000000339e-02 4.500000000000000111e-01
2.555670000000000164e-02 -5.863000000000000156e-02 4.510000000000000120e-01
3.006669999999999829e-02 -5.863000000000000156e-02 4.510000000000000120e-01
3.465329999999999799e-02 -5.875999999999999973e-02 4.520000000000000129e-01
3.917330000000000118e-02 -5.875999999999999973e-02 4.520000000000000129e-01
4.369329999999999742e-02 -5.875999999999999973e-02 4.520000000000000129e-01
4.821330000000000060e-02 -5.875999999999999973e-02 4.520000000000000129e-01
-1.031799999999999939e-01 -5.544000000000000317e-02 4.620000000000000218e-01
-9.749330000000000496e-02 -5.483999999999999986e-02 4.570000000000000173e-01
-9.190669999999999396e-02 -5.423999999999999655e-02 4.520000000000000129e-01
-8.699999999999999400e-02 -5.399999999999999939e-02 4.500000000000000111e-01
-8.194999999999999507e-02 -5.364000000000000018e-02 4.470000000000000084e-01
-7.713330000000000186e-02 -5.340000000000000302e-02 4.450000000000000067e-01
-7.235669999999999602e-02 -5.315999999999999892e-02 4.430000000000000049e-01
-6.792670000000000652e-02 -5.315999999999999892e-02 4.430000000000000049e-01
-6.349670000000000314e-02 -5.315999999999999892e-02 4.430000000000000049e-01
-5.906669999999999976e-02 -5.315999999999999892e-02 4.430000000000000049e-01
-5.463670000000000332e-02 -5.315999999999999892e-02 4.430000000000000049e-01
-5.043330000000000035e-02 -5.340000000000000302e-02 4.450000000000000067e-01
-4.598329999999999779e-02 -5.340000000000000302e-02 4.450000000000000067e-01
-4.143999999999999767e-02 -5.328000000000000097e-02 4.440000000000000058e-01
-3.708329999999999960e-02 -5.340000000000000302e-02 4.450000000000000067e-01
-3.263329999999999703e-02 -5.340000000000000302e-02 4.450000000000000067e-01
-2.818330000000000141e-02 -5.340000000000000302e-02 4.450000000000000067e-01
-2.384000000000000008e-02 -5.364000000000000018e-02 4.470000000000000084e-01
-1.936999999999999833e-02 -5.364000000000000018e-02 4.470000000000000084e-01
-1.486670000000000005e-02 -5.351999999999999813e-02 4.460000000000000075e-01
-1.040669999999999963e-02 -5.351999999999999813e-02 4.460000000000000075e-01
-5.946670000000000254e-03 -5.351999999999999813e-02 4.460000000000000075e-01
-1.490000000000000005e-03 -5.364000000000000018e-02 4.470000000000000084e-01
2.980000000000000010e-03 -5.364000000000000018e-02 4.470000000000000084e-01
7.466669999999999904e-03 -5.376000000000000223e-02 4.480000000000000093e-01
1.202669999999999954e-02 -5.412000000000000144e-02 4.510000000000000120e-01
1.653670000000000140e-02 -5.412000000000000144e-02 4.510000000000000120e-01
2.104670000000000152e-02 -5.412000000000000144e-02 4.510000000000000120e-01
2.549999999999999836e-02 -5.399999999999999939e-02 4.500000000000000111e-01
2.999999999999999889e-02 -5.399999999999999939e-02 4.500000000000000111e-01
3.457670000000000188e-02 -5.412000000000000144e-02 4.510000000000000120e-01
3.917330000000000118e-02 -5.423999999999999655e-02 4.520000000000000129e-01
4.369329999999999742e-02 -5.423999999999999655e-02 4.520000000000000129e-01
-1.027330000000000049e-01 -5.059999999999999915e-02 4.600000000000000200e-01
-9.685330000000000328e-02 -4.993999999999999828e-02 4.540000000000000147e-01
-9.129669999999999452e-02 -4.939000000000000334e-02 4.490000000000000102e-01
-8.641999999999999682e-02 -4.916999999999999843e-02 4.470000000000000084e-01
-8.158329999999999749e-02 -4.895000000000000046e-02 4.450000000000000067e-01
-7.678669999999999940e-02 -4.873000000000000248e-02 4.430000000000000049e-01
-7.219330000000000191e-02 -4.861999999999999655e-02 4.420000000000000040e-01
-6.746670000000000444e-02 -4.839999999999999858e-02 4.400000000000000022e-01
-6.321000000000000230e-02 -4.850999999999999757e-02 4.410000000000000031e-01
-5.893330000000000096e-02 -4.861999999999999655e-02 4.420000000000000040e-01
-5.463670000000000332e-02 -4.873000000000000248e-02 4.430000000000000049e-01
-5.020669999999999994e-02 -4.873000000000000248e-02 4.430000000000000049e-01
-4.577669999999999656e-02 -4.873000000000000248e-02 4.430000000000000049e-01
-4.134670000000000012e-02 -4.873000000000000248e-02 4.430000000000000049e-01
-3.691669999999999674e-02 -4.873000000000000248e-02 4.430000000000000049e-01
-3.255999999999999867e-02 -4.884000000000000147e-02 4.440000000000000058e-01
-2.824669999999999959e-02 -4.905999999999999944e-02 4.460000000000000075e-01
-2.378670000000000090e-02 -4.905999999999999944e-02 4.460000000000000075e-01
-1.932669999999999874e-02 -4.905999999999999944e-02 4.460000000000000075e-01
-1.483330000000000065e-02 -4.895000000000000046e-02 4.450000000000000067e-01
-1.035999999999999942e-02 -4.884000000000000147e-02 4.440000000000000058e-01
-5.919999999999999915e-03 -4.884000000000000147e-02 4.440000000000000058e-01
-1.490000000000000005e-03 -4.916999999999999843e-02 4.470000000000000084e-01
2.980000000000000010e-03 -4.916999999999999843e-02 4.470000000000000084e-01
7.466669999999999904e-03 -4.927999999999999742e-02 4.480000000000000093e-01
1.200000000000000025e-02 -4.950000000000000233e-02 4.500000000000000111e-01
1.653670000000000140e-02 -4.961000000000000132e-02 4.510000000000000120e-01
2.104670000000000152e-02 -4.961000000000000132e-02 4.510000000000000120e-01
2.555670000000000164e-02 -4.961000000000000132e-02 4.510000000000000120e-01
2.999999999999999889e-02 -4.950000000000000233e-02 4.500000000000000111e-01
3.457670000000000188e-02 -4.961000000000000132e-02 4.510000000000000120e-01
3.917330000000000118e-02 -4.972000000000000031e-02 4.520000000000000129e-01
-9.813330000000000664e-02 -4.599999999999999922e-02 4.600000000000000200e-01
-9.251669999999999339e-02 -4.549999999999999878e-02 4.550000000000000155e-01
-8.699999999999999400e-02 -4.499999999999999833e-02 4.500000000000000111e-01
-8.176669999999999772e-02 -4.460000000000000075e-02 4.460000000000000075e-01
-7.661329999999999529e-02 -4.420000000000000318e-02 4.420000000000000040e-01
-7.186670000000000558e-02 -4.399999999999999745e-02 4.400000000000000022e-01
-6.715999999999999748e-02 -4.379999999999999866e-02 4.380000000000000004e-01
-6.278000000000000247e-02 -4.379999999999999866e-02 4.380000000000000004e-01
-5.866670000000000218e-02 -4.399999999999999745e-02 4.400000000000000022e-01
-5.426670000000000105e-02 -4.399999999999999745e-02 4.400000000000000022e-01
-4.997999999999999665e-02 -4.410000000000000031e-02 4.410000000000000031e-01
-4.556999999999999940e-02 -4.410000000000000031e-02 4.410000000000000031e-01
-4.125329999999999969e-02 -4.420000000000000318e-02 4.420000000000000040e-01
-3.691669999999999674e-02 -4.429999999999999910e-02 4.430000000000000049e-01
-3.255999999999999867e-02 -4.440000000000000197e-02 4.440000000000000058e-01
-2.818330000000000141e-02 -4.449999999999999789e-02 4.450000000000000067e-01
-2.373329999999999884e-02 -4.449999999999999789e-02 4.450000000000000067e-01
-1.932669999999999874e-02 -4.460000000000000075e-02 4.460000000000000075e-01
-1.483330000000000065e-02 -4.449999999999999789e-02 4.450000000000000067e-01
-1.038329999999999982e-02 -4.449999999999999789e-02 4.450000000000000067e-01
-5.933329999999999681e-03 -4.449999999999999789e-02 4.450000000000000067e-01
-1.490000000000000005e-03 -4.469999999999999668e-02 4.470000000000000084e-01
2.980000000000000010e-03 -4.469999999999999668e-02 4.470000000000000084e-01
7.466669999999999904e-03 -4.479999999999999954e-02 4.480000000000000093e-01
1.197329999999999922e-02 -4.490000000000000241e-02 4.490000000000000102e-01
1.646330000000000016e-02 -4.490000000000000241e-02 4.490000000000000102e-01
2.104670000000000152e-02 -4.510000000000000120e-02 4.510000000000000120e-01
2.555670000000000164e-02 -4.510000000000000120e-02 4.510000000000000120e-01
3.006669999999999829e-02 -4.510000000000000120e-02 4.510000000000000120e-01
3.465329999999999799e-02 -4.519999999999999712e-02 4.520000000000000129e-01
3.934669999999999834e-02 -4.540000000000000285e-02 4.540000000000000147e-01
-8.378330000000000499e-02 -4.112999999999999989e-02 4.570000000000000173e-01
-7.747999999999999332e-02 -4.023000000000000187e-02 4.470000000000000084e-01
-7.202999999999999681e-02 -3.969000000000000306e-02 4.410000000000000031e-01
-6.715999999999999748e-02 -3.941999999999999671e-02 4.380000000000000004e-01
-6.292330000000000145e-02 -3.951000000000000345e-02 4.390000000000000013e-01
-5.853330000000000338e-02 -3.951000000000000345e-02 4.390000000000000013e-01
-5.414329999999999837e-02 -3.951000000000000345e-02 4.390000000000000013e-01
-4.975330000000000030e-02 -3.951000000000000345e-02 4.390000000000000013e-01
-4.546669999999999878e-02 -3.960000000000000325e-02 4.400000000000000022e-01
-4.106669999999999765e-02 -3.960000000000000325e-02 4.400000000000000022e-01
-3.691669999999999674e-02 -3.987000000000000266e-02 4.430000000000000049e-01
-3.263329999999999703e-02 -4.005000000000000226e-02 4.450000000000000067e-01
-2.824669999999999959e-02 -4.014000000000000207e-02 4.460000000000000075e-01
-2.378670000000000090e-02 -4.014000000000000207e-02 4.460000000000000075e-01
-1.928329999999999975e-02 -4.005000000000000226e-02 4.450000000000000067e-01
-1.483330000000000065e-02 -4.005000000000000226e-02 4.450000000000000067e-01
-1.040669999999999963e-02 -4.014000000000000207e-02 4.460000000000000075e-01
-5.946670000000000254e-03 -4.014000000000000207e-02 4.460000000000000075e-01
-1.486670000000000049e-03 -4.014000000000000207e-02 4.460000000000000075e-01
2.986669999999999863e-03 -4.032000000000000167e-02 4.480000000000000093e-01
7.483329999999999843e-03 -4.041000000000000147e-02 4.490000000000000102e-01
1.200000000000000025e-02 -4.050000000000000128e-02 4.500000000000000111e-01
1.650000000000000078e-02 -4.050000000000000128e-02 4.500000000000000111e-01
2.104670000000000152e-02 -4.059000000000000108e-02 4.510000000000000120e-01
2.566999999999999837e-02 -4.077000000000000068e-02 4.530000000000000138e-01
3.020000000000000115e-02 -4.077000000000000068e-02 4.530000000000000138e-01
3.480670000000000291e-02 -4.086000000000000049e-02 4.540000000000000147e-01
3.934669999999999834e-02 -4.086000000000000049e-02 4.540000000000000147e-01
4.408000000000000113e-02 -4.104000000000000009e-02 4.560000000000000164e-01
4.864000000000000268e-02 -4.104000000000000009e-02 4.560000000000000164e-01
-8.543330000000000368e-02 -3.728000000000000064e-02 4.660000000000000253e-01
-7.990669999999999717e-02 -3.688000000000000306e-02 4.610000000000000209e-01
-7.235669999999999602e-02 -3.543999999999999928e-02 4.430000000000000049e-01
-6.746670000000000444e-02 -3.520000000000000212e-02 4.400000000000000022e-01
-6.306670000000000331e-02 -3.520000000000000212e-02 4.400000000000000022e-01
-5.840000000000000052e-02 -3.504000000000000170e-02 4.380000000000000004e-01
-5.401999999999999857e-02 -3.504000000000000170e-02 4.380000000000000004e-01
-4.986669999999999991e-02 -3.520000000000000212e-02 4.400000000000000022e-01
-4.567330000000000001e-02 -3.536000000000000254e-02 4.420000000000000040e-01
-4.125329999999999969e-02 -3.536000000000000254e-02 4.420000000000000040e-01
-3.699999999999999817e-02 -3.552000000000000296e-02 4.440000000000000058e-01
-3.263329999999999703e-02 -3.559999999999999970e-02 4.450000000000000067e-01
-2.824669999999999959e-02 -3.568000000000000338e-02 4.460000000000000075e-01
-2.367999999999999966e-02 -3.552000000000000296e-02 4.440000000000000058e-01
-1.919670000000000057e-02 -3.543999999999999928e-02 4.430000000000000049e-01
-1.483330000000000065e-02 -3.559999999999999970e-02 4.450000000000000067e-01
-1.043000000000000003e-02 -3.576000000000000012e-02 4.470000000000000084e-01
-5.960000000000000020e-03 -3.576000000000000012e-02 4.470000000000000084e-01
-1.486670000000000049e-03 -3.568000000000000338e-02 4.460000000000000075e-01
2.966669999999999811e-03 -3.559999999999999970e-02 4.450000000000000067e-01
7.483329999999999843e-03 -3.592000000000000054e-02 4.490000000000000102e-01
1.202669999999999954e-02 -3.608000000000000096e-02 4.510000000000000120e-01
1.650000000000000078e-02 -3.599999999999999728e-02 4.500000000000000111e-01
2.104670000000000152e-02 -3.608000000000000096e-02 4.510000000000000120e-01
2.566999999999999837e-02 -3.624000000000000138e-02 4.530000000000000138e-01
3.026670000000000055e-02 -3.631999999999999812e-02 4.540000000000000147e-01
3.488329999999999903e-02 -3.640000000000000180e-02 4.550000000000000155e-01
3.943329999999999752e-02 -3.640000000000000180e-02 4.550000000000000155e-01
4.427330000000000154e-02 -3.663999999999999896e-02 4.580000000000000182e-01
4.895999999999999658e-02 -3.672000000000000264e-02 4.590000000000000191e-01
5.378329999999999916e-02 -3.688000000000000306e-02 4.610000000000000209e-01
-8.525000000000000633e-02 -3.255000000000000254e-02 4.650000000000000244e-01
-7.956000000000000572e-02 -3.212999999999999884e-02 4.590000000000000191e-01
-6.761999999999999955e-02 -3.087000000000000161e-02 4.410000000000000031e-01
-6.306670000000000331e-02 -3.080000000000000099e-02 4.400000000000000022e-01
-5.853330000000000338e-02 -3.073000000000000037e-02 4.390000000000000013e-01
-5.414329999999999837e-02 -3.073000000000000037e-02 4.390000000000000013e-01
-4.997999999999999665e-02 -3.087000000000000161e-02 4.410000000000000031e-01
-4.567330000000000001e-02 -3.093999999999999875e-02 4.420000000000000040e-01
-4.125329999999999969e-02 -3.093999999999999875e-02 4.420000000000000040e-01
-3.691669999999999674e-02 -3.100999999999999937e-02 4.430000000000000049e-01
-3.263329999999999703e-02 -3.115000000000000061e-02 4.450000000000000067e-01
-2.830999999999999836e-02 -3.128999999999999837e-02 4.470000000000000084e-01
-2.378670000000000090e-02 -3.122000000000000122e-02 4.460000000000000075e-01
-1.928329999999999975e-02 -3.115000000000000061e-02 4.450000000000000067e-01
-1.490000000000000005e-02 -3.128999999999999837e-02 4.470000000000000084e-01
-1.045330000000000044e-02 -3.135999999999999899e-02 4.480000000000000093e-01
-5.973329999999999786e-03 -3.135999999999999899e-02 4.480000000000000093e-01
-1.486670000000000049e-03 -3.122000000000000122e-02 4.460000000000000075e-01
2.959999999999999958e-03 -3.107999999999999999e-02 4.440000000000000058e-01
7.450000000000000025e-03 -3.128999999999999837e-02 4.470000000000000084e-01
1.200000000000000025e-02 -3.150000000000000022e-02 4.500000000000000111e-01
1.650000000000000078e-02 -3.150000000000000022e-02 4.500000000000000111e-01
2.104670000000000152e-02 -3.157000000000000084e-02 4.510000000000000120e-01
2.566999999999999837e-02 -3.171000000000000207e-02 4.530000000000000138e-01
3.026670000000000055e-02 -3.178000000000000269e-02 4.540000000000000147e-01
3.480670000000000291e-02 -3.178000000000000269e-02 4.540000000000000147e-01
3.951999999999999957e-02 -3.191999999999999699e-02 4.560000000000000164e-01
4.436999999999999972e-02 -3.212999999999999884e-02 4.590000000000000191e-01
4.917330000000000312e-02 -3.227000000000000007e-02 4.610000000000000209e-01
5.390000000000000346e-02 -3.234000000000000069e-02 4.620000000000000218e-01
-5.009330000000000033e-02 -2.651999999999999844e-02 4.420000000000000040e-01
-4.567330000000000001e-02 -2.651999999999999844e-02 4.420000000000000040e-01
-4.125329999999999969e-02 -2.651999999999999844e-02 4.420000000000000040e-01
-3.691669999999999674e-02 -2.657999999999999946e-02 4.430000000000000049e-01
-3.263329999999999703e-02 -2.670000000000000151e-02 4.450000000000000067e-01
-2.824669999999999959e-02 -2.675999999999999907e-02 4.460000000000000075e-01
-2.384000000000000008e-02 -2.682000000000000009e-02 4.470000000000000084e-01
-1.932669999999999874e-02 -2.675999999999999907e-02 4.460000000000000075e-01
-1.490000000000000005e-02 -2.682000000000000009e-02 4.470000000000000084e-01
-1.047670000000000025e-02 -2.693999999999999867e-02 4.490000000000000102e-01
-5.973329999999999786e-03 -2.688000000000000111e-02 4.480000000000000093e-01
-1.490000000000000005e-03 -2.682000000000000009e-02 4.470000000000000084e-01
2.980000000000000010e-03 -2.682000000000000009e-02 4.470000000000000084e-01
7.466669999999999904e-03 -2.688000000000000111e-02 4.480000000000000093e-01
1.197329999999999922e-02 -2.693999999999999867e-02 4.490000000000000102e-01
1.650000000000000078e-02 -2.699999999999999969e-02 4.500000000000000111e-01
2.113999999999999907e-02 -2.717999999999999930e-02 4.530000000000000138e-01
2.572670000000000165e-02 -2.724000000000000032e-02 4.540000000000000147e-01
3.033330000000000054e-02 -2.730000000000000135e-02 4.550000000000000155e-01
3.503669999999999701e-02 -2.741999999999999993e-02 4.570000000000000173e-01
3.978000000000000286e-02 -2.753999999999999851e-02 4.590000000000000191e-01
4.446669999999999789e-02 -2.759999999999999953e-02 4.600000000000000200e-01
4.906669999999999782e-02 -2.759999999999999953e-02 4.600000000000000200e-01
5.343330000000000302e-02 -2.748000000000000095e-02 4.580000000000000182e-01
-4.587999999999999717e-02 -2.220000000000000098e-02 4.440000000000000058e-01
-4.143999999999999767e-02 -2.220000000000000098e-02 4.440000000000000058e-01
-3.708329999999999960e-02 -2.224999999999999895e-02 4.450000000000000067e-01
-3.263329999999999703e-02 -2.224999999999999895e-02 4.450000000000000067e-01
-2.824669999999999959e-02 -2.230000000000000038e-02 4.460000000000000075e-01
-2.384000000000000008e-02 -2.234999999999999834e-02 4.470000000000000084e-01
-1.932669999999999874e-02 -2.230000000000000038e-02 4.460000000000000075e-01
-1.490000000000000005e-02 -2.234999999999999834e-02 4.470000000000000084e-01
-1.045330000000000044e-02 -2.239999999999999977e-02 4.480000000000000093e-01
-5.960000000000000020e-03 -2.234999999999999834e-02 4.470000000000000084e-01
-1.493329999999999961e-03 -2.239999999999999977e-02 4.480000000000000093e-01
2.993330000000000209e-03 -2.245000000000000120e-02 4.490000000000000102e-01
7.499999999999999722e-03 -2.249999999999999917e-02 4.500000000000000111e-01
1.202669999999999954e-02 -2.255000000000000060e-02 4.510000000000000120e-01
1.657329999999999914e-02 -2.259999999999999856e-02 4.520000000000000129e-01
2.118669999999999928e-02 -2.270000000000000143e-02 4.540000000000000147e-01
2.578329999999999858e-02 -2.274999999999999939e-02 4.550000000000000155e-01
3.039999999999999994e-02 -2.280000000000000082e-02 4.560000000000000164e-01
3.503669999999999701e-02 -2.284999999999999878e-02 4.570000000000000173e-01
3.978000000000000286e-02 -2.295000000000000165e-02 4.590000000000000191e-01
4.446669999999999789e-02 -2.299999999999999961e-02 4.600000000000000200e-01
4.874669999999999698e-02 -2.284999999999999878e-02 4.570000000000000173e-01
-4.619000000000000189e-02 -1.788000000000000006e-02 4.470000000000000084e-01
-4.181329999999999769e-02 -1.791999999999999843e-02 4.480000000000000093e-01
-3.724999999999999839e-02 -1.788000000000000006e-02 4.470000000000000084e-01
-3.277999999999999664e-02 -1.788000000000000006e-02 4.470000000000000084e-01
-2.830999999999999836e-02 -1.788000000000000006e-02 4.470000000000000084e-01
-2.389329999999999926e-02 -1.791999999999999843e-02 4.480000000000000093e-01
-1.941330000000000139e-02 -1.791999999999999843e-02 4.480000000000000093e-01
-1.493330000000000005e-02 -1.791999999999999843e-02 4.480000000000000093e-01
-1.043000000000000003e-02 -1.788000000000000006e-02 4.470000000000000084e-01
-5.960000000000000020e-03 -1.788000000000000006e-02 4.470000000000000084e-01
-1.493329999999999961e-03 -1.791999999999999843e-02 4.480000000000000093e-01
2.993330000000000209e-03 -1.796000000000000027e-02 4.490000000000000102e-01
7.499999999999999722e-03 -1.799999999999999864e-02 4.500000000000000111e-01
1.202669999999999954e-02 -1.804000000000000048e-02 4.510000000000000120e-01
1.657329999999999914e-02 -1.807999999999999885e-02 4.520000000000000129e-01
2.113999999999999907e-02 -1.812000000000000069e-02 4.530000000000000138e-01
2.572670000000000165e-02 -1.815999999999999906e-02 4.540000000000000147e-01
3.033330000000000054e-02 -1.820000000000000090e-02 4.550000000000000155e-01
3.503669999999999701e-02 -1.828000000000000111e-02 4.570000000000000173e-01
3.978000000000000286e-02 -1.836000000000000132e-02 4.590000000000000191e-01
4.456330000000000013e-02 -1.844000000000000153e-02 4.610000000000000209e-01
4.906669999999999782e-02 -1.839999999999999969e-02 4.600000000000000200e-01
-2.389329999999999926e-02 -1.344000000000000056e-02 4.480000000000000093e-01
-1.941330000000000139e-02 -1.344000000000000056e-02 4.480000000000000093e-01
-1.490000000000000005e-02 -1.341000000000000004e-02 4.470000000000000084e-01
-1.040669999999999963e-02 -1.337999999999999953e-02 4.460000000000000075e-01
-5.946670000000000254e-03 -1.337999999999999953e-02 4.460000000000000075e-01
-1.490000000000000005e-03 -1.341000000000000004e-02 4.470000000000000084e-01
2.993330000000000209e-03 -1.346999999999999933e-02 4.490000000000000102e-01
7.483329999999999843e-03 -1.346999999999999933e-02 4.490000000000000102e-01
1.200000000000000025e-02 -1.349999999999999985e-02 4.500000000000000111e-01
1.653670000000000140e-02 -1.353000000000000036e-02 4.510000000000000120e-01
2.113999999999999907e-02 -1.358999999999999965e-02 4.530000000000000138e-01
2.572670000000000165e-02 -1.362000000000000016e-02 4.540000000000000147e-01
3.039999999999999994e-02 -1.367999999999999945e-02 4.560000000000000164e-01
3.503669999999999701e-02 -1.370999999999999996e-02 4.570000000000000173e-01
3.978000000000000286e-02 -1.376999999999999925e-02 4.590000000000000191e-01
4.456330000000000013e-02 -1.383000000000000028e-02 4.610000000000000209e-01
4.927999999999999742e-02 -1.386000000000000079e-02 4.620000000000000218e-01
5.343330000000000302e-02 -1.374000000000000048e-02 4.580000000000000182e-01
-1.941330000000000139e-02 -8.959999999999999215e-03 4.480000000000000093e-01
-1.486670000000000005e-02 -8.920000000000000845e-03 4.460000000000000075e-01
-1.038329999999999982e-02 -8.899999999999999925e-03 4.450000000000000067e-01
-5.946670000000000254e-03 -8.920000000000000845e-03 4.460000000000000075e-01
-1.490000000000000005e-03 -8.940000000000000030e-03 4.470000000000000084e-01
2.986669999999999863e-03 -8.959999999999999215e-03 4.480000000000000093e-01
7.466669999999999904e-03 -8.959999999999999215e-03 4.480000000000000093e-01
1.200000000000000025e-02 -8.999999999999999320e-03 4.500000000000000111e-01
1.653670000000000140e-02 -9.020000000000000240e-03 4.510000000000000120e-01
2.113999999999999907e-02 -9.060000000000000345e-03 4.530000000000000138e-01
2.572670000000000165e-02 -9.079999999999999530e-03 4.540000000000000147e-01
3.033330000000000054e-02 -9.100000000000000450e-03 4.550000000000000155e-01
3.503669999999999701e-02 -9.140000000000000555e-03 4.570000000000000173e-01
3.986669999999999797e-02 -9.199999999999999845e-03 4.600000000000000200e-01
4.465999999999999831e-02 -9.239999999999999949e-03 4.620000000000000218e-01
4.927999999999999742e-02 -9.239999999999999949e-03 4.620000000000000218e-01
5.611329999999999790e-02 -8.859999999999999820e-03 4.430000000000000049e-01
5.985999999999999654e-02 -8.760000000000000425e-03 4.380000000000000004e-01
-1.932669999999999874e-02 -4.460000000000000422e-03 4.460000000000000075e-01
-1.483330000000000065e-02 -4.449999999999999963e-03 4.450000000000000067e-01
-1.040669999999999963e-02 -4.460000000000000422e-03 4.460000000000000075e-01
-5.946670000000000254e-03 -4.460000000000000422e-03 4.460000000000000075e-01
-1.490000000000000005e-03 -4.470000000000000015e-03 4.470000000000000084e-01
2.980000000000000010e-03 -4.470000000000000015e-03 4.470000000000000084e-01
7.466669999999999904e-03 -4.479999999999999608e-03 4.480000000000000093e-01
1.200000000000000025e-02 -4.499999999999999660e-03 4.500000000000000111e-01
1.653670000000000140e-02 -4.510000000000000120e-03 4.510000000000000120e-01
2.109329999999999886e-02 -4.519999999999999712e-03 4.520000000000000129e-01
2.572670000000000165e-02 -4.539999999999999765e-03 4.540000000000000147e-01
3.039999999999999994e-02 -4.559999999999999817e-03 4.560000000000000164e-01
3.518999999999999906e-02 -4.590000000000000330e-03 4.590000000000000191e-01
3.986669999999999797e-02 -4.599999999999999922e-03 4.600000000000000200e-01
4.465999999999999831e-02 -4.619999999999999975e-03 4.620000000000000218e-01
4.938669999999999866e-02 -4.629999999999999567e-03 4.630000000000000226e-01
5.413330000000000225e-02 -4.640000000000000027e-03 4.640000000000000235e-01
5.826669999999999766e-02 -4.599999999999999922e-03 4.600000000000000200e-01
-1.936999999999999833e-02 0.000000000000000000e+00 4.470000000000000084e-01
-1.480000000000000066e-02 0.000000000000000000e+00 4.440000000000000058e-01
-1.043000000000000003e-02 0.000000000000000000e+00 4.470000000000000084e-01
-5.960000000000000020e-03 0.000000000000000000e+00 4.470000000000000084e-01
-1.486670000000000049e-03 0.000000000000000000e+00 4.460000000000000075e-01
2.980000000000000010e-03 0.000000000000000000e+00 4.470000000000000084e-01
7.466669999999999904e-03 0.000000000000000000e+00 4.480000000000000093e-01
1.197329999999999922e-02 0.000000000000000000e+00 4.490000000000000102e-01
1.650000000000000078e-02 0.000000000000000000e+00 4.500000000000000111e-01
2.104670000000000152e-02 0.000000000000000000e+00 4.510000000000000120e-01
2.572670000000000165e-02 0.000000000000000000e+00 4.540000000000000147e-01
3.039999999999999994e-02 0.000000000000000000e+00 4.560000000000000164e-01
3.503669999999999701e-02 0.000000000000000000e+00 4.570000000000000173e-01
3.986669999999999797e-02 0.000000000000000000e+00 4.600000000000000200e-01
4.465999999999999831e-02 0.000000000000000000e+00 4.620000000000000218e-01
4.949329999999999702e-02 0.000000000000000000e+00 4.640000000000000235e-01
5.471670000000000006e-02 0.000000000000000000e+00 4.689999999999999725e-01
5.978669999999999818e-02 0.000000000000000000e+00 4.719999999999999751e-01
6.365329999999999600e-02 0.000000000000000000e+00 4.339999999999999969e-01
-1.958669999999999856e-02 4.519999999999999712e-03 4.520000000000000129e-01
-1.493330000000000005e-02 4.479999999999999608e-03 4.480000000000000093e-01
-1.043000000000000003e-02 4.470000000000000015e-03 4.470000000000000084e-01
-5.960000000000000020e-03 4.470000000000000015e-03 4.470000000000000084e-01
-1.486670000000000049e-03 4.460000000000000422e-03 4.460000000000000075e-01
2.980000000000000010e-03 4.470000000000000015e-03 4.470000000000000084e-01
7.450000000000000025e-03 4.470000000000000015e-03 4.470000000000000084e-01
1.197329999999999922e-02 4.490000000000000067e-03 4.490000000000000102e-01
1.653670000000000140e-02 4.510000000000000120e-03 4.510000000000000120e-01
2.113999999999999907e-02 4.530000000000000172e-03 4.530000000000000138e-01
2.578329999999999858e-02 4.550000000000000225e-03 4.550000000000000155e-01
3.033330000000000054e-02 4.550000000000000225e-03 4.550000000000000155e-01
3.495999999999999802e-02 4.559999999999999817e-03 4.560000000000000164e-01
3.986669999999999797e-02 4.599999999999999922e-03 4.600000000000000200e-01
4.465999999999999831e-02 4.619999999999999975e-03 4.620000000000000218e-01
4.959999999999999826e-02 4.649999999999999620e-03 4.650000000000000244e-01
5.460000000000000270e-02 4.680000000000000132e-03 4.680000000000000271e-01
5.953329999999999733e-02 4.700000000000000185e-03 4.699999999999999734e-01
6.423329999999999318e-02 4.700000000000000185e-03 4.699999999999999734e-01
-1.967330000000000120e-02 9.079999999999999530e-03 4.540000000000000147e-01
-1.513330000000000057e-02 9.079999999999999530e-03 4.540000000000000147e-01
-1.056999999999999953e-02 9.060000000000000345e-03 4.530000000000000138e-01
-5.986670000000000359e-03 8.980000000000000135e-03 4.490000000000000102e-01
-1.486670000000000049e-03 8.920000000000000845e-03 4.460000000000000075e-01
2.966669999999999811e-03 8.899999999999999925e-03 4.450000000000000067e-01
7.433330000000000146e-03 8.920000000000000845e-03 4.460000000000000075e-01
1.197329999999999922e-02 8.980000000000000135e-03 4.490000000000000102e-01
1.650000000000000078e-02 8.999999999999999320e-03 4.500000000000000111e-01
2.109329999999999886e-02 9.039999999999999425e-03 4.520000000000000129e-01
2.572670000000000165e-02 9.079999999999999530e-03 4.540000000000000147e-01
3.039999999999999994e-02 9.119999999999999635e-03 4.560000000000000164e-01
3.503669999999999701e-02 9.140000000000000555e-03 4.570000000000000173e-01
3.986669999999999797e-02 9.199999999999999845e-03 4.600000000000000200e-01
4.465999999999999831e-02 9.239999999999999949e-03 4.620000000000000218e-01
4.959999999999999826e-02 9.299999999999999239e-03 4.650000000000000244e-01
5.460000000000000270e-02 9.360000000000000264e-03 4.680000000000000271e-01
5.953329999999999733e-02 9.400000000000000369e-03 4.699999999999999734e-01
6.436999999999999666e-02 9.419999999999999554e-03 4.709999999999999742e-01
-6.000000000000000125e-03 1.349999999999999985e-02 4.500000000000000111e-01
-1.500000000000000031e-03 1.349999999999999985e-02 4.500000000000000111e-01
2.966669999999999811e-03 1.335000000000000075e-02 4.450000000000000067e-01
7.416670000000000207e-03 1.335000000000000075e-02 4.450000000000000067e-01
1.192000000000000004e-02 1.341000000000000004e-02 4.470000000000000084e-01
1.646330000000000016e-02 1.346999999999999933e-02 4.490000000000000102e-01
2.104670000000000152e-02 1.353000000000000036e-02 4.510000000000000120e-01
2.566999999999999837e-02 1.358999999999999965e-02 4.530000000000000138e-01
3.039999999999999994e-02 1.367999999999999945e-02 4.560000000000000164e-01
3.526669999999999805e-02 1.379999999999999977e-02 4.600000000000000200e-01
4.003999999999999920e-02 1.386000000000000079e-02 4.620000000000000218e-01
4.465999999999999831e-02 1.386000000000000079e-02 4.620000000000000218e-01
4.949329999999999702e-02 1.392000000000000008e-02 4.640000000000000235e-01
5.448329999999999840e-02 1.400999999999999988e-02 4.670000000000000262e-01
5.953329999999999733e-02 1.409999999999999969e-02 4.699999999999999734e-01
6.464330000000000076e-02 1.418999999999999949e-02 4.729999999999999760e-01
6.951999999999999846e-02 1.422000000000000000e-02 4.739999999999999769e-01
-1.059329999999999994e-02 1.815999999999999906e-02 4.540000000000000147e-01
-6.040000000000000230e-03 1.812000000000000069e-02 4.530000000000000138e-01
-1.500000000000000031e-03 1.799999999999999864e-02 4.500000000000000111e-01
2.973330000000000157e-03 1.784000000000000169e-02 4.460000000000000075e-01
7.416670000000000207e-03 1.779999999999999985e-02 4.450000000000000067e-01
1.192000000000000004e-02 1.788000000000000006e-02 4.470000000000000084e-01
1.646330000000000016e-02 1.796000000000000027e-02 4.490000000000000102e-01
2.100000000000000130e-02 1.799999999999999864e-02 4.500000000000000111e-01
2.561329999999999857e-02 1.807999999999999885e-02 4.520000000000000129e-01
3.026670000000000055e-02 1.815999999999999906e-02 4.540000000000000147e-01
3.503669999999999701e-02 1.828000000000000111e-02 4.570000000000000173e-01
3.995329999999999715e-02 1.844000000000000153e-02 4.610000000000000209e-01
4.475670000000000343e-02 1.851999999999999827e-02 4.630000000000000226e-01
4.959999999999999826e-02 1.859999999999999848e-02 4.650000000000000244e-01
5.448329999999999840e-02 1.867999999999999869e-02 4.670000000000000262e-01
5.953329999999999733e-02 1.880000000000000074e-02 4.699999999999999734e-01
6.450670000000000015e-02 1.888000000000000095e-02 4.719999999999999751e-01
6.937329999999999885e-02 1.891999999999999932e-02 4.729999999999999760e-01
-1.510000000000000057e-02 2.264999999999999999e-02 4.530000000000000138e-01
-1.056999999999999953e-02 2.264999999999999999e-02 4.530000000000000138e-01
-6.026669999999999597e-03 2.259999999999999856e-02 4.520000000000000129e-01
-1.493329999999999961e-03 2.239999999999999977e-02 4.480000000000000093e-01
2.973330000000000157e-03 2.230000000000000038e-02 4.460000000000000075e-01
7.450000000000000025e-03 2.234999999999999834e-02 4.470000000000000084e-01
1.192000000000000004e-02 2.234999999999999834e-02 4.470000000000000084e-01
1.642669999999999894e-02 2.239999999999999977e-02 4.480000000000000093e-01
2.100000000000000130e-02 2.249999999999999917e-02 4.500000000000000111e-01
2.561329999999999857e-02 2.259999999999999856e-02 4.520000000000000129e-01
3.026670000000000055e-02 2.270000000000000143e-02 4.540000000000000147e-01
3.488329999999999903e-02 2.274999999999999939e-02 4.550000000000000155e-01
3.986669999999999797e-02 2.299999999999999961e-02 4.600000000000000200e-01
4.485329999999999873e-02 2.319999999999999840e-02 4.640000000000000235e-01
4.970669999999999950e-02 2.330000000000000127e-02 4.660000000000000253e-01
5.460000000000000270e-02 2.340000000000000066e-02 4.680000000000000271e-01
5.965999999999999776e-02 2.355000000000000149e-02 4.709999999999999742e-01
6.423329999999999318e-02 2.350000000000000006e-02 4.699999999999999734e-01
6.849329999999999308e-02 2.334999999999999923e-02 4.670000000000000262e-01
-1.945670000000000038e-02 2.693999999999999867e-02 4.490000000000000102e-01
-1.510000000000000057e-02 2.717999999999999930e-02 4.530000000000000138e-01
-1.059329999999999994e-02 2.724000000000000032e-02 4.540000000000000147e-01
-6.013329999999999891e-03 2.706000000000000072e-02 4.510000000000000120e-01
-1.496670000000000075e-03 2.693999999999999867e-02 4.490000000000000102e-01
2.986669999999999863e-03 2.688000000000000111e-02 4.480000000000000093e-01
7.450000000000000025e-03 2.682000000000000009e-02 4.470000000000000084e-01
1.189330000000000075e-02 2.675999999999999907e-02 4.460000000000000075e-01
1.638999999999999832e-02 2.682000000000000009e-02 4.470000000000000084e-01
2.100000000000000130e-02 2.699999999999999969e-02 4.500000000000000111e-01
2.566999999999999837e-02 2.717999999999999930e-02 4.530000000000000138e-01
3.033330000000000054e-02 2.730000000000000135e-02 4.550000000000000155e-01
3.503669999999999701e-02 2.741999999999999993e-02 4.570000000000000173e-01
3.995329999999999715e-02 2.766000000000000056e-02 4.610000000000000209e-01
4.475670000000000343e-02 2.777999999999999914e-02 4.630000000000000226e-01
4.959999999999999826e-02 2.790000000000000119e-02 4.650000000000000244e-01
5.460000000000000270e-02 2.808000000000000079e-02 4.680000000000000271e-01
5.940669999999999978e-02 2.813999999999999835e-02 4.689999999999999725e-01
6.368669999999999887e-02 2.795999999999999874e-02 4.660000000000000253e-01
6.790670000000000039e-02 2.777999999999999914e-02 4.630000000000000226e-01
-1.954329999999999956e-02 3.157000000000000084e-02 4.510000000000000120e-01
-1.506670000000000058e-02 3.164000000000000146e-02 4.520000000000000129e-01
-1.054670000000000087e-02 3.164000000000000146e-02 4.520000000000000129e-01
-5.986670000000000359e-03 3.142999999999999960e-02 4.490000000000000102e-01
-1.493329999999999961e-03 3.135999999999999899e-02 4.480000000000000093e-01
2.980000000000000010e-03 3.128999999999999837e-02 4.470000000000000084e-01
7.450000000000000025e-03 3.128999999999999837e-02 4.470000000000000084e-01
1.192000000000000004e-02 3.128999999999999837e-02 4.470000000000000084e-01
1.642669999999999894e-02 3.135999999999999899e-02 4.480000000000000093e-01
2.100000000000000130e-02 3.150000000000000022e-02 4.500000000000000111e-01
2.561329999999999857e-02 3.164000000000000146e-02 4.520000000000000129e-01
3.033330000000000054e-02 3.185000000000000331e-02 4.550000000000000155e-01
3.503669999999999701e-02 3.198999999999999760e-02 4.570000000000000173e-01
3.986669999999999797e-02 3.219999999999999946e-02 4.600000000000000200e-01
4.475670000000000343e-02 3.241000000000000131e-02 4.630000000000000226e-01
4.970669999999999950e-02 3.262000000000000316e-02 4.660000000000000253e-01
5.448329999999999840e-02 3.268999999999999684e-02 4.670000000000000262e-01
5.890000000000000097e-02 3.255000000000000254e-02 4.650000000000000244e-01
6.314000000000000168e-02 3.234000000000000069e-02 4.620000000000000218e-01
6.776000000000000079e-02 3.234000000000000069e-02 4.620000000000000218e-01
-1.963000000000000161e-02 3.624000000000000138e-02 4.530000000000000138e-01
-1.499999999999999944e-02 3.599999999999999728e-02 4.500000000000000111e-01
-1.045330000000000044e-02 3.583999999999999686e-02 4.480000000000000093e-01
-5.960000000000000020e-03 3.576000000000000012e-02 4.470000000000000084e-01
-1.486670000000000049e-03 3.568000000000000338e-02 4.460000000000000075e-01
2.973330000000000157e-03 3.568000000000000338e-02 4.460000000000000075e-01
7.433330000000000146e-03 3.568000000000000338e-02 4.460000000000000075e-01
1.192000000000000004e-02 3.576000000000000012e-02 4.470000000000000084e-01
1.646330000000000016e-02 3.592000000000000054e-02 4.490000000000000102e-01
2.104670000000000152e-02 3.608000000000000096e-02 4.510000000000000120e-01
2.566999999999999837e-02 3.624000000000000138e-02 4.530000000000000138e-01
3.033330000000000054e-02 3.640000000000000180e-02 4.550000000000000155e-01
3.503669999999999701e-02 3.656000000000000222e-02 4.570000000000000173e-01
3.978000000000000286e-02 3.672000000000000264e-02 4.590000000000000191e-01
4.465999999999999831e-02 3.695999999999999980e-02 4.620000000000000218e-01
4.970669999999999950e-02 3.728000000000000064e-02 4.660000000000000253e-01
5.436669999999999697e-02 3.728000000000000064e-02 4.660000000000000253e-01
5.864670000000000299e-02 3.703999999999999654e-02 4.630000000000000226e-01
6.314000000000000168e-02 3.695999999999999980e-02 4.620000000000000218e-01
-1.499999999999999944e-02 4.050000000000000128e-02 4.500000000000000111e-01
-1.045330000000000044e-02 4.032000000000000167e-02 4.480000000000000093e-01
-5.973329999999999786e-03 4.032000000000000167e-02 4.480000000000000093e-01
-1.490000000000000005e-03 4.023000000000000187e-02 4.470000000000000084e-01
2.980000000000000010e-03 4.023000000000000187e-02 4.470000000000000084e-01
7.450000000000000025e-03 4.023000000000000187e-02 4.470000000000000084e-01
1.194669999999999933e-02 4.032000000000000167e-02 4.480000000000000093e-01
1.653670000000000140e-02 4.059000000000000108e-02 4.510000000000000120e-01
2.113999999999999907e-02 4.077000000000000068e-02 4.530000000000000138e-01
2.572670000000000165e-02 4.086000000000000049e-02 4.540000000000000147e-01
3.033330000000000054e-02 4.095000000000000029e-02 4.550000000000000155e-01
3.511330000000000007e-02 4.121999999999999970e-02 4.580000000000000182e-01
3.978000000000000286e-02 4.130999999999999950e-02 4.590000000000000191e-01
4.465999999999999831e-02 4.157999999999999891e-02 4.620000000000000218e-01
4.959999999999999826e-02 4.184999999999999831e-02 4.650000000000000244e-01
5.401670000000000083e-02 4.166999999999999871e-02 4.630000000000000226e-01
5.826669999999999766e-02 4.139999999999999930e-02 4.600000000000000200e-01
6.286669999999999758e-02 4.139999999999999930e-02 4.600000000000000200e-01
-1.047670000000000025e-02 4.490000000000000241e-02 4.490000000000000102e-01
-6.000000000000000125e-03 4.499999999999999833e-02 4.500000000000000111e-01
-1.500000000000000031e-03 4.499999999999999833e-02 4.500000000000000111e-01
2.993330000000000209e-03 4.490000000000000241e-02 4.490000000000000102e-01
7.466669999999999904e-03 4.479999999999999954e-02 4.480000000000000093e-01
1.197329999999999922e-02 4.490000000000000241e-02 4.490000000000000102e-01
1.657329999999999914e-02 4.519999999999999712e-02 4.520000000000000129e-01
2.118669999999999928e-02 4.540000000000000285e-02 4.540000000000000147e-01
2.572670000000000165e-02 4.540000000000000285e-02 4.540000000000000147e-01
3.033330000000000054e-02 4.549999999999999878e-02 4.550000000000000155e-01
3.518999999999999906e-02 4.590000000000000330e-02 4.590000000000000191e-01
3.995329999999999715e-02 4.610000000000000209e-02 4.610000000000000209e-01
4.485329999999999873e-02 4.639999999999999680e-02 4.640000000000000235e-01
4.949329999999999702e-02 4.639999999999999680e-02 4.640000000000000235e-01
5.378329999999999916e-02 4.610000000000000209e-02 4.610000000000000209e-01
5.801329999999999681e-02 4.580000000000000043e-02 4.580000000000000182e-01
-6.013329999999999891e-03 4.961000000000000132e-02 4.510000000000000120e-01
-1.503329999999999987e-03 4.961000000000000132e-02 4.510000000000000120e-01
3.006669999999999916e-03 4.961000000000000132e-02 4.510000000000000120e-01
7.516669999999999602e-03 4.961000000000000132e-02 4.510000000000000120e-01
1.205329999999999943e-02 4.972000000000000031e-02 4.520000000000000129e-01
1.660999999999999976e-02 4.982999999999999929e-02 4.530000000000000138e-01
2.118669999999999928e-02 4.993999999999999828e-02 4.540000000000000147e-01
2.583999999999999839e-02 5.016000000000000320e-02 4.560000000000000164e-01
3.046669999999999934e-02 5.027000000000000218e-02 4.570000000000000173e-01
3.526669999999999805e-02 5.059999999999999915e-02 4.600000000000000200e-01
3.995329999999999715e-02 5.070999999999999813e-02 4.610000000000000209e-01
4.465999999999999831e-02 5.081999999999999712e-02 4.620000000000000218e-01
4.917330000000000312e-02 5.070999999999999813e-02 4.610000000000000209e-01
5.366669999999999774e-02 5.059999999999999915e-02 4.600000000000000200e-01
-1.503329999999999987e-03 5.412000000000000144e-02 4.510000000000000120e-01
3.013329999999999828e-03 5.423999999999999655e-02 4.520000000000000129e-01
7.550000000000000287e-03 5.435999999999999860e-02 4.530000000000000138e-01
1.210669999999999975e-02 5.448000000000000065e-02 4.540000000000000147e-01
1.664670000000000039e-02 5.448000000000000065e-02 4.540000000000000147e-01
2.123330000000000009e-02 5.460000000000000270e-02 4.550000000000000155e-01
2.589670000000000166e-02 5.483999999999999986e-02 4.570000000000000173e-01
3.059999999999999873e-02 5.507999999999999702e-02 4.590000000000000191e-01
3.534330000000000110e-02 5.532000000000000112e-02 4.610000000000000209e-01
4.003999999999999920e-02 5.544000000000000317e-02 4.620000000000000218e-01
4.446669999999999789e-02 5.519999999999999907e-02 4.600000000000000200e-01
4.885330000000000228e-02 5.496000000000000191e-02 4.580000000000000182e-01
7.566670000000000167e-03 5.902000000000000302e-02 4.540000000000000147e-01
1.216000000000000067e-02 5.927999999999999936e-02 4.560000000000000164e-01
1.675669999999999937e-02 5.940999999999999753e-02 4.570000000000000173e-01
2.132670000000000052e-02 5.940999999999999753e-02 4.570000000000000173e-01
2.606670000000000167e-02 5.979999999999999899e-02 4.600000000000000200e-01
3.073330000000000159e-02 5.992999999999999716e-02 4.610000000000000209e-01
3.534330000000000110e-02 5.992999999999999716e-02 4.610000000000000209e-01
3.969330000000000080e-02 5.954000000000000264e-02 4.580000000000000182e-01
4.417669999999999930e-02 5.940999999999999753e-02 4.570000000000000173e-01
7.499999999999999722e-03 6.300000000000000044e-02 4.500000000000000111e-01
1.221329999999999985e-02 6.411999999999999644e-02 4.580000000000000182e-01
1.690329999999999958e-02 6.454000000000000015e-02 4.610000000000000209e-01
2.165330000000000032e-02 6.496000000000000385e-02 4.640000000000000235e-01
2.634999999999999842e-02 6.510000000000000508e-02 4.650000000000000244e-01
3.086670000000000039e-02 6.482000000000000262e-02 4.630000000000000226e-01
3.917330000000000118e-02 6.328000000000000291e-02 4.520000000000000129e-01
1.192000000000000004e-02 6.704999999999999849e-02 4.470000000000000084e-01
