-4.712000000000000216e-02 -7.295999999999999708e-02 4.560000000000000164e-01
1.183999999999999983e-02 -7.104000000000000592e-02 4.440000000000000058e-01
1.631669999999999995e-02 -7.119999999999999940e-02 4.450000000000000067e-01
2.086000000000000007e-02 -7.152000000000000024e-02 4.470000000000000084e-01
-1.024000000000000049e-01 -7.199999999999999456e-02 4.799999999999999822e-01
-9.637999999999999345e-02 -7.109999999999999654e-02 4.739999999999999769e-01
-8.796669999999999490e-02 -6.825000000000000511e-02 4.550000000000000155e-01
-8.304999999999999882e-02 -6.794999999999999651e-02 4.530000000000000138e-01
-5.648670000000000080e-02 -6.869999999999999718e-02 4.580000000000000182e-01
-5.156670000000000004e-02 -6.825000000000000511e-02 4.550000000000000155e-01
-4.670669999999999683e-02 -6.779999999999999916e-02 4.520000000000000129e-01
-4.172000000000000014e-02 -6.704999999999999849e-02 4.470000000000000084e-01
-3.691669999999999674e-02 -6.644999999999999518e-02 4.430000000000000049e-01
1.170670000000000044e-02 -6.585000000000000575e-02 4.390000000000000013e-01
1.617000000000000035e-02 -6.615000000000000047e-02 4.410000000000000031e-01
2.067329999999999862e-02 -6.644999999999999518e-02 4.430000000000000049e-01
2.532999999999999835e-02 -6.704999999999999849e-02 4.470000000000000084e-01
3.020000000000000115e-02 -6.794999999999999651e-02 4.530000000000000138e-01
-1.072000000000000036e-01 -6.719999999999999585e-02 4.799999999999999822e-01
-1.017600000000000032e-01 -6.678000000000000602e-02 4.769999999999999796e-01
-9.617670000000000385e-02 -6.622000000000000108e-02 4.729999999999999760e-01
-9.086669999999999470e-02 -6.579999999999999738e-02 4.699999999999999734e-01
-8.561670000000000391e-02 -6.537999999999999368e-02 4.670000000000000262e-01
-8.060000000000000497e-02 -6.510000000000000508e-02 4.650000000000000244e-01
-7.562330000000000441e-02 -6.482000000000000262e-02 4.630000000000000226e-01
-7.084000000000000019e-02 -6.468000000000000138e-02 4.620000000000000218e-01
-6.593330000000000024e-02 -6.439999999999999891e-02 4.600000000000000200e-01
-6.106670000000000154e-02 -6.411999999999999644e-02 4.580000000000000182e-01
-5.599330000000000279e-02 -6.356000000000000538e-02 4.540000000000000147e-01
-5.111330000000000040e-02 -6.314000000000000168e-02 4.510000000000000120e-01
-4.629330000000000250e-02 -6.271999999999999797e-02 4.480000000000000093e-01
-4.153330000000000216e-02 -6.230000000000000121e-02 4.450000000000000067e-01
-3.683329999999999937e-02 -6.187999999999999751e-02 4.420000000000000040e-01
-3.212000000000000272e-02 -6.131999999999999951e-02 4.380000000000000004e-01
7.233329999999999621e-03 -6.076000000000000151e-02 4.339999999999999969e-01
1.162670000000000023e-02 -6.103999999999999704e-02 4.359999999999999987e-01
1.602330000000000074e-02 -6.117999999999999827e-02 4.369999999999999996e-01
2.053330000000000086e-02 -6.160000000000000198e-02 4.400000000000000022e-01
2.510329999999999853e-02 -6.201999999999999874e-02 4.430000000000000049e-01
2.986669999999999950e-02 -6.271999999999999797e-02 4.480000000000000093e-01
3.488329999999999903e-02 -6.370000000000000662e-02 4.550000000000000155e-01
-1.056369999999999948e-01 -6.149000000000000299e-02 4.729999999999999760e-01
-1.004799999999999999e-01 -6.122999999999999970e-02 4.709999999999999742e-01
-9.556670000000000442e-02 -6.110000000000000153e-02 4.699999999999999734e-01
-9.067329999999999834e-02 -6.097000000000000336e-02 4.689999999999999725e-01
-8.525000000000000633e-02 -6.044999999999999679e-02 4.650000000000000244e-01
-8.025329999999999964e-02 -6.019000000000000045e-02 4.630000000000000226e-01
-7.513330000000000009e-02 -5.979999999999999899e-02 4.600000000000000200e-01
-7.037999999999999812e-02 -5.967000000000000082e-02 4.590000000000000191e-01
-6.536000000000000143e-02 -5.927999999999999936e-02 4.560000000000000164e-01
-6.013330000000000064e-02 -5.863000000000000156e-02 4.510000000000000120e-01
-5.525329999999999825e-02 -5.824000000000000010e-02 4.480000000000000093e-01
-5.054669999999999996e-02 -5.797999999999999682e-02 4.460000000000000075e-01
-4.577669999999999656e-02 -5.759000000000000230e-02 4.430000000000000049e-01
-4.106669999999999765e-02 -5.720000000000000084e-02 4.400000000000000022e-01
-3.649999999999999772e-02 -5.693999999999999756e-02 4.380000000000000004e-01
-3.189999999999999780e-02 -5.655000000000000304e-02 4.349999999999999978e-01
-2.748669999999999933e-02 -5.641999999999999793e-02 4.339999999999999969e-01
-2.309330000000000063e-02 -5.628999999999999976e-02 4.329999999999999960e-01
-1.872000000000000053e-02 -5.616000000000000159e-02 4.319999999999999951e-01
-1.436669999999999961e-02 -5.603000000000000341e-02 4.309999999999999942e-01
-1.008000000000000042e-02 -5.616000000000000159e-02 4.319999999999999951e-01
-5.760000000000000363e-03 -5.616000000000000159e-02 4.319999999999999951e-01
-1.440000000000000091e-03 -5.616000000000000159e-02 4.319999999999999951e-01
2.886670000000000035e-03 -5.628999999999999976e-02 4.329999999999999960e-01
7.216669999999999682e-03 -5.628999999999999976e-02 4.329999999999999960e-01
1.157329999999999991e-02 -5.641999999999999793e-02 4.339999999999999969e-01
1.598669999999999952e-02 -5.668000000000000121e-02 4.359999999999999987e-01
2.043999999999999984e-02 -5.693999999999999756e-02 4.380000000000000004e-01
2.493329999999999852e-02 -5.720000000000000084e-02 4.400000000000000022e-01
2.966670000000000071e-02 -5.784999999999999865e-02 4.450000000000000067e-01
3.434670000000000084e-02 -5.824000000000000010e-02 4.480000000000000093e-01
3.951999999999999957e-02 -5.927999999999999936e-02 4.560000000000000164e-01
-1.042970000000000008e-01 -5.603999999999999954e-02 4.670000000000000262e-01
-9.983999999999999819e-02 -5.616000000000000159e-02 4.680000000000000271e-01
-9.495670000000000499e-02 -5.603999999999999954e-02 4.670000000000000262e-01
-8.970670000000000033e-02 -5.568000000000000033e-02 4.640000000000000235e-01
-8.451670000000000016e-02 -5.532000000000000112e-02 4.610000000000000209e-01
-7.956000000000000572e-02 -5.507999999999999702e-02 4.590000000000000191e-01
-7.464329999999999576e-02 -5.483999999999999986e-02 4.570000000000000173e-01
-6.976670000000000094e-02 -5.460000000000000270e-02 4.550000000000000155e-01
-6.464330000000000076e-02 -5.412000000000000144e-02 4.510000000000000120e-01
-5.960000000000000020e-02 -5.364000000000000018e-02 4.470000000000000084e-01
-5.476000000000000312e-02 -5.328000000000000097e-02 4.440000000000000058e-01
-5.009330000000000033e-02 -5.303999999999999687e-02 4.420000000000000040e-01
-4.536330000000000223e-02 -5.267999999999999766e-02 4.390000000000000013e-01
-4.078670000000000212e-02 -5.244000000000000050e-02 4.369999999999999996e-01
-3.624999999999999750e-02 -5.220000000000000334e-02 4.349999999999999978e-01
-3.182669999999999944e-02 -5.208000000000000129e-02 4.339999999999999969e-01
-2.735999999999999890e-02 -5.183999999999999719e-02 4.319999999999999951e-01
-2.304000000000000145e-02 -5.183999999999999719e-02 4.319999999999999951e-01
-1.863329999999999848e-02 -5.160000000000000003e-02 4.299999999999999933e-01
-1.430000000000000021e-02 -5.147999999999999798e-02 4.289999999999999925e-01
-1.000999999999999980e-02 -5.147999999999999798e-02 4.289999999999999925e-01
-5.720000000000000258e-03 -5.147999999999999798e-02 4.289999999999999925e-01
-1.433330000000000021e-03 -5.160000000000000003e-02 4.299999999999999933e-01
2.873329999999999895e-03 -5.172000000000000208e-02 4.309999999999999942e-01
7.183329999999999924e-03 -5.172000000000000208e-02 4.309999999999999942e-01
1.157329999999999991e-02 -5.208000000000000129e-02 4.339999999999999969e-01
1.594999999999999890e-02 -5.220000000000000334e-02 4.349999999999999978e-01
2.034669999999999881e-02 -5.231999999999999845e-02 4.359999999999999987e-01
-1.040729999999999988e-01 -5.126000000000000001e-02 4.660000000000000253e-01
-9.941329999999999611e-02 -5.126000000000000001e-02 4.660000000000000253e-01
-9.434670000000000556e-02 -5.104000000000000203e-02 4.640000000000000235e-01
-8.931999999999999662e-02 -5.081999999999999712e-02 4.620000000000000218e-01
-8.415000000000000258e-02 -5.049000000000000016e-02 4.590000000000000191e-01
-7.886669999999999792e-02 -5.004999999999999727e-02 4.550000000000000155e-01
-7.399000000000000021e-02 -4.982999999999999929e-02 4.530000000000000138e-01
-6.915330000000000088e-02 -4.961000000000000132e-02 4.510000000000000120e-01
-6.421330000000000093e-02 -4.927999999999999742e-02 4.480000000000000093e-01
-5.933329999999999854e-02 -4.895000000000000046e-02 4.450000000000000067e-01
-5.451330000000000064e-02 -4.861999999999999655e-02 4.420000000000000040e-01
-4.975330000000000030e-02 -4.828999999999999959e-02 4.390000000000000013e-01
-4.515670000000000101e-02 -4.807000000000000162e-02 4.369999999999999996e-01
-4.059999999999999720e-02 -4.784999999999999670e-02 4.349999999999999978e-01
-3.608329999999999871e-02 -4.762999999999999873e-02 4.329999999999999960e-01
-3.167999999999999983e-02 -4.751999999999999974e-02 4.319999999999999951e-01
-2.729670000000000013e-02 -4.741000000000000075e-02 4.309999999999999942e-01
-2.288000000000000103e-02 -4.719000000000000278e-02 4.289999999999999925e-01
-1.854669999999999930e-02 -4.707999999999999685e-02 4.279999999999999916e-01
-1.426670000000000021e-02 -4.707999999999999685e-02 4.279999999999999916e-01
-1.000999999999999980e-02 -4.719000000000000278e-02 4.289999999999999925e-01
-5.720000000000000258e-03 -4.719000000000000278e-02 4.289999999999999925e-01
-1.426670000000000108e-03 -4.707999999999999685e-02 4.279999999999999916e-01
2.853329999999999842e-03 -4.707999999999999685e-02 4.279999999999999916e-01
7.133330000000000226e-03 -4.707999999999999685e-02 4.279999999999999916e-01
1.149329999999999970e-02 -4.741000000000000075e-02 4.309999999999999942e-01
1.583999999999999991e-02 -4.751999999999999974e-02 4.319999999999999951e-01
-9.941329999999999611e-02 -4.660000000000000253e-02 4.660000000000000253e-01
-9.454999999999999516e-02 -4.649999999999999967e-02 4.650000000000000244e-01
-8.951330000000000398e-02 -4.630000000000000088e-02 4.630000000000000226e-01
-8.415000000000000258e-02 -4.590000000000000330e-02 4.590000000000000191e-01
-7.886669999999999792e-02 -4.549999999999999878e-02 4.550000000000000155e-01
-7.382669999999999511e-02 -4.519999999999999712e-02 4.520000000000000129e-01
-6.900000000000000577e-02 -4.499999999999999833e-02 4.500000000000000111e-01
-6.407000000000000195e-02 -4.469999999999999668e-02 4.470000000000000084e-01
-5.906669999999999976e-02 -4.429999999999999910e-02 4.430000000000000049e-01
-5.426670000000000105e-02 -4.399999999999999745e-02 4.400000000000000022e-01
-4.963999999999999663e-02 -4.379999999999999866e-02 4.380000000000000004e-01
-4.505329999999999752e-02 -4.359999999999999987e-02 4.359999999999999987e-01
-4.041329999999999922e-02 -4.329999999999999821e-02 4.329999999999999960e-01
-3.599999999999999728e-02 -4.320000000000000229e-02 4.319999999999999951e-01
-3.167999999999999983e-02 -4.320000000000000229e-02 4.319999999999999951e-01
-2.723329999999999848e-02 -4.299999999999999656e-02 4.299999999999999933e-01
-2.282669999999999838e-02 -4.279999999999999777e-02 4.279999999999999916e-01
-1.850330000000000030e-02 -4.270000000000000184e-02 4.269999999999999907e-01
-1.426670000000000021e-02 -4.279999999999999777e-02 4.279999999999999916e-01
-9.963329999999999409e-03 -4.270000000000000184e-02 4.269999999999999907e-01
-5.693329999999999919e-03 -4.270000000000000184e-02 4.269999999999999907e-01
-1.423329999999999994e-03 -4.270000000000000184e-02 4.269999999999999907e-01
2.846669999999999930e-03 -4.270000000000000184e-02 4.269999999999999907e-01
7.116670000000000287e-03 -4.270000000000000184e-02 4.269999999999999907e-01
1.141329999999999949e-02 -4.279999999999999777e-02 4.279999999999999916e-01
1.565669999999999909e-02 -4.270000000000000184e-02 4.269999999999999907e-01
-9.898669999999999691e-02 -4.175999999999999851e-02 4.640000000000000235e-01
-9.393999999999999573e-02 -4.157999999999999891e-02 4.620000000000000218e-01
-8.873999999999999944e-02 -4.130999999999999950e-02 4.590000000000000191e-01
-8.359999999999999376e-02 -4.104000000000000009e-02 4.560000000000000164e-01
-7.852000000000000646e-02 -4.077000000000000068e-02 4.530000000000000138e-01
-7.349999999999999589e-02 -4.050000000000000128e-02 4.500000000000000111e-01
-6.869329999999999881e-02 -4.032000000000000167e-02 4.480000000000000093e-01
-6.392670000000000297e-02 -4.014000000000000207e-02 4.460000000000000075e-01
-5.893330000000000096e-02 -3.978000000000000286e-02 4.420000000000000040e-01
-5.414329999999999837e-02 -3.951000000000000345e-02 4.390000000000000013e-01
-4.963999999999999663e-02 -3.941999999999999671e-02 4.380000000000000004e-01
-4.505329999999999752e-02 -3.923999999999999710e-02 4.359999999999999987e-01
-4.069330000000000169e-02 -3.923999999999999710e-02 4.359999999999999987e-01
-3.624999999999999750e-02 -3.914999999999999730e-02 4.349999999999999978e-01
-3.167999999999999983e-02 -3.887999999999999790e-02 4.319999999999999951e-01
-2.723329999999999848e-02 -3.869999999999999829e-02 4.299999999999999933e-01
-2.288000000000000103e-02 -3.860999999999999849e-02 4.289999999999999925e-01
-1.850330000000000030e-02 -3.842999999999999888e-02 4.269999999999999907e-01
-1.426670000000000021e-02 -3.851999999999999869e-02 4.279999999999999916e-01
-9.986669999999999575e-03 -3.851999999999999869e-02 4.279999999999999916e-01
-5.706669999999999625e-03 -3.851999999999999869e-02 4.279999999999999916e-01
-1.426670000000000108e-03 -3.851999999999999869e-02 4.279999999999999916e-01
2.846669999999999930e-03 -3.842999999999999888e-02 4.269999999999999907e-01
7.100000000000000408e-03 -3.833999999999999908e-02 4.259999999999999898e-01
1.136000000000000031e-02 -3.833999999999999908e-02 4.259999999999999898e-01
-9.877329999999999444e-02 -3.703999999999999654e-02 4.630000000000000226e-01
-9.353329999999999977e-02 -3.679999999999999938e-02 4.600000000000000200e-01
-8.816000000000000225e-02 -3.647999999999999854e-02 4.560000000000000164e-01
-8.341669999999999641e-02 -3.640000000000000180e-02 4.550000000000000155e-01
-7.834670000000000523e-02 -3.615999999999999770e-02 4.520000000000000129e-01
-7.349999999999999589e-02 -3.599999999999999728e-02 4.500000000000000111e-01
-6.854000000000000370e-02 -3.576000000000000012e-02 4.470000000000000084e-01
-6.364000000000000212e-02 -3.552000000000000296e-02 4.440000000000000058e-01
-5.879999999999999810e-02 -3.527999999999999886e-02 4.410000000000000031e-01
-5.401999999999999857e-02 -3.504000000000000170e-02 4.380000000000000004e-01
-4.952669999999999989e-02 -3.495999999999999802e-02 4.369999999999999996e-01
-4.505329999999999752e-02 -3.488000000000000128e-02 4.359999999999999987e-01
-4.050669999999999965e-02 -3.472000000000000086e-02 4.339999999999999969e-01
-3.599999999999999728e-02 -3.456000000000000044e-02 4.319999999999999951e-01
-3.160670000000000146e-02 -3.447999999999999676e-02 4.309999999999999942e-01
-2.716999999999999971e-02 -3.432000000000000328e-02 4.289999999999999925e-01
-2.288000000000000103e-02 -3.432000000000000328e-02 4.289999999999999925e-01
-1.854669999999999930e-02 -3.423999999999999960e-02 4.279999999999999916e-01
-1.423330000000000081e-02 -3.416000000000000286e-02 4.269999999999999907e-01
-9.963329999999999409e-03 -3.416000000000000286e-02 4.269999999999999907e-01
-5.746669999999999730e-03 -3.447999999999999676e-02 4.309999999999999942e-01
-1.423329999999999994e-03 -3.416000000000000286e-02 4.269999999999999907e-01
2.840000000000000076e-03 -3.407999999999999918e-02 4.259999999999999898e-01
7.100000000000000408e-03 -3.407999999999999918e-02 4.259999999999999898e-01
1.133329999999999928e-02 -3.400000000000000244e-02 4.249999999999999889e-01
1.554670000000000010e-02 -3.391999999999999876e-02 4.239999999999999880e-01
-9.332999999999999630e-02 -3.212999999999999884e-02 4.590000000000000191e-01
-8.816000000000000225e-02 -3.191999999999999699e-02 4.560000000000000164e-01
-8.304999999999999882e-02 -3.171000000000000207e-02 4.530000000000000138e-01
-7.817330000000000112e-02 -3.157000000000000084e-02 4.510000000000000120e-01
-7.349999999999999589e-02 -3.150000000000000022e-02 4.500000000000000111e-01
-6.854000000000000370e-02 -3.128999999999999837e-02 4.470000000000000084e-01
-6.335330000000000128e-02 -3.093999999999999875e-02 4.420000000000000040e-01
-5.866670000000000218e-02 -3.080000000000000099e-02 4.400000000000000022e-01
-5.401999999999999857e-02 -3.065999999999999975e-02 4.380000000000000004e-01
-4.975330000000000030e-02 -3.073000000000000037e-02 4.390000000000000013e-01
-4.484670000000000323e-02 -3.038000000000000075e-02 4.339999999999999969e-01
-4.022669999999999718e-02 -3.016999999999999890e-02 4.309999999999999942e-01
-3.599999999999999728e-02 -3.023999999999999952e-02 4.319999999999999951e-01
-3.160670000000000146e-02 -3.016999999999999890e-02 4.309999999999999942e-01
-2.716999999999999971e-02 -3.003000000000000114e-02 4.289999999999999925e-01
-2.272000000000000061e-02 -2.981999999999999929e-02 4.259999999999999898e-01
-1.837329999999999866e-02 -2.968000000000000152e-02 4.239999999999999880e-01
-1.409999999999999969e-02 -2.961000000000000090e-02 4.229999999999999871e-01
-9.893330000000000526e-03 -2.968000000000000152e-02 4.239999999999999880e-01
-5.666670000000000387e-03 -2.974999999999999867e-02 4.249999999999999889e-01
-1.420000000000000038e-03 -2.981999999999999929e-02 4.259999999999999898e-01
2.846669999999999930e-03 -2.988999999999999990e-02 4.269999999999999907e-01
7.116670000000000287e-03 -2.988999999999999990e-02 4.269999999999999907e-01
1.136000000000000031e-02 -2.981999999999999929e-02 4.259999999999999898e-01
1.558329999999999958e-02 -2.974999999999999867e-02 4.249999999999999889e-01
-9.332999999999999630e-02 -2.753999999999999851e-02 4.590000000000000191e-01
-8.816000000000000225e-02 -2.735999999999999890e-02 4.560000000000000164e-01
-8.304999999999999882e-02 -2.717999999999999930e-02 4.530000000000000138e-01
-7.817330000000000112e-02 -2.706000000000000072e-02 4.510000000000000120e-01
-7.366330000000000100e-02 -2.706000000000000072e-02 4.510000000000000120e-01
-6.854000000000000370e-02 -2.682000000000000009e-02 4.470000000000000084e-01
-6.349670000000000314e-02 -2.657999999999999946e-02 4.430000000000000049e-01
-5.866670000000000218e-02 -2.639999999999999986e-02 4.400000000000000022e-01
-5.401999999999999857e-02 -2.628000000000000128e-02 4.380000000000000004e-01
-4.941330000000000028e-02 -2.615999999999999923e-02 4.359999999999999987e-01
-4.463999999999999913e-02 -2.591999999999999860e-02 4.319999999999999951e-01
-4.022669999999999718e-02 -2.586000000000000104e-02 4.309999999999999942e-01
-3.591670000000000279e-02 -2.586000000000000104e-02 4.309999999999999942e-01
-3.160670000000000146e-02 -2.586000000000000104e-02 4.309999999999999942e-01
-2.723329999999999848e-02 -2.580000000000000002e-02 4.299999999999999933e-01
-2.277329999999999979e-02 -2.562000000000000041e-02 4.269999999999999907e-01
-1.841670000000000113e-02 -2.549999999999999836e-02 4.249999999999999889e-01
-1.409999999999999969e-02 -2.537999999999999978e-02 4.229999999999999871e-01
-9.893330000000000526e-03 -2.544000000000000081e-02 4.239999999999999880e-01
-5.680000000000000153e-03 -2.555999999999999939e-02 4.259999999999999898e-01
-1.416670000000000082e-03 -2.549999999999999836e-02 4.249999999999999889e-01
7.116670000000000287e-03 -2.562000000000000041e-02 4.269999999999999907e-01
1.136000000000000031e-02 -2.555999999999999939e-02 4.259999999999999898e-01
1.562000000000000020e-02 -2.555999999999999939e-02 4.259999999999999898e-01
-8.816000000000000225e-02 -2.280000000000000082e-02 4.560000000000000164e-01
-8.323329999999999618e-02 -2.270000000000000143e-02 4.540000000000000147e-01
-7.852000000000000646e-02 -2.264999999999999999e-02 4.530000000000000138e-01
-7.382669999999999511e-02 -2.259999999999999856e-02 4.520000000000000129e-01
-6.854000000000000370e-02 -2.234999999999999834e-02 4.470000000000000084e-01
-6.349670000000000314e-02 -2.214999999999999955e-02 4.430000000000000049e-01
-5.879999999999999810e-02 -2.205000000000000016e-02 4.410000000000000031e-01
-5.401999999999999857e-02 -2.189999999999999933e-02 4.380000000000000004e-01
-4.929999999999999660e-02 -2.174999999999999850e-02 4.349999999999999978e-01
-4.463999999999999913e-02 -2.160000000000000114e-02 4.319999999999999951e-01
-4.013329999999999675e-02 -2.149999999999999828e-02 4.299999999999999933e-01
-3.583329999999999849e-02 -2.149999999999999828e-02 4.299999999999999933e-01
-3.153330000000000022e-02 -2.149999999999999828e-02 4.299999999999999933e-01
-2.735999999999999890e-02 -2.160000000000000114e-02 4.319999999999999951e-01
-9.916670000000000693e-03 -2.125000000000000153e-02 4.249999999999999889e-01
-5.693329999999999919e-03 -2.135000000000000092e-02 4.269999999999999907e-01
1.136000000000000031e-02 -2.129999999999999949e-02 4.259999999999999898e-01
1.558329999999999958e-02 -2.125000000000000153e-02 4.249999999999999889e-01
1.978670000000000082e-02 -2.120000000000000009e-02 4.239999999999999880e-01
-8.323329999999999618e-02 -1.815999999999999906e-02 4.540000000000000147e-01
-7.852000000000000646e-02 -1.812000000000000069e-02 4.530000000000000138e-01
-7.382669999999999511e-02 -1.807999999999999885e-02 4.520000000000000129e-01
-6.900000000000000577e-02 -1.799999999999999864e-02 4.500000000000000111e-01
-6.378330000000000111e-02 -1.779999999999999985e-02 4.450000000000000067e-01
-5.879999999999999810e-02 -1.763999999999999943e-02 4.410000000000000031e-01
-5.414329999999999837e-02 -1.755999999999999922e-02 4.390000000000000013e-01
-4.941330000000000028e-02 -1.744000000000000064e-02 4.359999999999999987e-01
-4.484670000000000323e-02 -1.736000000000000043e-02 4.339999999999999969e-01
-4.032000000000000167e-02 -1.728000000000000022e-02 4.319999999999999951e-01
-3.591670000000000279e-02 -1.723999999999999838e-02 4.309999999999999942e-01
-3.160670000000000146e-02 -1.723999999999999838e-02 4.309999999999999942e-01
-2.748669999999999933e-02 -1.736000000000000043e-02 4.339999999999999969e-01
1.550999999999999948e-02 -1.692000000000000101e-02 4.229999999999999871e-01
1.969330000000000039e-02 -1.687999999999999917e-02 4.219999999999999862e-01
-7.834670000000000523e-02 -1.355999999999999914e-02 4.520000000000000129e-01
-7.382669999999999511e-02 -1.355999999999999914e-02 4.520000000000000129e-01
-6.900000000000000577e-02 -1.349999999999999985e-02 4.500000000000000111e-01
-6.407000000000000195e-02 -1.341000000000000004e-02 4.470000000000000084e-01
-5.920000000000000262e-02 -1.332000000000000024e-02 4.440000000000000058e-01
-5.439000000000000085e-02 -1.323000000000000044e-02 4.410000000000000031e-01
-4.986669999999999991e-02 -1.319999999999999993e-02 4.400000000000000022e-01
-4.722330000000000277e-02 -1.370999999999999996e-02 4.570000000000000173e-01
-3.608329999999999871e-02 -1.298999999999999981e-02 4.329999999999999960e-01
-3.153330000000000022e-02 -1.290000000000000001e-02 4.299999999999999933e-01
-2.716999999999999971e-02 -1.286999999999999950e-02 4.289999999999999925e-01
-2.288000000000000103e-02 -1.286999999999999950e-02 4.289999999999999925e-01
-9.870000000000000301e-03 -1.268999999999999989e-02 4.229999999999999871e-01
-5.626670000000000282e-03 -1.265999999999999938e-02 4.219999999999999862e-01
7.083329999999999661e-03 -1.274999999999999918e-02 4.249999999999999889e-01
1.130669999999999939e-02 -1.272000000000000040e-02 4.239999999999999880e-01
1.550999999999999948e-02 -1.268999999999999989e-02 4.229999999999999871e-01
1.974000000000000060e-02 -1.268999999999999989e-02 4.229999999999999871e-01
2.391329999999999845e-02 -1.265999999999999938e-02 4.219999999999999862e-01
2.819999999999999937e-02 -1.268999999999999989e-02 4.229999999999999871e-01
-7.852000000000000646e-02 -9.060000000000000345e-03 4.530000000000000138e-01
-7.382669999999999511e-02 -9.039999999999999425e-03 4.520000000000000129e-01
-6.900000000000000577e-02 -8.999999999999999320e-03 4.500000000000000111e-01
-6.407000000000000195e-02 -8.940000000000000030e-03 4.470000000000000084e-01
-5.946669999999999734e-02 -8.920000000000000845e-03 4.460000000000000075e-01
-5.463670000000000332e-02 -8.859999999999999820e-03 4.430000000000000049e-01
-4.997999999999999665e-02 -8.819999999999999715e-03 4.410000000000000031e-01
-4.577669999999999656e-02 -8.859999999999999820e-03 4.430000000000000049e-01
-3.633329999999999893e-02 -8.720000000000000320e-03 4.359999999999999987e-01
-3.160670000000000146e-02 -8.619999999999999191e-03 4.309999999999999942e-01
-2.716999999999999971e-02 -8.580000000000000820e-03 4.289999999999999925e-01
-2.288000000000000103e-02 -8.580000000000000820e-03 4.289999999999999925e-01
-1.854669999999999930e-02 -8.559999999999999901e-03 4.279999999999999916e-01
-9.846670000000000075e-03 -8.439999999999999586e-03 4.219999999999999862e-01
-5.640000000000000048e-03 -8.460000000000000506e-03 4.229999999999999871e-01
1.128000000000000010e-02 -8.460000000000000506e-03 4.229999999999999871e-01
1.554670000000000010e-02 -8.479999999999999691e-03 4.239999999999999880e-01
1.974000000000000060e-02 -8.460000000000000506e-03 4.229999999999999871e-01
2.397000000000000172e-02 -8.460000000000000506e-03 4.229999999999999871e-01
2.826669999999999877e-02 -8.479999999999999691e-03 4.239999999999999880e-01
3.258330000000000254e-02 -8.500000000000000611e-03 4.249999999999999889e-01
-7.399000000000000021e-02 -4.530000000000000172e-03 4.530000000000000138e-01
-6.915330000000000088e-02 -4.510000000000000120e-03 4.510000000000000120e-01
-6.421330000000000093e-02 -4.479999999999999608e-03 4.480000000000000093e-01
-5.933329999999999854e-02 -4.449999999999999963e-03 4.450000000000000067e-01
-5.463670000000000332e-02 -4.429999999999999910e-03 4.430000000000000049e-01
-5.009330000000000033e-02 -4.420000000000000318e-03 4.420000000000000040e-01
-4.546669999999999878e-02 -4.400000000000000265e-03 4.400000000000000022e-01
-4.078670000000000212e-02 -4.369999999999999753e-03 4.369999999999999996e-01
-3.624999999999999750e-02 -4.349999999999999700e-03 4.349999999999999978e-01
-3.175329999999999819e-02 -4.329999999999999648e-03 4.329999999999999960e-01
-2.729670000000000013e-02 -4.309999999999999595e-03 4.309999999999999942e-01
-2.288000000000000103e-02 -4.290000000000000410e-03 4.289999999999999925e-01
-1.854669999999999930e-02 -4.279999999999999950e-03 4.279999999999999916e-01
-1.420000000000000082e-02 -4.259999999999999898e-03 4.259999999999999898e-01
-9.870000000000000301e-03 -4.230000000000000253e-03 4.229999999999999871e-01
-5.653329999999999814e-03 -4.239999999999999845e-03 4.239999999999999880e-01
-1.413329999999999968e-03 -4.239999999999999845e-03 4.239999999999999880e-01
2.826669999999999877e-03 -4.239999999999999845e-03 4.239999999999999880e-01
1.125330000000000080e-02 -4.219999999999999793e-03 4.219999999999999862e-01
1.547330000000000060e-02 -4.219999999999999793e-03 4.219999999999999862e-01
1.974000000000000060e-02 -4.230000000000000253e-03 4.229999999999999871e-01
2.408329999999999846e-02 -4.250000000000000305e-03 4.249999999999999889e-01
2.833329999999999876e-02 -4.250000000000000305e-03 4.249999999999999889e-01
3.258330000000000254e-02 -4.250000000000000305e-03 4.249999999999999889e-01
3.683329999999999937e-02 -4.250000000000000305e-03 4.249999999999999889e-01
4.118000000000000133e-02 -4.259999999999999898e-03 4.259999999999999898e-01
4.554670000000000246e-02 -4.270000000000000358e-03 4.269999999999999907e-01
4.981669999999999848e-02 -4.270000000000000358e-03 4.269999999999999907e-01
5.421329999999999899e-02 -4.279999999999999950e-03 4.279999999999999916e-01
-6.915330000000000088e-02 0.000000000000000000e+00 4.510000000000000120e-01
-6.450000000000000178e-02 0.000000000000000000e+00 4.500000000000000111e-01
-5.986670000000000186e-02 0.000000000000000000e+00 4.490000000000000102e-01
-5.488330000000000292e-02 0.000000000000000000e+00 4.450000000000000067e-01
-5.020669999999999994e-02 0.000000000000000000e+00 4.430000000000000049e-01
-4.546669999999999878e-02 0.000000000000000000e+00 4.400000000000000022e-01
-4.078670000000000212e-02 0.000000000000000000e+00 4.369999999999999996e-01
-3.624999999999999750e-02 0.000000000000000000e+00 4.349999999999999978e-01
-3.182669999999999944e-02 0.000000000000000000e+00 4.339999999999999969e-01
-2.735999999999999890e-02 0.000000000000000000e+00 4.319999999999999951e-01
-2.298669999999999880e-02 0.000000000000000000e+00 4.309999999999999942e-01
-1.863329999999999848e-02 0.000000000000000000e+00 4.299999999999999933e-01
-1.426670000000000021e-02 0.000000000000000000e+00 4.279999999999999916e-01
-9.893330000000000526e-03 0.000000000000000000e+00 4.239999999999999880e-01
-5.653329999999999814e-03 0.000000000000000000e+00 4.239999999999999880e-01
-1.416670000000000082e-03 0.000000000000000000e+00 4.249999999999999889e-01
2.833329999999999790e-03 0.000000000000000000e+00 4.249999999999999889e-01
2.408329999999999846e-02 0.000000000000000000e+00 4.249999999999999889e-01
2.833329999999999876e-02 0.000000000000000000e+00 4.249999999999999889e-01
3.250669999999999948e-02 0.000000000000000000e+00 4.239999999999999880e-01
3.674670000000000020e-02 0.000000000000000000e+00 4.239999999999999880e-01
4.108330000000000315e-02 0.000000000000000000e+00 4.249999999999999889e-01
4.544000000000000122e-02 0.000000000000000000e+00 4.259999999999999898e-01
4.981669999999999848e-02 0.000000000000000000e+00 4.269999999999999907e-01
5.446669999999999984e-02 0.000000000000000000e+00 4.299999999999999933e-01
5.904000000000000220e-02 0.000000000000000000e+00 4.319999999999999951e-01
-6.013330000000000064e-02 4.510000000000000120e-03 4.510000000000000120e-01
-5.550000000000000072e-02 4.499999999999999660e-03 4.500000000000000111e-01
-5.077330000000000038e-02 4.479999999999999608e-03 4.480000000000000093e-01
-4.587999999999999717e-02 4.440000000000000370e-03 4.440000000000000058e-01
-4.116000000000000214e-02 4.409999999999999858e-03 4.410000000000000031e-01
-3.649999999999999772e-02 4.380000000000000213e-03 4.380000000000000004e-01
-3.197330000000000311e-02 4.360000000000000160e-03 4.359999999999999987e-01
-2.748669999999999933e-02 4.340000000000000108e-03 4.339999999999999969e-01
-2.309330000000000063e-02 4.329999999999999648e-03 4.329999999999999960e-01
-1.872000000000000053e-02 4.320000000000000055e-03 4.319999999999999951e-01
-1.433330000000000021e-02 4.300000000000000003e-03 4.299999999999999933e-01
-9.963329999999999409e-03 4.270000000000000358e-03 4.269999999999999907e-01
-5.680000000000000153e-03 4.259999999999999898e-03 4.259999999999999898e-01
-1.420000000000000038e-03 4.259999999999999898e-03 4.259999999999999898e-01
2.840000000000000076e-03 4.259999999999999898e-03 4.259999999999999898e-01
7.100000000000000408e-03 4.259999999999999898e-03 4.259999999999999898e-01
1.136000000000000031e-02 4.259999999999999898e-03 4.259999999999999898e-01
1.569330000000000030e-02 4.279999999999999950e-03 4.279999999999999916e-01
1.997329999999999939e-02 4.279999999999999950e-03 4.279999999999999916e-01
2.408329999999999846e-02 4.250000000000000305e-03 4.249999999999999889e-01
2.826669999999999877e-02 4.239999999999999845e-03 4.239999999999999880e-01
3.250669999999999948e-02 4.239999999999999845e-03 4.239999999999999880e-01
3.683329999999999937e-02 4.250000000000000305e-03 4.249999999999999889e-01
4.108330000000000315e-02 4.250000000000000305e-03 4.249999999999999889e-01
4.544000000000000122e-02 4.259999999999999898e-03 4.259999999999999898e-01
4.993329999999999991e-02 4.279999999999999950e-03 4.279999999999999916e-01
5.484669999999999823e-02 4.329999999999999648e-03 4.329999999999999960e-01
5.958669999999999939e-02 4.360000000000000160e-03 4.359999999999999987e-01
6.424000000000000543e-02 4.380000000000000213e-03 4.380000000000000004e-01
-5.550000000000000072e-02 8.999999999999999320e-03 4.500000000000000111e-01
-5.099999999999999672e-02 8.999999999999999320e-03 4.500000000000000111e-01
-4.608670000000000128e-02 8.920000000000000845e-03 4.460000000000000075e-01
-4.125329999999999969e-02 8.840000000000000635e-03 4.420000000000000040e-01
-3.674999999999999795e-02 8.819999999999999715e-03 4.410000000000000031e-01
-3.219330000000000108e-02 8.779999999999999610e-03 4.390000000000000013e-01
-2.767669999999999852e-02 8.739999999999999505e-03 4.369999999999999996e-01
-2.314669999999999922e-02 8.680000000000000215e-03 4.339999999999999969e-01
-1.876330000000000012e-02 8.659999999999999296e-03 4.329999999999999960e-01
-1.439999999999999961e-02 8.640000000000000110e-03 4.319999999999999951e-01
-1.000999999999999980e-02 8.580000000000000820e-03 4.289999999999999925e-01
-5.706669999999999625e-03 8.559999999999999901e-03 4.279999999999999916e-01
-1.423329999999999994e-03 8.540000000000000716e-03 4.269999999999999907e-01
2.846669999999999930e-03 8.540000000000000716e-03 4.269999999999999907e-01
7.116670000000000287e-03 8.540000000000000716e-03 4.269999999999999907e-01
1.138669999999999960e-02 8.540000000000000716e-03 4.269999999999999907e-01
1.565669999999999909e-02 8.540000000000000716e-03 4.269999999999999907e-01
1.992669999999999858e-02 8.540000000000000716e-03 4.269999999999999907e-01
2.414000000000000173e-02 8.519999999999999796e-03 4.259999999999999898e-01
2.833329999999999876e-02 8.500000000000000611e-03 4.249999999999999889e-01
3.258330000000000254e-02 8.500000000000000611e-03 4.249999999999999889e-01
3.683329999999999937e-02 8.500000000000000611e-03 4.249999999999999889e-01
4.118000000000000133e-02 8.519999999999999796e-03 4.259999999999999898e-01
4.565330000000000082e-02 8.559999999999999901e-03 4.279999999999999916e-01
5.109999999999999959e-02 8.760000000000000425e-03 4.380000000000000004e-01
5.560670000000000196e-02 8.779999999999999610e-03 4.390000000000000013e-01
5.985999999999999654e-02 8.760000000000000425e-03 4.380000000000000004e-01
6.438670000000000504e-02 8.779999999999999610e-03 4.390000000000000013e-01
-4.629330000000000250e-02 1.344000000000000056e-02 4.480000000000000093e-01
-4.153330000000000216e-02 1.335000000000000075e-02 4.450000000000000067e-01
-3.708329999999999960e-02 1.335000000000000075e-02 4.450000000000000067e-01
-3.255999999999999867e-02 1.332000000000000024e-02 4.440000000000000058e-01
-2.786670000000000119e-02 1.319999999999999993e-02 4.400000000000000022e-01
-2.330669999999999964e-02 1.311000000000000013e-02 4.369999999999999996e-01
-1.884999999999999870e-02 1.305000000000000084e-02 4.349999999999999978e-01
-1.446670000000000074e-02 1.302000000000000032e-02 4.339999999999999969e-01
-1.005670000000000001e-02 1.293000000000000052e-02 4.309999999999999942e-01
-5.733330000000000023e-03 1.290000000000000001e-02 4.299999999999999933e-01
-1.430000000000000064e-03 1.286999999999999950e-02 4.289999999999999925e-01
2.860000000000000129e-03 1.286999999999999950e-02 4.289999999999999925e-01
7.133330000000000226e-03 1.284000000000000072e-02 4.279999999999999916e-01
1.141329999999999949e-02 1.284000000000000072e-02 4.279999999999999916e-01
1.569330000000000030e-02 1.284000000000000072e-02 4.279999999999999916e-01
1.992669999999999858e-02 1.281000000000000021e-02 4.269999999999999907e-01
2.419670000000000154e-02 1.281000000000000021e-02 4.269999999999999907e-01
2.846670000000000103e-02 1.281000000000000021e-02 4.269999999999999907e-01
3.281329999999999664e-02 1.284000000000000072e-02 4.279999999999999916e-01
3.709330000000000266e-02 1.284000000000000072e-02 4.279999999999999916e-01
4.156669999999999809e-02 1.290000000000000001e-02 4.299999999999999933e-01
4.618669999999999720e-02 1.298999999999999981e-02 4.329999999999999960e-01
5.133329999999999838e-02 1.319999999999999993e-02 4.400000000000000022e-01
5.585999999999999993e-02 1.323000000000000044e-02 4.410000000000000031e-01
6.026999999999999719e-02 1.323000000000000044e-02 4.410000000000000031e-01
6.497329999999999772e-02 1.328999999999999973e-02 4.430000000000000049e-01
-4.209330000000000016e-02 1.804000000000000048e-02 4.510000000000000120e-01
-3.749999999999999861e-02 1.799999999999999864e-02 4.500000000000000111e-01
-3.277999999999999664e-02 1.788000000000000006e-02 4.470000000000000084e-01
-2.811999999999999916e-02 1.776000000000000148e-02 4.440000000000000058e-01
-2.351999999999999924e-02 1.763999999999999943e-02 4.410000000000000031e-01
-1.902329999999999993e-02 1.755999999999999922e-02 4.390000000000000013e-01
-1.456670000000000013e-02 1.747999999999999901e-02 4.369999999999999996e-01
-1.017329999999999970e-02 1.744000000000000064e-02 4.359999999999999987e-01
-5.799999999999999600e-03 1.739999999999999880e-02 4.349999999999999978e-01
-1.443330000000000047e-03 1.731999999999999859e-02 4.329999999999999960e-01
2.880000000000000181e-03 1.728000000000000022e-02 4.319999999999999951e-01
7.199999999999999803e-03 1.728000000000000022e-02 4.319999999999999951e-01
1.576670000000000155e-02 1.720000000000000001e-02 4.299999999999999933e-01
2.001999999999999960e-02 1.716000000000000164e-02 4.289999999999999925e-01
2.430999999999999828e-02 1.716000000000000164e-02 4.289999999999999925e-01
2.866669999999999982e-02 1.720000000000000001e-02 4.299999999999999933e-01
3.304329999999999767e-02 1.723999999999999838e-02 4.309999999999999942e-01
3.726669999999999983e-02 1.720000000000000001e-02 4.299999999999999933e-01
4.175999999999999851e-02 1.728000000000000022e-02 4.319999999999999951e-01
4.639999999999999680e-02 1.739999999999999880e-02 4.349999999999999978e-01
5.109999999999999959e-02 1.752000000000000085e-02 4.380000000000000004e-01
5.548000000000000154e-02 1.752000000000000085e-02 4.380000000000000004e-01
6.054330000000000128e-02 1.771999999999999964e-02 4.430000000000000049e-01
6.555999999999999328e-02 1.788000000000000006e-02 4.470000000000000084e-01
-3.791669999999999763e-02 2.274999999999999939e-02 4.550000000000000155e-01
-3.321999999999999953e-02 2.264999999999999999e-02 4.530000000000000138e-01
-2.837330000000000060e-02 2.239999999999999977e-02 4.480000000000000093e-01
-2.367999999999999966e-02 2.220000000000000098e-02 4.440000000000000058e-01
-1.915330000000000157e-02 2.210000000000000159e-02 4.420000000000000040e-01
-1.466669999999999953e-02 2.199999999999999872e-02 4.400000000000000022e-01
-1.021999999999999992e-02 2.189999999999999933e-02 4.380000000000000004e-01
-5.826669999999999940e-03 2.185000000000000137e-02 4.369999999999999996e-01
-1.453330000000000073e-03 2.179999999999999993e-02 4.359999999999999987e-01
2.899999999999999800e-03 2.174999999999999850e-02 4.349999999999999978e-01
7.233329999999999621e-03 2.170000000000000054e-02 4.339999999999999969e-01
1.154670000000000002e-02 2.164999999999999911e-02 4.329999999999999960e-01
1.583999999999999991e-02 2.160000000000000114e-02 4.319999999999999951e-01
2.016000000000000084e-02 2.160000000000000114e-02 4.319999999999999951e-01
2.442329999999999848e-02 2.154999999999999971e-02 4.309999999999999942e-01
2.873329999999999981e-02 2.154999999999999971e-02 4.309999999999999942e-01
3.311999999999999666e-02 2.160000000000000114e-02 4.319999999999999951e-01
3.752670000000000311e-02 2.164999999999999911e-02 4.329999999999999960e-01
4.204999999999999710e-02 2.174999999999999850e-02 4.349999999999999978e-01
4.661330000000000334e-02 2.185000000000000137e-02 4.369999999999999996e-01
5.109999999999999959e-02 2.189999999999999933e-02 4.380000000000000004e-01
5.573329999999999951e-02 2.199999999999999872e-02 4.400000000000000022e-01
6.095330000000000192e-02 2.230000000000000038e-02 4.460000000000000075e-01
-3.783330000000000026e-02 2.724000000000000032e-02 4.540000000000000147e-01
-3.329329999999999790e-02 2.724000000000000032e-02 4.540000000000000147e-01
-2.856329999999999980e-02 2.706000000000000072e-02 4.510000000000000120e-01
-2.378670000000000090e-02 2.675999999999999907e-02 4.460000000000000075e-01
-1.924000000000000016e-02 2.664000000000000049e-02 4.440000000000000058e-01
-1.476670000000000066e-02 2.657999999999999946e-02 4.430000000000000049e-01
-1.029000000000000054e-02 2.646000000000000088e-02 4.410000000000000031e-01
-5.866670000000000045e-03 2.639999999999999986e-02 4.400000000000000022e-01
-1.459999999999999926e-03 2.628000000000000128e-02 4.380000000000000004e-01
2.913329999999999999e-03 2.622000000000000025e-02 4.369999999999999996e-01
7.266670000000000247e-03 2.615999999999999923e-02 4.359999999999999987e-01
1.159999999999999920e-02 2.610000000000000167e-02 4.349999999999999978e-01
1.598669999999999952e-02 2.615999999999999923e-02 4.359999999999999987e-01
2.034669999999999881e-02 2.615999999999999923e-02 4.359999999999999987e-01
2.464999999999999830e-02 2.610000000000000167e-02 4.349999999999999978e-01
2.900000000000000147e-02 2.610000000000000167e-02 4.349999999999999978e-01
3.334999999999999770e-02 2.610000000000000167e-02 4.349999999999999978e-01
3.778669999999999946e-02 2.615999999999999923e-02 4.359999999999999987e-01
4.234000000000000263e-02 2.628000000000000128e-02 4.380000000000000004e-01
4.671999999999999764e-02 2.628000000000000128e-02 4.380000000000000004e-01
5.133329999999999838e-02 2.639999999999999986e-02 4.400000000000000022e-01
5.661999999999999672e-02 2.682000000000000009e-02 4.470000000000000084e-01
6.204670000000000324e-02 2.724000000000000032e-02 4.540000000000000147e-01
-2.862670000000000145e-02 3.164000000000000146e-02 4.520000000000000129e-01
-2.416000000000000092e-02 3.171000000000000207e-02 4.530000000000000138e-01
-1.949999999999999997e-02 3.150000000000000022e-02 4.500000000000000111e-01
-1.496669999999999945e-02 3.142999999999999960e-02 4.490000000000000102e-01
-1.043000000000000003e-02 3.128999999999999837e-02 4.470000000000000084e-01
-5.919999999999999915e-03 3.107999999999999999e-02 4.440000000000000058e-01
-1.476670000000000023e-03 3.100999999999999937e-02 4.430000000000000049e-01
2.953330000000000104e-03 3.100999999999999937e-02 4.430000000000000049e-01
7.349999999999999763e-03 3.087000000000000161e-02 4.410000000000000031e-01
1.173330000000000033e-02 3.080000000000000099e-02 4.400000000000000022e-01
1.613329999999999972e-02 3.080000000000000099e-02 4.400000000000000022e-01
2.053330000000000086e-02 3.080000000000000099e-02 4.400000000000000022e-01
2.487670000000000159e-02 3.073000000000000037e-02 4.390000000000000013e-01
2.920000000000000026e-02 3.065999999999999975e-02 4.380000000000000004e-01
3.365669999999999773e-02 3.073000000000000037e-02 4.390000000000000013e-01
3.813330000000000192e-02 3.080000000000000099e-02 4.400000000000000022e-01
4.263000000000000123e-02 3.087000000000000161e-02 4.410000000000000031e-01
4.746670000000000056e-02 3.115000000000000061e-02 4.450000000000000067e-01
5.273329999999999684e-02 3.164000000000000146e-02 4.520000000000000129e-01
5.813999999999999724e-02 3.212999999999999884e-02 4.590000000000000191e-01
-2.410669999999999827e-02 3.615999999999999770e-02 4.520000000000000129e-01
-1.963000000000000161e-02 3.624000000000000138e-02 4.530000000000000138e-01
-1.506670000000000058e-02 3.615999999999999770e-02 4.520000000000000129e-01
-1.056999999999999953e-02 3.624000000000000138e-02 4.530000000000000138e-01
-6.026669999999999597e-03 3.615999999999999770e-02 4.520000000000000129e-01
-1.503329999999999987e-03 3.608000000000000096e-02 4.510000000000000120e-01
3.000000000000000062e-03 3.599999999999999728e-02 4.500000000000000111e-01
7.466669999999999904e-03 3.583999999999999686e-02 4.480000000000000093e-01
1.189330000000000075e-02 3.568000000000000338e-02 4.460000000000000075e-01
1.631669999999999995e-02 3.559999999999999970e-02 4.450000000000000067e-01
2.076669999999999905e-02 3.559999999999999970e-02 4.450000000000000067e-01
2.521670000000000161e-02 3.559999999999999970e-02 4.450000000000000067e-01
2.973330000000000070e-02 3.568000000000000338e-02 4.460000000000000075e-01
3.419330000000000286e-02 3.568000000000000338e-02 4.460000000000000075e-01
3.873999999999999666e-02 3.576000000000000012e-02 4.470000000000000084e-01
4.340329999999999883e-02 3.592000000000000054e-02 4.490000000000000102e-01
4.864000000000000268e-02 3.647999999999999854e-02 4.560000000000000164e-01
-1.954329999999999956e-02 4.059000000000000108e-02 4.510000000000000120e-01
-1.506670000000000058e-02 4.068000000000000088e-02 4.520000000000000129e-01
-1.056999999999999953e-02 4.077000000000000068e-02 4.530000000000000138e-01
-6.053329999999999995e-03 4.086000000000000049e-02 4.540000000000000147e-01
-1.516669999999999911e-03 4.095000000000000029e-02 4.550000000000000155e-01
3.040000000000000167e-03 4.104000000000000009e-02 4.560000000000000164e-01
7.616669999999999864e-03 4.112999999999999989e-02 4.570000000000000173e-01
1.218669999999999996e-02 4.112999999999999989e-02 4.570000000000000173e-01
1.675669999999999937e-02 4.112999999999999989e-02 4.570000000000000173e-01
2.132670000000000052e-02 4.112999999999999989e-02 4.570000000000000173e-01
2.583999999999999839e-02 4.104000000000000009e-02 4.560000000000000164e-01
3.046669999999999934e-02 4.112999999999999989e-02 4.570000000000000173e-01
3.511330000000000007e-02 4.121999999999999970e-02 4.580000000000000182e-01
4.003999999999999920e-02 4.157999999999999891e-02 4.620000000000000218e-01
4.485329999999999873e-02 4.175999999999999851e-02 4.640000000000000235e-01
4.991999999999999910e-02 4.211999999999999772e-02 4.680000000000000271e-01
-1.506670000000000058e-02 4.519999999999999712e-02 4.520000000000000129e-01
-1.050000000000000065e-02 4.499999999999999833e-02 4.500000000000000111e-01
-6.026669999999999597e-03 4.519999999999999712e-02 4.520000000000000129e-01
-1.513330000000000014e-03 4.540000000000000285e-02 4.540000000000000147e-01
3.040000000000000167e-03 4.560000000000000164e-02 4.560000000000000164e-01
7.599999999999999985e-03 4.560000000000000164e-02 4.560000000000000164e-01
1.218669999999999996e-02 4.569999999999999757e-02 4.570000000000000173e-01
1.679330000000000059e-02 4.580000000000000043e-02 4.580000000000000182e-01
2.146669999999999828e-02 4.599999999999999922e-02 4.600000000000000200e-01
2.612329999999999861e-02 4.610000000000000209e-02 4.610000000000000209e-01
3.086670000000000039e-02 4.630000000000000088e-02 4.630000000000000226e-01
3.565000000000000113e-02 4.649999999999999967e-02 4.650000000000000244e-01
4.047329999999999678e-02 4.669999999999999846e-02 4.670000000000000262e-01
4.533670000000000061e-02 4.689999999999999725e-02 4.689999999999999725e-01
4.981329999999999786e-02 4.669999999999999846e-02 4.670000000000000262e-01
-6.013329999999999891e-03 4.961000000000000132e-02 4.510000000000000120e-01
-1.506670000000000101e-03 4.972000000000000031e-02 4.520000000000000129e-01
3.020000000000000115e-03 4.982999999999999929e-02 4.530000000000000138e-01
7.550000000000000287e-03 4.982999999999999929e-02 4.530000000000000138e-01
1.213329999999999964e-02 5.004999999999999727e-02 4.550000000000000155e-01
1.671999999999999875e-02 5.016000000000000320e-02 4.560000000000000164e-01
2.137330000000000133e-02 5.038000000000000117e-02 4.580000000000000182e-01
2.612329999999999861e-02 5.070999999999999813e-02 4.610000000000000209e-01
3.086670000000000039e-02 5.093000000000000305e-02 4.630000000000000226e-01
3.572670000000000012e-02 5.126000000000000001e-02 4.660000000000000253e-01
4.047329999999999678e-02 5.136999999999999900e-02 4.670000000000000262e-01
4.465999999999999831e-02 5.081999999999999712e-02 4.620000000000000218e-01
4.874669999999999698e-02 5.027000000000000218e-02 4.570000000000000173e-01
-1.503329999999999987e-03 5.412000000000000144e-02 4.510000000000000120e-01
3.006669999999999916e-03 5.412000000000000144e-02 4.510000000000000120e-01
7.533330000000000408e-03 5.423999999999999655e-02 4.520000000000000129e-01
1.205329999999999943e-02 5.423999999999999655e-02 4.520000000000000129e-01
1.660999999999999976e-02 5.435999999999999860e-02 4.530000000000000138e-01
2.123330000000000009e-02 5.460000000000000270e-02 4.550000000000000155e-01
2.595329999999999859e-02 5.496000000000000191e-02 4.580000000000000182e-01
3.066670000000000160e-02 5.519999999999999907e-02 4.600000000000000200e-01
3.534330000000000110e-02 5.532000000000000112e-02 4.610000000000000209e-01
3.986669999999999797e-02 5.519999999999999907e-02 4.600000000000000200e-01
4.408000000000000113e-02 5.471999999999999781e-02 4.560000000000000164e-01
3.000000000000000062e-03 5.850000000000000339e-02 4.500000000000000111e-01
7.533330000000000408e-03 5.875999999999999973e-02 4.520000000000000129e-01
1.202669999999999954e-02 5.863000000000000156e-02 4.510000000000000120e-01
1.657329999999999914e-02 5.875999999999999973e-02 4.520000000000000129e-01
2.118669999999999928e-02 5.902000000000000302e-02 4.540000000000000147e-01
2.578329999999999858e-02 5.915000000000000119e-02 4.550000000000000155e-01
3.046669999999999934e-02 5.940999999999999753e-02 4.570000000000000173e-01
3.488329999999999903e-02 5.915000000000000119e-02 4.550000000000000155e-01
3.926000000000000323e-02 5.888999999999999790e-02 4.530000000000000138e-01
7.466669999999999904e-03 6.271999999999999797e-02 4.480000000000000093e-01
1.197329999999999922e-02 6.285999999999999921e-02 4.490000000000000102e-01
1.657329999999999914e-02 6.328000000000000291e-02 4.520000000000000129e-01
2.123330000000000009e-02 6.370000000000000662e-02 4.550000000000000155e-01
2.583999999999999839e-02 6.383999999999999397e-02 4.560000000000000164e-01
3.033330000000000054e-02 6.370000000000000662e-02 4.550000000000000155e-01
3.472999999999999698e-02 6.342000000000000415e-02 4.530000000000000138e-01
1.186670000000000086e-02 6.675000000000000377e-02 4.450000000000000067e-01
2.113999999999999907e-02 6.794999999999999651e-02 4.530000000000000138e-01
2.578329999999999858e-02 6.825000000000000511e-02 4.550000000000000155e-01
3.033330000000000054e-02 6.825000000000000511e-02 4.550000000000000155e-01
