[
    {"first_name":"Letta","category":"Tastiere","price":"€996,38"},
    {"first_name":"Charo","category":"Chitarre","price":"€907,60"},
    {"first_name":"Camila","category":"Metronomi","price":"€1971,25"},
    {"first_name":"Yoshi","category":"Sintetizzatori","price":"€569,80"},
    {"first_name":"Bjorn","category":"Strumenti a Fiato","price":"€1168,01"},
    {"first_name":"Kleon","category":"Bacchette","price":"€1973,06"},
    {"first_name":"Loren","category":"Rullanti","price":"€725,75"},
    {"first_name":"Fanchon","category":"Piatti","price":"€1758,48"},
    {"first_name":"Karl","category":"Tastiere","price":"€1180,39"},
    {"first_name":"Con","category":"Microfoni","price":"€1141,93"},
    {"first_name":"Zak","category":"Tastiere","price":"€1094,79"},
    {"first_name":"Charlotte","category":"Bassi Elettrici","price":"€1401,34"},
    {"first_name":"Lotte","category":"Mixer","price":"€1779,65"},
    {"first_name":"Lyndsey","category":"Plettri","price":"€1983,24"},
    {"first_name":"Joann","category":"Bassi Elettrici","price":"€1620,44"},
    {"first_name":"Genny","category":"Tastiere","price":"€762,10"},
    {"first_name":"Courtney","category":"Pedali Cassa","price":"€509,72"},
    {"first_name":"Dara","category":"Piatti","price":"€976,67"},
    {"first_name":"Carley","category":"Magliette","price":"€904,98"},
    {"first_name":"Coleen","category":"Pedali Cassa","price":"€1586,97"},
    {"first_name":"Leona","category":"Chitarre","price":"€639,61"},
    {"first_name":"Rouvin","category":"Pedali Cassa","price":"€1041,93"},
    {"first_name":"Chip","category":"Metronomi","price":"€1827,03"},
    {"first_name":"Nicky","category":"Pedali Chitarra","price":"€1979,60"},
    {"first_name":"Welbie","category":"Chitarre","price":"€1902,71"},
    {"first_name":"Tabbatha","category":"Pedali Basso","price":"€1852,81"},
    {"first_name":"Dick","category":"Tastiere","price":"€1348,92"},
    {"first_name":"Joellyn","category":"Mixer","price":"€986,75"},
    {"first_name":"Phillipp","category":"Pedali Cassa","price":"€1862,72"},
    {"first_name":"Halimeda","category":"Pedali Chitarra","price":"€1243,52"}
]